jakarta-cactus-dev mailing list archives

Site index · List index
Message view « Date » · « Thread »
Top « Date » · « Thread »
From Vincent Massol <vmas...@apache.org>
Subject [GUMP] Build Failure - jakarta-cactus-sample-servlet-13
Date Mon, 12 May 2003 09:40:01 GMT
----------------------------------------------------
This email is autogenerated from the output from:
<http://cvs.apache.org/builds/gump/2003-05-12/jakarta-cactus-sample-servlet-13.html>
----------------------------------------------------

Buildfile: samples/servlet/build.xml

init.display:
     [echo] ----- Cactus Servlet Sample 20030512 -----

     [echo] java.class.path = /home/rubys/jakarta/xml-commons/java/external/build/xml-apis.jar:/home/rubys/jakarta/xml-xerces2/java/build/xmlParserAPIs.jar:/home/rubys/jakarta/xml-xerces2/java/build/xercesImpl.jar:.:/usr/java/j2sdk1.4.1_02/lib/tools.jar:/usr/java/j2sdk1.4.1_02/jre/lib/rt.jar:/usr/java/j2sdk1.4.1_02/lib/tools.jar:/home/rubys/jakarta/ant/dist/lib/ant.jar:/home/rubys/jakarta/ant/dist/lib/ant-jmf.jar:/home/rubys/jakarta/ant/dist/lib/ant-junit.jar:/home/rubys/jakarta/ant/dist/lib/ant-stylebook.jar:/home/rubys/jakarta/ant/dist/lib/ant-swing.jar:/home/rubys/jakarta/ant/dist/lib/ant-trax.jar:/home/rubys/jakarta/ant/dist/lib/ant-xalan2.jar:/home/rubys/jakarta/ant/dist/lib/nodeps.jar:/home/rubys/jakarta/jakarta-tomcat-4.0/dist/bin/bootstrap.jar:/home/rubys/jakarta/jakarta-tomcat-4.0/dist/server/lib/catalina.jar:/home/rubys/jakarta/jakarta-tomcat-4.0/dist/server/lib/servlets-common.jar:/home/rubys/jakarta/jakarta-tomcat-4.0/dist/server/lib/servlets-default.jar:/home/rubys/jakarta/jakarta-tomcat-4.0/dist/server/lib/servlets-invoker.jar:/home/rubys/jakarta/jakarta-tomcat-4.0/dist/common/lib/naming-common.jar:/home/rubys/jakarta/jakarta-tomcat-4.0/dist/common/lib/naming-resources.jar:/home/rubys/jakarta/jakarta-tomcat-4.0/dist/common/lib/jasper-compiler.jar:/home/rubys/jakarta/jakarta-tomcat-4.0/dist/common/lib/jasper-runtime.jar:/opt/aspectj1.0/lib/aspectjtools.jar:/opt/aspectj1.0/lib/aspectjrt.jar:/opt/aspectj1.0/lib/aspectj-ant.jar:/home/rubys/jakarta/jakarta-cactus/integration/ant/dist-13/bin/cactus-integration-ant/lib/client/cactus-integration-ant-20030512.jar:/home/rubys/jakarta/jakarta-servletapi-4/lib/servlet.jar:/home/rubys/jakarta/jakarta-log4j/log4j-20030512.jar:/home/rubys/jakarta/jakarta-log4j/log4j-lf5-20030512.jar:/home/rubys/jakarta/jakarta-log4j/log4j-chainsaw-20030512.jar:/home/rubys/jakarta/jakarta-commons/logging/dist/commons-logging.jar:/home/rubys/jakarta/jakarta-commons/logging/dist/commons-logging-api.jar:/home/rubys/jakarta/jakarta-commons/httpclient/dist/commons-httpclient.jar:/home/rubys/jakarta/httpunit/lib/httpunit.jar:/home/rubys/jakarta/dist/junit/junit.jar:/home/rubys/jakarta/jakarta-taglibs/dist/standard/lib/jstl.jar:/home/rubys/jakarta/jakarta-taglibs/dist/standard/lib/standard.jar:/home/rubys/jakarta/jakarta-cactus/framework/dist-13/lib/cactus-framework.jar:/home/rubys/jakarta/jakarta-cactus/anttasks/dist/lib/cactus-anttasks.jar:/home/rubys/jakarta/jakarta-commons/collections/dist/commons-collections.jar:/home/rubys/jakarta/jakarta-commons/beanutils/dist/commons-beanutils.jar:/opt/jsse1.0.3/lib/jsse.jar:/opt/jsse1.0.3/lib/jnet.jar:/opt/jsse1.0.3/lib/jcert.jar:/home/rubys/jakarta/jakarta-commons/digester/dist/commons-digester.jar:/home/rubys/jakarta/jakarta-tomcat-connectors/util/build/lib/tomcat-util.jar:/home/rubys/jakarta/jakarta-cactus/samples/servlet/target-13/sample/target/classes/java:/home/rubys/jakarta/jakarta-cactus/samples/servlet/target-13/sample/target/cactus/classes:/home/rubys/jakarta/jakarta-cactus/samples/servlet/target-13/sample/target/conf/client"

     [echo] java.home = /usr/java/j2sdk1.4.1_02/jre
     [echo] user.home = /home/rubys
     [echo] ant.home = ${ant.home}


init.j2ee.dependent:

init.j2ee.find:
     [echo] j2ee.api = 13

init.j2ee:

init.properties.target.j2ee:

init.properties.target.noj2ee:

init.properties.target:

init.properties.dist.j2ee:

init.properties.dist.noj2ee:

init.properties.dist:

init.properties.release.j2ee:

init.properties.release.noj2ee:

init.properties.release:

init.properties.artifact:

init.properties:

init.common:

properties:

check.properties:
[checkProperty] j2ee.jar = [/home/rubys/jakarta/jakarta-servletapi-4/lib/servlet.jar]
[checkProperty] jstl.jar = [/home/rubys/jakarta/jakarta-taglibs/dist/standard/lib/jstl.jar]
[checkProperty] standard.jar = [/home/rubys/jakarta/jakarta-taglibs/dist/standard/lib/standard.jar]

init:
     [echo] cactus.port (optional) = 8082
     [echo] clover.enable (optional) = ${clover.enable}

init.checkstyle.check:

init.checkstyle:

checkstyle:

sample.main:
    [mkdir] Created dir: /home/rubys/jakarta/jakarta-cactus/samples/servlet/target-13/sample/lib
    [mkdir] Created dir: /home/rubys/jakarta/jakarta-cactus/samples/servlet/target-13/sample/build
    [mkdir] Created dir: /home/rubys/jakarta/jakarta-cactus/samples/servlet/target-13/sample/src/java
    [mkdir] Created dir: /home/rubys/jakarta/jakarta-cactus/samples/servlet/target-13/sample/src/test-cactus
    [mkdir] Created dir: /home/rubys/jakarta/jakarta-cactus/samples/servlet/target-13/sample/src/webapp
    [mkdir] Created dir: /home/rubys/jakarta/jakarta-cactus/samples/servlet/target-13/sample/build/cactus-integration-ant
     [copy] Copying 55 files to /home/rubys/jakarta/jakarta-cactus/samples/servlet/target-13/sample/build/cactus-integration-ant
     [copy] Copying 7 files to /home/rubys/jakarta/jakarta-cactus/samples/servlet/target-13/sample/src/java
     [copy] Copying 30 files to /home/rubys/jakarta/jakarta-cactus/samples/servlet/target-13/sample/src/test-cactus
     [copy] Copying 2 files to /home/rubys/jakarta/jakarta-cactus/samples/servlet/target-13/sample
     [copy] Replacing: @version@ -> 20030512
     [copy] Replacing: @year@ -> 2000-2003
     [copy] Replacing: @servlet.jar.name@ -> servlet.jar
     [copy] Replacing: @jstl.jar.name@ -> jstl.jar
     [copy] Replacing: @standard.jar.name@ -> standard.jar
     [copy] Copying 3 files to /home/rubys/jakarta/jakarta-cactus/samples/servlet/target-13/sample/src/webapp
     [copy] Copying 1 file to /home/rubys/jakarta/jakarta-cactus/samples/servlet/target-13/sample/lib
     [copy] Copying 1 file to /home/rubys/jakarta/jakarta-cactus/samples/servlet/target-13/sample/lib
     [copy] Copying 1 file to /home/rubys/jakarta/jakarta-cactus/samples/servlet/target-13/sample/lib
     [copy] Copying 1 file to /home/rubys/jakarta/jakarta-cactus/samples/servlet/target-13/sample

sample.replace:

sample.replace.13:

sample.clover:

sample.noclover:

sample:

prepare.dist:
    [mkdir] Created dir: /home/rubys/jakarta/jakarta-cactus/samples/servlet/dist-13/bin
     [copy] Copying 101 files to /home/rubys/jakarta/jakarta-cactus/samples/servlet/dist-13/bin/cactus-sample-servlet
     [copy] Copied 6 empty directories to /home/rubys/jakarta/jakarta-cactus/samples/servlet/dist-13/bin/cactus-sample-servlet

test.prepare.clover:

test.prepare.noclover:

test:
     [java] Buildfile: samples/servlet/target-13/sample/build.xml

     [java] display.properties:
     [java]      [echo] ----- Cactus Servlet Sample 20030512 -----

     [java]      [echo] java.class.path = /home/rubys/jakarta/xml-commons/java/external/build/xml-apis.jar:/home/rubys/jakarta/xml-xerces2/java/build/xmlParserAPIs.jar:/home/rubys/jakarta/xml-xerces2/java/build/xercesImpl.jar:/home/rubys/jakarta/jakarta-cactus:/usr/java/j2sdk1.4.1_02/lib/tools.jar:/usr/java/j2sdk1.4.1_02/jre/lib/rt.jar:/home/rubys/jakarta/ant/dist/lib/ant.jar:/home/rubys/jakarta/ant/dist/lib/ant-jmf.jar:/home/rubys/jakarta/ant/dist/lib/ant-junit.jar:/home/rubys/jakarta/ant/dist/lib/ant-stylebook.jar:/home/rubys/jakarta/ant/dist/lib/ant-swing.jar:/home/rubys/jakarta/ant/dist/lib/ant-trax.jar:/home/rubys/jakarta/ant/dist/lib/ant-xalan2.jar:/home/rubys/jakarta/ant/dist/lib/nodeps.jar:/home/rubys/jakarta/jakarta-tomcat-4.0/dist/bin/bootstrap.jar:/home/rubys/jakarta/jakarta-tomcat-4.0/dist/server/lib/catalina.jar:/home/rubys/jakarta/jakarta-tomcat-4.0/dist/server/lib/servlets-common.jar:/home/rubys/jakarta/jakarta-tomcat-4.0/dist/server/lib/servlets-default.jar:/home/rubys/jakarta/jakarta-tomcat-4.0/dist/server/lib/servlets-invoker.jar:/home/rubys/jakarta/jakarta-tomcat-4.0/dist/common/lib/naming-common.jar:/home/rubys/jakarta/jakarta-tomcat-4.0/dist/common/lib/naming-resources.jar:/home/rubys/jakarta/jakarta-tomcat-4.0/dist/common/lib/jasper-compiler.jar:/home/rubys/jakarta/jakarta-tomcat-4.0/dist/common/lib/jasper-runtime.jar:/opt/aspectj1.0/lib/aspectjtools.jar:/opt/aspectj1.0/lib/aspectjrt.jar:/opt/aspectj1.0/lib/aspectj-ant.jar:/home/rubys/jakarta/jakarta-cactus/integration/ant/dist-13/bin/cactus-integration-ant/lib/client/cactus-integration-ant-20030512.jar:/home/rubys/jakarta/jakarta-servletapi-4/lib/servlet.jar:/home/rubys/jakarta/jakarta-log4j/log4j-20030512.jar:/home/rubys/jakarta/jakarta-log4j/log4j-lf5-20030512.jar:/home/rubys/jakarta/jakarta-log4j/log4j-chainsaw-20030512.jar:/home/rubys/jakarta/jakarta-commons/logging/dist/commons-logging.jar:/home/rubys/jakarta/jakarta-commons/logging/dist/commons-logging-api.jar:/home/rubys/jakarta/jakarta-commons/httpclient/dist/commons-httpclient.jar:/home/rubys/jakarta/httpunit/lib/httpunit.jar:/home/rubys/jakarta/dist/junit/junit.jar:/home/rubys/jakarta/jakarta-taglibs/dist/standard/lib/jstl.jar:/home/rubys/jakarta/jakarta-taglibs/dist/standard/lib/standard.jar:/home/rubys/jakarta/jakarta-cactus/framework/dist-13/lib/cactus-framework.jar:/home/rubys/jakarta/jakarta-cactus/anttasks/dist/lib/cactus-anttasks.jar:/home/rubys/jakarta/jakarta-commons/collections/dist/commons-collections.jar:/home/rubys/jakarta/jakarta-commons/beanutils/dist/commons-beanutils.jar:/opt/jsse1.0.3/lib/jsse.jar:/opt/jsse1.0.3/lib/jnet.jar:/opt/jsse1.0.3/lib/jcert.jar:/home/rubys/jakarta/jakarta-commons/digester/dist/commons-digester.jar:/home/rubys/jakarta/jakarta-tomcat-connectors/util/build/lib/tomcat-util.jar:/home/rubys/jakarta/jakarta-cactus/samples/servlet/target-13/sample/target/classes/java:/home/rubys/jakarta/jakarta-cactus/samples/servlet/target-13/sample/target/cactus/classes:/home/rubys/jakarta/jakarta-cactus/samples/servlet/target-13/sample/target/conf/client

     [java]      [echo] java.home = /usr/java/j2sdk1.4.1_02/jre
     [java]      [echo] user.home = /home/rubys
     [java]      [echo] ant.home = ${ant.home}

     [java]      [echo] servlet.jar = /home/rubys/jakarta/jakarta-servletapi-4/lib/servlet.jar
     [java]      [echo] jstl.jar = /home/rubys/jakarta/jakarta-taglibs/dist/standard/lib/jstl.jar
     [java]      [echo] standard.jar = /home/rubys/jakarta/jakarta-taglibs/dist/standard/lib/standard.jar

     [java]      [echo] cactus.port (optional) = 8082


     [java] check.properties:

     [java] init:

     [java] compile.java:
     [java]     [javac] Compiling 7 source files to /home/rubys/jakarta/jakarta-cactus/samples/servlet/target-13/sample/target/classes/java

     [java] compile.cactus:

     [java] cactus.compile:
     [java]     [javac] Compiling 30 source files to /home/rubys/jakarta/jakarta-cactus/samples/servlet/target-13/sample/target/cactus/classes
     [java]     [javac] Note: /home/rubys/jakarta/jakarta-cactus/samples/servlet/target-13/sample/src/test-cactus/org/apache/cactus/sample/TestSampleServlet.java
uses or overrides a deprecated API.
     [java]     [javac] Note: Recompile with -deprecation for details.

     [java] compile:

     [java] war:
     [java]       [war] Building war: /home/rubys/jakarta/jakarta-cactus/samples/servlet/target-13/sample/target/sample-servlet.war

     [java] test:

     [java] cactus.init:

     [java] cactus.check.tomcat4x:

     [java] cactus.setup.tomcat4x:
     [java]     [mkdir] Created dir: /home/rubys/jakarta/jakarta-cactus/samples/servlet/target-13/sample/target/cactus/tomcat4x/conf
     [java]     [mkdir] Created dir: /home/rubys/jakarta/jakarta-cactus/samples/servlet/target-13/sample/target/cactus/tomcat4x/work
     [java]     [mkdir] Created dir: /home/rubys/jakarta/jakarta-cactus/samples/servlet/target-13/sample/target/cactus/tomcat4x/webapps
     [java]      [copy] Copying 2 files to /home/rubys/jakarta/jakarta-cactus/samples/servlet/target-13/sample/target/cactus/tomcat4x/conf
     [java]      [copy] Replacing: @cactus.port@ -> 8082
     [java]      [copy] Copying 1 file to /home/rubys/jakarta/jakarta-cactus/samples/servlet/target-13/sample/target/cactus/tomcat4x/conf

     [java] cactus.war:
     [java]     [unwar] Expanding: /home/rubys/jakarta/jakarta-cactus/samples/servlet/target-13/sample/target/sample-servlet.war
into /home/rubys/jakarta/jakarta-cactus/samples/servlet/target-13/sample/target/cactus/cactustest

     [java] cactus.war.merge.check:

     [java] cactus.war.merge.yes:
     [java] [webxmlmerge] Merged 1 filter definition into the descriptor
     [java] [webxmlmerge] Merged 2 servlet definitions into the descriptor
     [java]      [move] Moving 1 files to /home/rubys/jakarta/jakarta-cactus/samples/servlet/target-13/sample/target/cactus/cactustest/WEB-INF

     [java] cactus.war.merge.no:

     [java] cactus.war.merge:
     [java]      [copy] Copying 1 file to /home/rubys/jakarta/jakarta-cactus/samples/servlet/target-13/sample/target/cactus/cactustest/WEB-INF/classes

     [java] cactus.compile:

     [java] cactus.copyclasses:
     [java]      [copy] Copying 34 files to /home/rubys/jakarta/jakarta-cactus/samples/servlet/target-13/sample/target/cactus/cactustest/WEB-INF/classes
     [java]      [copy] Copying 1 file to /home/rubys/jakarta/jakarta-cactus/samples/servlet/target-13/sample/target/cactus/cactustest/WEB-INF/lib
     [java]      [copy] Copying 1 file to /home/rubys/jakarta/jakarta-cactus/samples/servlet/target-13/sample/target/cactus/cactustest/WEB-INF/lib
     [java]      [copy] Copying 1 file to /home/rubys/jakarta/jakarta-cactus/samples/servlet/target-13/sample/target/cactus/cactustest/WEB-INF/lib
     [java]      [copy] Copying 1 file to /home/rubys/jakarta/jakarta-cactus/samples/servlet/target-13/sample/target/cactus/cactustest/WEB-INF/lib
     [java]      [copy] Copying 1 file to /home/rubys/jakarta/jakarta-cactus/samples/servlet/target-13/sample/target/cactus/cactustest/WEB-INF/lib
     [java]      [copy] Copying 1 file to /home/rubys/jakarta/jakarta-cactus/samples/servlet/target-13/sample/target/cactus/cactustest/WEB-INF/lib
     [java]      [copy] Copying 1 file to /home/rubys/jakarta/jakarta-cactus/samples/servlet/target-13/sample/target/cactus/cactustest

     [java] cactus.deploy.tomcat4x:
     [java]      [copy] Copying 55 files to /home/rubys/jakarta/jakarta-cactus/samples/servlet/target-13/sample/target/cactus/tomcat4x/webapps/cactustest

     [java] cactus.run.tomcat4x:

     [java] cactus.runservertests.task.tomcat4x:

     [java] cactus.runservertests.target.tomcat4x:

     [java] cactus.check.tomcat4x:

     [java] cactus.start.tomcat4x:
     [java]      [java] log4j:WARN No appenders could be found for logger (org.apache.commons.digester.Digester).
     [java]      [java] log4j:WARN Please initialize the log4j system properly.
     [java]      [java] HttpConnector Opening server socket on all host IP addresses
     [java]      [java] Starting service Tomcat-Standalone
     [java]      [java] Apache Tomcat/${version}
     [java]      [java] HostConfig[localhost]: Deploying web application directory cactustest
     [java]      [java] StandardHost[localhost]: Installing web application at context path
/cactustest from URL file:/home/rubys/jakarta/jakarta-cactus/samples/servlet/target-13/sample/target/cactus/tomcat4x/webapps/cactustest
     [java]      [java] WebappLoader[/cactustest]: Deploying class repositories to work directory
/home/rubys/jakarta/jakarta-cactus/samples/servlet/target-13/sample/target/cactus/tomcat4x/work/Standalone/localhost/cactustest
     [java]      [java] WebappLoader[/cactustest]: Deploy class files /WEB-INF/classes to
/home/rubys/jakarta/jakarta-cactus/samples/servlet/target-13/sample/target/cactus/tomcat4x/webapps/cactustest/WEB-INF/classes
     [java]      [java] WebappLoader[/cactustest]: Deploy JAR /WEB-INF/lib/aspectjrt.jar to
/home/rubys/jakarta/jakarta-cactus/samples/servlet/target-13/sample/target/cactus/tomcat4x/webapps/cactustest/WEB-INF/lib/aspectjrt.jar
     [java]      [java] WebappLoader[/cactustest]: Deploy JAR /WEB-INF/lib/cactus-framework-20030512.jar
to /home/rubys/jakarta/jakarta-cactus/samples/servlet/target-13/sample/target/cactus/tomcat4x/webapps/cactustest/WEB-INF/lib/cactus-framework-20030512.jar
     [java]      [java] WebappLoader[/cactustest]: Deploy JAR /WEB-INF/lib/commons-logging.jar
to /home/rubys/jakarta/jakarta-cactus/samples/servlet/target-13/sample/target/cactus/tomcat4x/webapps/cactustest/WEB-INF/lib/commons-logging.jar
     [java]      [java] WebappLoader[/cactustest]: Deploy JAR /WEB-INF/lib/httpunit.jar to
/home/rubys/jakarta/jakarta-cactus/samples/servlet/target-13/sample/target/cactus/tomcat4x/webapps/cactustest/WEB-INF/lib/httpunit.jar
     [java]      [java] WebappLoader[/cactustest]: Deploy JAR /WEB-INF/lib/jstl.jar to /home/rubys/jakarta/jakarta-cactus/samples/servlet/target-13/sample/target/cactus/tomcat4x/webapps/cactustest/WEB-INF/lib/jstl.jar
     [java]      [java] WebappLoader[/cactustest]: Deploy JAR /WEB-INF/lib/junit.jar to /home/rubys/jakarta/jakarta-cactus/samples/servlet/target-13/sample/target/cactus/tomcat4x/webapps/cactustest/WEB-INF/lib/junit.jar
     [java]      [java] WebappLoader[/cactustest]: Deploy JAR /WEB-INF/lib/log4j-20030512.jar
to /home/rubys/jakarta/jakarta-cactus/samples/servlet/target-13/sample/target/cactus/tomcat4x/webapps/cactustest/WEB-INF/lib/log4j-20030512.jar
     [java]      [java] WebappLoader[/cactustest]: Deploy JAR /WEB-INF/lib/servlet.jar to
/home/rubys/jakarta/jakarta-cactus/samples/servlet/target-13/sample/target/cactus/tomcat4x/webapps/cactustest/WEB-INF/lib/servlet.jar
     [java]      [java] WebappClassLoader: validateJarFile(/home/rubys/jakarta/jakarta-cactus/samples/servlet/target-13/sample/target/cactus/tomcat4x/webapps/cactustest/WEB-INF/lib/servlet.jar)
- jar not loaded. See Servlet Spec 2.3, section 9.7.2. Offending class: javax/servlet/Servlet.class
     [java]      [java] WebappLoader[/cactustest]: Deploy JAR /WEB-INF/lib/standard.jar to
/home/rubys/jakarta/jakarta-cactus/samples/servlet/target-13/sample/target/cactus/tomcat4x/webapps/cactustest/WEB-INF/lib/standard.jar
     [java]      [java] ContextConfig[/cactustest]: Configured an authenticator for method
BASIC
     [java]      [java] StandardManager[/cactustest]: Seeding random number generator class
java.security.SecureRandom
     [java]      [java] StandardManager[/cactustest]: Seeding of random number generator has
been completed
     [java]      [java] StandardWrapper[/cactustest:default]: Loading container servlet default
     [java]      [java] StandardWrapper[/cactustest:invoker]: Loading container servlet invoker
     [java]      [java] HttpConnector[8082] Starting background thread

     [java] cactus.test:
     [java]      [copy] Copying 1 file to /home/rubys/jakarta/jakarta-cactus/samples/servlet/target-13/sample/target/cactus/conf
     [java]     [mkdir] Created dir: /home/rubys/jakarta/jakarta-cactus/samples/servlet/target-13/sample/target/cactus/test-cactus-reports

     [java] cactus.test.text:
     [java]     [junit] Running org.apache.cactus.sample.TestAll
     [java]     [junit] log4j:WARN No appenders could be found for logger (org.apache.cactus.ServletTestSuite).
     [java]     [junit] log4j:WARN Please initialize the log4j system properly.
     [java]      [java] HttpConnector[8082] No processor available, rejecting this connection
     [java]      [java] HttpConnector[8082] No processor available, rejecting this connection
     [java]      [java] HttpConnector[8082] No processor available, rejecting this connection
     [java]      [java] HttpConnector[8082] No processor available, rejecting this connection
     [java]     [junit] Tests run: 101, Failures: 0, Errors: 4, Time elapsed: 51.432 sec
     [java]     [junit] Testsuite: org.apache.cactus.sample.TestAll
     [java]     [junit] Tests run: 101, Failures: 0, Errors: 4, Time elapsed: 51.432 sec
     [java]     [junit] ------------- Standard Error -----------------
     [java]     [junit] Unable to find scripting engine factory class com.meterware.httpunit.javascript.JavaScriptEngineFactory
     [java]     [junit] java.lang.ClassNotFoundException: com.meterware.httpunit.javascript.JavaScriptEngineFactory
     [java]     [junit] JavaScript execution disabled
     [java]     [junit] ------------- ---------------- ---------------

     [java]     [junit] Testcase: testLongProcess took 3.708 sec
     [java]     [junit] Testcase: testLotsOfData took 39.26 sec
     [java]     [junit] Testcase: testGlobalBeginEnd took 0.146 sec
     [java]     [junit] Testcase: testAssertionFailedError took 0.074 sec
     [java]     [junit] Testcase: testExceptionNotSerializable took 0.106 sec
     [java]     [junit] Testcase: testExceptionSerializable took 0.062 sec
     [java]     [junit] Testcase: testComparisonFailure took 0.026 sec
     [java]     [junit] Testcase: testSetUp took 0.038 sec
     [java]     [junit] Testcase: testTearDown took 0.023 sec
     [java]     [junit] Testcase: testSimulatedURLBasics took 0.048 sec
     [java]     [junit] Testcase: testSimulatedURL1 took 0.03 sec
     [java]     [junit] Testcase: testSimulatedURL2 took 0.038 sec
     [java]     [junit] Testcase: testSimulatedURL3 took 0.033 sec
     [java]     [junit] Testcase: testSimulatedURL4 took 0.044 sec
     [java]     [junit] Testcase: testSimulatedURL5 took 0.039 sec
     [java]     [junit] Testcase: testTearDown took 0.035 sec
     [java]     [junit] Testcase: testBasicAuthentication took 0.044 sec
     [java]     [junit] Testcase: testHttpUnitGetText took 0.161 sec
     [java]     [junit] Testcase: testResponseAddHeadersHttpUnit took 0.042 sec
     [java]     [junit] Testcase: testRedirectorOverride1 took 0.031 sec
     [java]     [junit] Testcase: testRedirectorOverride2 took 0.03 sec
     [java]     [junit] Testcase: testRedirectorOverride3 took 0.031 sec
     [java]     [junit] Testcase: testMultiValueParameters took 0.05 sec
     [java]     [junit] Testcase: testSeveralParameters took 0.096 sec
     [java]     [junit] Testcase: testNoAutomaticSessionCreation took 0.035 sec
     [java]     [junit] Testcase: testVerifyJsessionid took 0.043 sec
     [java]     [junit] Testcase: testCreateSessionCookie took 0.037 sec
     [java]     [junit] Testcase: testWriteOutputStream took 0.041 sec
     [java]     [junit] Testcase: testGetResponseAsStringMultiLines took 0.034 sec
     [java]     [junit] Testcase: testGetResponseAsStringArrayMultiLines took 0.028 sec
     [java]     [junit] Testcase: testGetReader took 0.032 sec
     [java]     [junit] Testcase: testSetContentType took 0.026 sec
     [java]     [junit] Testcase: testRedirect took 0.044 sec
     [java]     [junit] Testcase: testStatusCode took 0.034 sec
     [java]     [junit] Testcase: testCookieEncoding took 0.031 sec
     [java]     [junit] Testcase: testGetRequestDispatcherFromNamedDispatcherOK took 2.373
sec
     [java]     [junit] Testcase: testGetRequestDispatcherFromNamedDispatcherInvalid took
0.024 sec
     [java]     [junit] Testcase: testGetRequestDispatcherFromRequest1 took 0.058 sec
     [java]     [junit] Testcase: testGetRequestDispatcherFromRequest2 took 0.038 sec
     [java]     [junit] Testcase: testSendMultivaluedHeader took 0.11 sec
     [java]     [junit] Testcase: testSetContentTypeHeader took 0.034 sec
     [java]     [junit] Testcase: testResponseAddHeaders took 0.027 sec
     [java]     [junit] Testcase: testGetPathTranslated took 0.059 sec
     [java]     [junit] Testcase: testSendUserData took 0.028 sec
     [java]     [junit] Testcase: testRemoteClientCheck took 0.027 sec
     [java]     [junit] Testcase: testSetConfigParameter took 0.031 sec
     [java]     [junit] Testcase: testGetServletName took 0.024 sec
     [java]     [junit] Testcase: testGetLogs took 0.028 sec
     [java]     [junit] Testcase: testXXX took 0.027 sec
     [java]     [junit] Testcase: testOut took 1.724 sec
     [java]     [junit] Testcase: testGetParameterMap took 0.035 sec
     [java]     [junit] Testcase: testRequestURL took 0.024 sec
     [java]     [junit] Testcase: testConstructorWithNullPageContext took 0.103 sec
     [java]     [junit] Testcase: testConstructorWithNullTag took 0.026 sec
     [java]     [junit] Testcase: testAddInterceptorWithNull took 0.027 sec
     [java]     [junit] Testcase: testAddNestedTagWithNull took 0.027 sec
     [java]     [junit] Testcase: testAddNestedTextWithNull took 0.025 sec
     [java]     [junit] Testcase: testAssertScopedVariableExposedWithNullName took 0.025 sec
     [java]     [junit] Testcase: testAssertScopedVariableExposedWithNullExpectedValues took
0.023 sec
     [java]     [junit] Testcase: testAssertScopedVariableExposedWithEmptyExpectedValues took
0.028 sec
     [java]     [junit] Testcase: testAssertScopedVariableExposedWithIllegalScope took 0.021
sec
     [java]     [junit] Testcase: testOutTag took 0.022 sec
     [java]     [junit] 	Caused an ERROR
     [java]     [junit] java.net.SocketException: Connection reset
     [java]     [junit] org.apache.commons.httpclient.HttpRecoverableException: java.net.SocketException:
Connection reset
     [java]     [junit] 	at org.apache.commons.httpclient.HttpMethodBase.readResponse(HttpMethodBase.java:1893)
     [java]     [junit] 	at org.apache.commons.httpclient.HttpMethodBase.processRequest(HttpMethodBase.java:2494)
     [java]     [junit] 	at org.apache.commons.httpclient.HttpMethodBase.execute(HttpMethodBase.java:1059)
     [java]     [junit] 	at org.apache.commons.httpclient.HttpClient.executeMethod(HttpClient.java:638)
     [java]     [junit] 	at org.apache.commons.httpclient.HttpClient.executeMethod(HttpClient.java:526)
     [java]     [junit] 	at org.apache.cactus.client.connector.http.HttpClientConnectionHelper.connect$ajcPostAround9(HttpClientConnectionHelper.java;org/apache/cactus/util/log/LogAspect.aj(1k):176)
     [java]     [junit] 	at org.apache.cactus.client.connector.http.HttpClientConnectionHelper.connect(HttpClientConnectionHelper.java;org/apache/cactus/util/log/LogAspect.aj(1k):1222)
     [java]     [junit] 	at org.apache.cactus.client.connector.http.DefaultHttpClient.callRunTest(DefaultHttpClient.java;org/apache/cactus/util/log/LogAspect.aj(1k):202)
     [java]     [junit] 	at org.apache.cactus.client.connector.http.DefaultHttpClient.doTest$ajcPostAround7(DefaultHttpClient.java;org/apache/cactus/util/log/LogAspect.aj(1k):119)
     [java]     [junit] 	at org.apache.cactus.client.connector.http.DefaultHttpClient.doTest(DefaultHttpClient.java;org/apache/cactus/util/log/LogAspect.aj(1k):1222)
     [java]     [junit] 	at org.apache.cactus.AbstractWebServerTestCase.runWebTest(AbstractWebServerTestCase.java:272)
     [java]     [junit] 	at org.apache.cactus.AbstractWebServerTestCase.runGenericTest(AbstractWebServerTestCase.java:214)
     [java]     [junit] 	at org.apache.cactus.AbstractWebServerTestCase.runTest(AbstractWebServerTestCase.java:287)
     [java]     [junit] 	at org.apache.cactus.AbstractClientTestCase.runBare(AbstractClientTestCase.java:289)

     [java]     [junit] Testcase: testOutTagTestcase: testOutTagEscapeXml took 0.167 sec
     [java]     [junit] Testcase: testOutTagNoEscapeXml took 0.008 sec
     [java]     [junit] 	Caused an ERROR
     [java]     [junit] java.net.SocketException: Connection reset
     [java]     [junit] org.apache.commons.httpclient.HttpRecoverableException: java.net.SocketException:
Connection reset
     [java]     [junit] 	at org.apache.commons.httpclient.HttpMethodBase.readResponse(HttpMethodBase.java:1893)
     [java]     [junit] 	at org.apache.commons.httpclient.HttpMethodBase.processRequest(HttpMethodBase.java:2494)
     [java]     [junit] 	at org.apache.commons.httpclient.HttpMethodBase.execute(HttpMethodBase.java:1059)
     [java]     [junit] 	at org.apache.commons.httpclient.HttpClient.executeMethod(HttpClient.java:638)
     [java]     [junit] 	at org.apache.commons.httpclient.HttpClient.executeMethod(HttpClient.java:526)
     [java]     [junit] 	at org.apache.cactus.client.connector.http.HttpClientConnectionHelper.connect$ajcPostAround9(HttpClientConnectionHelper.java;org/apache/cactus/util/log/LogAspect.aj(1k):176)
     [java]     [junit] 	at org.apache.cactus.client.connector.http.HttpClientConnectionHelper.connect(HttpClientConnectionHelper.java;org/apache/cactus/util/log/LogAspect.aj(1k):1222)
     [java]     [junit] 	at org.apache.cactus.client.connector.http.DefaultHttpClient.callRunTest(DefaultHttpClient.java;org/apache/cactus/util/log/LogAspect.aj(1k):202)
     [java]     [junit] 	at org.apache.cactus.client.connector.http.DefaultHttpClient.doTest$ajcPostAround7(DefaultHttpClient.java;org/apache/cactus/util/log/LogAspect.aj(1k):119)
     [java]     [junit] 	at org.apache.cactus.client.connector.http.DefaultHttpClient.doTest(DefaultHttpClient.java;org/apache/cactus/util/log/LogAspect.aj(1k):1222)
     [java]     [junit] 	at org.apache.cactus.AbstractWebServerTestCase.runWebTest(AbstractWebServerTestCase.java:272)
     [java]     [junit] 	at org.apache.cactus.AbstractWebServerTestCase.runGenericTest(AbstractWebServerTestCase.java:214)
     [java]     [junit] 	at org.apache.cactus.AbstractWebServerTestCase.runTest(AbstractWebServerTestCase.java:287)
     [java]     [junit] 	at org.apache.cactus.AbstractClientTestCase.runBare(AbstractClientTestCase.java:289)

     [java]     [junit] Testcase: testOutTagNoEscapeXmlTestcase: testOutTagDefaultAttribute
took 0.027 sec
     [java]     [junit] 	Caused an ERROR
     [java]     [junit] java.net.SocketException: Connection reset
     [java]     [junit] org.apache.commons.httpclient.HttpRecoverableException: java.net.SocketException:
Connection reset
     [java]     [junit] 	at org.apache.commons.httpclient.HttpMethodBase.readResponse(HttpMethodBase.java:1893)
     [java]     [junit] 	at org.apache.commons.httpclient.HttpMethodBase.processRequest(HttpMethodBase.java:2494)
     [java]     [junit] 	at org.apache.commons.httpclient.HttpMethodBase.execute(HttpMethodBase.java:1059)
     [java]     [junit] 	at org.apache.commons.httpclient.HttpClient.executeMethod(HttpClient.java:638)
     [java]     [junit] 	at org.apache.commons.httpclient.HttpClient.executeMethod(HttpClient.java:526)
     [java]     [junit] 	at org.apache.cactus.client.connector.http.HttpClientConnectionHelper.connect$ajcPostAround9(HttpClientConnectionHelper.java;org/apache/cactus/util/log/LogAspect.aj(1k):176)
     [java]     [junit] 	at org.apache.cactus.client.connector.http.HttpClientConnectionHelper.connect(HttpClientConnectionHelper.java;org/apache/cactus/util/log/LogAspect.aj(1k):1222)
     [java]     [junit] 	at org.apache.cactus.client.connector.http.DefaultHttpClient.callGetResult(DefaultHttpClient.java;org/apache/cactus/util/log/LogAspect.aj(1k):249)
     [java]     [junit] 	at org.apache.cactus.client.connector.http.DefaultHttpClient.doTest$ajcPostAround7(DefaultHttpClient.java;org/apache/cactus/util/log/LogAspect.aj(1k):126)
     [java]     [junit] 	at org.apache.cactus.client.connector.http.DefaultHttpClient.doTest(DefaultHttpClient.java;org/apache/cactus/util/log/LogAspect.aj(1k):1222)
     [java]     [junit] 	at org.apache.cactus.AbstractWebServerTestCase.runWebTest(AbstractWebServerTestCase.java:272)
     [java]     [junit] 	at org.apache.cactus.AbstractWebServerTestCase.runGenericTest(AbstractWebServerTestCase.java:214)
     [java]     [junit] 	at org.apache.cactus.AbstractWebServerTestCase.runTest(AbstractWebServerTestCase.java:287)
     [java]     [junit] 	at org.apache.cactus.AbstractClientTestCase.runBare(AbstractClientTestCase.java:289)

     [java]     [junit] Testcase: testOutTagDefaultAttributeTestcase: testOutTagDefaultAttributeIgnored
took 0.007 sec
     [java]     [junit] 	Caused an ERROR
     [java]     [junit] java.net.SocketException: Connection reset
     [java]     [junit] org.apache.commons.httpclient.HttpRecoverableException: java.net.SocketException:
Connection reset
     [java]     [junit] 	at org.apache.commons.httpclient.HttpMethodBase.readResponse(HttpMethodBase.java:1893)
     [java]     [junit] 	at org.apache.commons.httpclient.HttpMethodBase.processRequest(HttpMethodBase.java:2494)
     [java]     [junit] 	at org.apache.commons.httpclient.HttpMethodBase.execute(HttpMethodBase.java:1059)
     [java]     [junit] 	at org.apache.commons.httpclient.HttpClient.executeMethod(HttpClient.java:638)
     [java]     [junit] 	at org.apache.commons.httpclient.HttpClient.executeMethod(HttpClient.java:526)
     [java]     [junit] 	at org.apache.cactus.client.connector.http.HttpClientConnectionHelper.connect$ajcPostAround9(HttpClientConnectionHelper.java;org/apache/cactus/util/log/LogAspect.aj(1k):176)
     [java]     [junit] 	at org.apache.cactus.client.connector.http.HttpClientConnectionHelper.connect(HttpClientConnectionHelper.java;org/apache/cactus/util/log/LogAspect.aj(1k):1222)
     [java]     [junit] 	at org.apache.cactus.client.connector.http.DefaultHttpClient.callRunTest(DefaultHttpClient.java;org/apache/cactus/util/log/LogAspect.aj(1k):202)
     [java]     [junit] 	at org.apache.cactus.client.connector.http.DefaultHttpClient.doTest$ajcPostAround7(DefaultHttpClient.java;org/apache/cactus/util/log/LogAspect.aj(1k):119)
     [java]     [junit] 	at org.apache.cactus.client.connector.http.DefaultHttpClient.doTest(DefaultHttpClient.java;org/apache/cactus/util/log/LogAspect.aj(1k):1222)
     [java]     [junit] 	at org.apache.cactus.AbstractWebServerTestCase.runWebTest(AbstractWebServerTestCase.java:272)
     [java]     [junit] 	at org.apache.cactus.AbstractWebServerTestCase.runGenericTest(AbstractWebServerTestCase.java:214)
     [java]     [junit] 	at org.apache.cactus.AbstractWebServerTestCase.runTest(AbstractWebServerTestCase.java:287)
     [java]     [junit] 	at org.apache.cactus.AbstractClientTestCase.runBare(AbstractClientTestCase.java:289)

     [java]     [junit] Testcase: testOutTagDefaultAttributeIgnoredTestcase: testOutTagDefaultBody
took 0.029 sec
     [java]     [junit] Testcase: testOutTagDefaultBodyIgnored took 0.113 sec
     [java]     [junit] Testcase: testSetTag took 0.036 sec
     [java]     [junit] Testcase: testForEachTag took 0.055 sec
     [java]     [junit] Testcase: testForEachTagStatus took 0.038 sec
     [java]     [junit] Testcase: testIfTagTrue took 0.036 sec
     [java]     [junit] Testcase: testIfTagFalse took 0.027 sec
     [java]     [junit] Testcase: testWhenTag took 0.035 sec
     [java]     [junit] Testcase: testWhenTagNoPermission took 0.029 sec
     [java]     [junit] Testcase: testWhenTagWithoutChooseTag took 0.044 sec
     [java]     [junit] Testcase: testHeaders took 0.049 sec
     [java]     [junit] Testcase: testReadServletOutputStream took 0.032 sec
     [java]     [junit] Testcase: testPostMethod took 0.026 sec
     [java]     [junit] Testcase: testGetMethod took 0.017 sec
     [java]     [junit] Testcase: testSetAttribute took 0.022 sec
     [java]     [junit] Testcase: testSetRequestAttribute took 0.018 sec
     [java]     [junit] Testcase: testSendParams took 0.026 sec
     [java]     [junit] Testcase: testSendHeader took 0.022 sec
     [java]     [junit] Testcase: testSendCookie took 0.026 sec
     [java]     [junit] Testcase: testSendMultipleCookies took 0.02 sec
     [java]     [junit] Testcase: testReceiveHeader took 0.02 sec
     [java]     [junit] Testcase: testReceiveCookie took 0.033 sec
     [java]     [junit] Testcase: testRequestDispatcherForward took 0.023 sec
     [java]     [junit] Testcase: testRequestDispatcherInclude took 0.025 sec
     [java]     [junit] Testcase: testServletConfig took 0.025 sec
     [java]     [junit] Testcase: testDoStartTag took 0.037 sec
     [java]     [junit] Testcase: testDoStartTagInclude took 0.024 sec
     [java]     [junit] Testcase: testDoEndTagContinue took 0.036 sec
     [java]     [junit] Testcase: testDoEndTagStop took 0.021 sec
     [java]     [junit] Testcase: testReplacement took 0.035 sec
     [java]     [junit] Testcase: testAddHeaderParamOK took 0.078 sec
     [java]     [junit] Testcase: testAddHeaderParamNotDefined took 0.021 sec
     [java]     [junit] Testcase: testAddFooterParamOK took 0.018 sec
     [java]     [junit] Testcase: testAddFooterParamNotDefined took 0.026 sec
     [java]     [junit] Testcase: testDoFilterOK took 0.033 sec
     [java]     [junit] TEST org.apache.cactus.sample.TestAll FAILED

     [java] cactus.test.check.result:

     [java] cactus.check.tomcat4x:

     [java] cactus.stop.tomcat4x:
     [java]      [java] log4j:WARN No appenders could be found for logger (org.apache.commons.digester.Digester.sax).
     [java]      [java] log4j:WARN Please initialize the log4j system properly.
     [java]      [java] Stopping service Tomcat-Standalone
     [java]      [java] HttpConnector[8082] Stopping background thread
     [java]      [java] StandardHost[localhost]: Removing web application at context path
/cactustest

     [java] BUILD FAILED
     [java] /home/rubys/jakarta/jakarta-cactus/samples/servlet/target-13/sample/build/cactus-integration-ant/scripts/build-share.xml:276:
There were test errors

     [java] Total time: 1 minute 12 seconds

BUILD FAILED
/home/rubys/jakarta/jakarta-cactus/samples/servlet/build.xml:313: Java returned: 1

Total time: 1 minute 23 seconds

---------------------------------------------------------------------
To unsubscribe, e-mail: cactus-dev-unsubscribe@jakarta.apache.org
For additional commands, e-mail: cactus-dev-help@jakarta.apache.org


Mime
View raw message