jakarta-cactus-dev mailing list archives

Site index · List index
Message view « Date » · « Thread »
Top « Date » · « Thread »
From Vincent Massol <vmas...@apache.org>
Subject [GUMP] Build Failure - jakarta-cactus-sample-servlet-13
Date Sat, 10 Aug 2002 10:25:05 GMT
----------------------------------------------------
This email is autogenerated from the output from:
<http://jakarta.apache.org/builds/gump/2002-08-10/jakarta-cactus-sample-servlet-13.html>
----------------------------------------------------

Buildfile: sample-servlet/build.xml

display.properties:
     [echo] ----- Cactus Servlet Sample 1.5dev -----

     [echo] java.class.path = /home/rubys/jakarta/xml-commons/java/external/build/xml-apis.jar:.:/usr/java/jdk1.3.1_04/lib/tools.jar:/usr/java/jdk1.3.1_04/jre/lib/rt.jar:/usr/java/jdk1.3.1_04/lib/tools.jar:/home/rubys/jakarta/jakarta-ant/dist/lib/ant.jar:/home/rubys/jakarta/jakarta-ant/dist/lib/optional.jar:/home/rubys/jakarta/xml-xerces2/java/build/xercesImpl.jar:/home/rubys/jakarta/xml-xerces2/java/build/xmlParserAPIs.jar:/home/rubys/jakarta/jakarta-tomcat-4.0/dist/bin/bootstrap.jar:/home/rubys/jakarta/jakarta-tomcat-4.0/dist/server/lib/catalina.jar:/home/rubys/jakarta/jakarta-tomcat-4.0/dist/server/lib/servlets-common.jar:/home/rubys/jakarta/jakarta-tomcat-4.0/dist/server/lib/servlets-default.jar:/home/rubys/jakarta/jakarta-tomcat-4.0/dist/server/lib/servlets-invoker.jar:/home/rubys/jakarta/jakarta-tomcat-4.0/dist/common/lib/naming-common.jar:/home/rubys/jakarta/jakarta-tomcat-4.0/dist/common/lib/naming-resources.jar:/home/rubys/jakarta/jakarta-tomcat-4.0/dist/shared/lib/jasper-compiler.jar:/home/rubys/jakarta/jakarta-tomcat-4.0/dist/shared/lib/jasper-runtime.jar:/opt/aspectj1.0/lib/aspectjtools.jar:/opt/aspectj1.0/lib/aspectjrt.jar:/opt/aspectj1.0/lib/aspectj-ant.jar:/home/rubys/jakarta/jakarta-servletapi-4/lib/servlet.jar:/home/rubys/jakarta/jakarta-log4j/dist/lib/log4j-20020810.jar:/home/rubys/jakarta/jakarta-commons/logging/dist/commons-logging.jar:/home/rubys/jakarta/jakarta-commons/logging/dist/commons-logging-api.jar:/home/rubys/jakarta/jakarta-commons/httpclient/dist/commons-httpclient.jar:/home/rubys/jakarta/httpunit/lib/httpunit.jar:/home/rubys/jakarta/dist/junit/junit.jar:/home/rubys/jakarta/jakarta-cactus/framework/dist-13/lib/cactus.jar:/home/rubys/jakarta/jakarta-cactus/anttasks/dist/lib/cactus-ant.jar:/home/rubys/jakarta/jakarta-commons/collections/dist/commons-collections.jar:/home/rubys/jakarta/jakarta-commons/beanutils/dist/commons-beanutils.jar:/opt/jsse1.0.3/lib/jsse.jar:/opt/jsse1.0.3/lib/jnet.jar:/opt/jsse1.0.3/lib/jcert.jar:/home/rubys/jakarta/jakarta-commons/digester/dist/commons-digester.jar:/home/rubys/jakarta/jakarta-tomcat-connectors/util/build/lib/tomcat-util.jar:/home/rubys/jakarta/jakarta-slide/lib/antlr-tools.jar:/home/rubys/jakarta/jakarta-slide/lib/antlr.jar:/home/rubys/jakarta/jakarta-regexp/bin/jakarta-regexp-20020810.jar:/home/rubys/jakarta/jakarta-cactus/sample-servlet/target-13/sample/target/classes/unit:/home/rubys/jakarta/jakarta-cactus/sample-servlet/target-13/sample/target/classes/sample:/home/rubys/jakarta/jakarta-cactus/sample-servlet/target-13/sample/target/conf/client

     [echo] java.home = /usr/java/jdk1.3.1_04/jre
     [echo] user.home = /home/rubys
     [echo] ant.home = ${ant.home}

     [echo] log4j.jar (optional) = /home/rubys/jakarta/jakarta-log4j/dist/lib/log4j-20020810.jar
     [echo] clover.enable (optional) = ${clover.enable}
     [echo] clover.jar (optional) = ${clover.jar}
     [echo] test.port (optional) = 8082

check.properties:
[checkProperty] j2ee.jar = [/home/rubys/jakarta/jakarta-servletapi-4/lib/servlet.jar]
[checkProperty] aspectjrt.jar = [/opt/aspectj1.0/lib/aspectjrt.jar]
[checkProperty] commons.logging.jar = [/home/rubys/jakarta/jakarta-commons/logging/dist/commons-logging.jar]
[checkProperty] commons.httpclient.jar = [/home/rubys/jakarta/jakarta-commons/httpclient/dist/commons-httpclient.jar]
[checkProperty] junit.jar = [/home/rubys/jakarta/dist/junit/junit.jar]
[checkProperty] httpunit.jar = [/home/rubys/jakarta/httpunit/lib/httpunit.jar]

check.j2ee.version:
     [echo] j2ee.api = 13

properties.source:
     [echo] cactus.framework.jar = /home/rubys/jakarta/jakarta-cactus/framework/dist-13/lib/cactus.jar
     [echo] cactus.framework.web = framework/dist-13/web
     [echo] cactus.framework.clover.jar = framework/dist-13/lib/cactus-clover.jar

properties.target:

properties.distribution:

load.properties:

init:

sample:
    [mkdir] Created dir: /home/rubys/jakarta/jakarta-cactus/sample-servlet/target-13/sample/build
    [mkdir] Created dir: /home/rubys/jakarta/jakarta-cactus/sample-servlet/target-13/sample/conf/test
    [mkdir] Created dir: /home/rubys/jakarta/jakarta-cactus/sample-servlet/target-13/sample/src/sample
    [mkdir] Created dir: /home/rubys/jakarta/jakarta-cactus/sample-servlet/target-13/sample/src/unit
    [mkdir] Created dir: /home/rubys/jakarta/jakarta-cactus/sample-servlet/target-13/sample/web/test
     [copy] Copying 11 files to /home/rubys/jakarta/jakarta-cactus/sample-servlet/target-13/sample/build
     [copy] Copying 13 files to /home/rubys/jakarta/jakarta-cactus/sample-servlet/target-13/sample/src/sample
     [copy] Copying 21 files to /home/rubys/jakarta/jakarta-cactus/sample-servlet/target-13/sample/src/unit
     [copy] Copying 44 files to /home/rubys/jakarta/jakarta-cactus/sample-servlet/target-13/sample/conf/test
     [copy] Copying 2 files to /home/rubys/jakarta/jakarta-cactus/sample-servlet/target-13/sample/conf
     [copy] Copying 1 file to /home/rubys/jakarta/jakarta-cactus/sample-servlet/target-13/sample/web/test
     [copy] Copying 1 file to /home/rubys/jakarta/jakarta-cactus/sample-servlet/target-13/sample/web
     [copy] Copying 1 file to /home/rubys/jakarta/jakarta-cactus/sample-servlet/target-13/sample

prepare.dist:
    [mkdir] Created dir: /home/rubys/jakarta/jakarta-cactus/sample-servlet/dist-13/bin
      [zip] Building zip: /home/rubys/jakarta/jakarta-cactus/sample-servlet/dist-13/bin/sample-servlet.zip

test.choose.jar.clover:

test.choose.jar.main:

test.choose.jar:

test:
     [java] Buildfile: sample-servlet/target-13/sample/build/build.xml

     [java] check.test.resin.20:

     [java]      [echo] ******************************************************
     [java]      [echo] WARNING : The 'resin.home.20' property has not been
     [java]      [echo] set. No test will be run on that servlet engine.
     [java]      [echo] ******************************************************


     [java] display.properties:
     [java]      [echo] ----- Cactus Servlet Sample 1.5dev -----

     [java]      [echo] java.class.path = /home/rubys/jakarta/xml-commons/java/external/build/xml-apis.jar:/home/rubys/jakarta/jakarta-cactus:/usr/java/jdk1.3.1_04/lib/tools.jar:/usr/java/jdk1.3.1_04/jre/lib/rt.jar:/home/rubys/jakarta/jakarta-ant/dist/lib/ant.jar:/home/rubys/jakarta/jakarta-ant/dist/lib/optional.jar:/home/rubys/jakarta/xml-xerces2/java/build/xercesImpl.jar:/home/rubys/jakarta/xml-xerces2/java/build/xmlParserAPIs.jar:/home/rubys/jakarta/jakarta-tomcat-4.0/dist/bin/bootstrap.jar:/home/rubys/jakarta/jakarta-tomcat-4.0/dist/server/lib/catalina.jar:/home/rubys/jakarta/jakarta-tomcat-4.0/dist/server/lib/servlets-common.jar:/home/rubys/jakarta/jakarta-tomcat-4.0/dist/server/lib/servlets-default.jar:/home/rubys/jakarta/jakarta-tomcat-4.0/dist/server/lib/servlets-invoker.jar:/home/rubys/jakarta/jakarta-tomcat-4.0/dist/common/lib/naming-common.jar:/home/rubys/jakarta/jakarta-tomcat-4.0/dist/common/lib/naming-resources.jar:/home/rubys/jakarta/jakarta-tomcat-4.0/dist/shared/lib/jasper-compiler.jar:/home/rubys/jakarta/jakarta-tomcat-4.0/dist/shared/lib/jasper-runtime.jar:/opt/aspectj1.0/lib/aspectjtools.jar:/opt/aspectj1.0/lib/aspectjrt.jar:/opt/aspectj1.0/lib/aspectj-ant.jar:/home/rubys/jakarta/jakarta-servletapi-4/lib/servlet.jar:/home/rubys/jakarta/jakarta-log4j/dist/lib/log4j-20020810.jar:/home/rubys/jakarta/jakarta-commons/logging/dist/commons-logging.jar:/home/rubys/jakarta/jakarta-commons/logging/dist/commons-logging-api.jar:/home/rubys/jakarta/jakarta-commons/httpclient/dist/commons-httpclient.jar:/home/rubys/jakarta/httpunit/lib/httpunit.jar:/home/rubys/jakarta/dist/junit/junit.jar:/home/rubys/jakarta/jakarta-cactus/framework/dist-13/lib/cactus.jar:/home/rubys/jakarta/jakarta-cactus/anttasks/dist/lib/cactus-ant.jar:/home/rubys/jakarta/jakarta-commons/collections/dist/commons-collections.jar:/home/rubys/jakarta/jakarta-commons/beanutils/dist/commons-beanutils.jar:/opt/jsse1.0.3/lib/jsse.jar:/opt/jsse1.0.3/lib/jnet.jar:/opt/jsse1.0.3/lib/jcert.jar:/home/rubys/jakarta/jakarta-commons/digester/dist/commons-digester.jar:/home/rubys/jakarta/jakarta-tomcat-connectors/util/build/lib/tomcat-util.jar:/home/rubys/jakarta/jakarta-slide/lib/antlr-tools.jar:/home/rubys/jakarta/jakarta-slide/lib/antlr.jar:/home/rubys/jakarta/jakarta-regexp/bin/jakarta-regexp-20020810.jar:/home/rubys/jakarta/jakarta-cactus/sample-servlet/target-13/sample/target/classes/unit:/home/rubys/jakarta/jakarta-cactus/sample-servlet/target-13/sample/target/classes/sample:/home/rubys/jakarta/jakarta-cactus/sample-servlet/target-13/sample/target/conf/client

     [java]      [echo] java.home = /usr/java/jdk1.3.1_04/jre
     [java]      [echo] user.home = /home/rubys
     [java]      [echo] ant.home = ${ant.home}

     [java]      [echo] cactus.framework.jar = /home/rubys/jakarta/jakarta-cactus/framework/dist-13/lib/cactus.jar
     [java]      [echo] cactus.ant.jar = /home/rubys/jakarta/jakarta-cactus/anttasks/dist/lib/cactus-ant.jar
     [java]      [echo] servlet.jar = /home/rubys/jakarta/jakarta-servletapi-4/lib/servlet.jar
     [java]      [echo] aspectjrt.jar = /opt/aspectj1.0/lib/aspectjrt.jar
     [java]      [echo] commons.logging.jar = /home/rubys/jakarta/jakarta-commons/logging/dist/commons-logging.jar
     [java]      [echo] commons.httpclient.jar = /home/rubys/jakarta/jakarta-commons/httpclient/dist/commons-httpclient.jar
     [java]      [echo] httpunit.jar = /home/rubys/jakarta/httpunit/lib/httpunit.jar
     [java]      [echo] junit.jar = /home/rubys/jakarta/dist/junit/junit.jar

     [java]      [echo] log4j.jar (optional) = /home/rubys/jakarta/jakarta-log4j/dist/lib/log4j-20020810.jar
     [java]      [echo] clover.jar (optional) = ${clover.jar}

     [java]      [echo] test.port = 8082


     [java] check.properties.test:

     [java] check.properties.warn:

     [java] check.properties:

     [java] init:

     [java] compile.sample:
     [java]     [javac] Compiling 13 source files to /home/rubys/jakarta/jakarta-cactus/sample-servlet/target-13/sample/target/classes/sample

     [java] compile.unit:
     [java]     [javac] Compiling 16 source files to /home/rubys/jakarta/jakarta-cactus/sample-servlet/target-13/sample/target/classes/unit

     [java]     [javac] Note: Some input files use or override a deprecated API.
     [java]     [javac] Note: Recompile with -deprecation for details.
     [java] compile:

     [java] prepare.testwar.log4j:
     [java]      [copy] Copying 1 file to /home/rubys/jakarta/jakarta-cactus/sample-servlet/target-13/sample/target/lib

     [java] prepare.testwar.clover:

     [java] prepare.test:
     [java]      [copy] Copying 1 file to /home/rubys/jakarta/jakarta-cactus/sample-servlet/target-13/sample/target/conf/client
     [java]      [copy] Copying 1 file to /home/rubys/jakarta/jakarta-cactus/sample-servlet/target-13/sample/target/conf/client

     [java] testwar:
     [java]      [copy] Copying 1 file to /home/rubys/jakarta/jakarta-cactus/sample-servlet/target-13/sample/target/lib
     [java]      [copy] Copying 1 file to /home/rubys/jakarta/jakarta-cactus/sample-servlet/target-13/sample/target/lib
     [java]      [copy] Copying 1 file to /home/rubys/jakarta/jakarta-cactus/sample-servlet/target-13/sample/target/lib
     [java]      [copy] Copying 1 file to /home/rubys/jakarta/jakarta-cactus/sample-servlet/target-13/sample/target/lib
     [java]      [copy] Copying 1 file to /home/rubys/jakarta/jakarta-cactus/sample-servlet/target-13/sample/target/conf/server
     [java]     [mkdir] Created dir: /home/rubys/jakarta/jakarta-cactus/sample-servlet/target-13/sample/target/test
     [java]       [war] Building war: /home/rubys/jakarta/jakarta-cactus/sample-servlet/target-13/sample/target/test/test.war

     [java] prepare.test.resin.20:

     [java] test.resin.20:

     [java] check.test.resin.13:

     [java]      [echo] ******************************************************
     [java]      [echo] WARNING : The 'resin.home.13' property has not been 
     [java]      [echo] set. No test will be run on that servlet engine.
     [java]      [echo] ******************************************************


     [java] prepare.test.resin.13:

     [java] test.resin.13:

     [java] check.test.tomcat.40:

     [java] prepare.test.tomcat.40:
     [java]      [echo] tomcat.home.40 = /home/rubys/jakarta/jakarta-tomcat-4.0/dist
     [java]     [mkdir] Created dir: /home/rubys/jakarta/jakarta-cactus/sample-servlet/target-13/sample/target/test/tomcat40/conf
     [java]     [mkdir] Created dir: /home/rubys/jakarta/jakarta-cactus/sample-servlet/target-13/sample/target/test/tomcat40/work
     [java]     [mkdir] Created dir: /home/rubys/jakarta/jakarta-cactus/sample-servlet/target-13/sample/target/test/tomcat40/webapps
     [java]      [copy] Copying 2 files to /home/rubys/jakarta/jakarta-cactus/sample-servlet/target-13/sample/target/test/tomcat40/conf
     [java]      [copy] Copying 1 file to /home/rubys/jakarta/jakarta-cactus/sample-servlet/target-13/sample/target/test/tomcat40/conf
     [java]      [copy] Copying 1 file to /home/rubys/jakarta/jakarta-cactus/sample-servlet/target-13/sample/target/test/tomcat40/webapps

     [java] test.tomcat.40:

     [java] start.tomcat.40:
     [java]      [java] HttpConnector Opening server socket on all host IP addresses
     [java]      [java] Starting service Tomcat-Standalone
     [java]      [java] Apache Tomcat/${version}
     [java]      [java] HostConfig[localhost]: Expanding web application archive test.war
     [java]      [java] StandardHost[localhost]: Installing web application at context path
/test from URL file:/home/rubys/jakarta/jakarta-cactus/sample-servlet/target-13/sample/target/test/tomcat40/webapps/test
     [java]      [java] WebappLoader[/test]: Deploying class repositories to work directory
/home/rubys/jakarta/jakarta-cactus/sample-servlet/target-13/sample/target/test/tomcat40/work/Standalone/localhost/test
     [java]      [java] WebappLoader[/test]: Deploy class files /WEB-INF/classes to /home/rubys/jakarta/jakarta-cactus/sample-servlet/target-13/sample/target/test/tomcat40/webapps/test/WEB-INF/classes
     [java]      [java] WebappLoader[/test]: Deploy JAR /WEB-INF/lib/aspectjrt.jar to /home/rubys/jakarta/jakarta-cactus/sample-servlet/target-13/sample/target/test/tomcat40/webapps/test/WEB-INF/lib/aspectjrt.jar
     [java]      [java] WebappLoader[/test]: Deploy JAR /WEB-INF/lib/cactus.jar to /home/rubys/jakarta/jakarta-cactus/sample-servlet/target-13/sample/target/test/tomcat40/webapps/test/WEB-INF/lib/cactus.jar
     [java]      [java] WebappLoader[/test]: Deploy JAR /WEB-INF/lib/commons-logging.jar to
/home/rubys/jakarta/jakarta-cactus/sample-servlet/target-13/sample/target/test/tomcat40/webapps/test/WEB-INF/lib/commons-logging.jar
     [java]      [java] WebappLoader[/test]: Deploy JAR /WEB-INF/lib/junit.jar to /home/rubys/jakarta/jakarta-cactus/sample-servlet/target-13/sample/target/test/tomcat40/webapps/test/WEB-INF/lib/junit.jar
     [java]      [java] WebappLoader[/test]: Deploy JAR /WEB-INF/lib/log4j.jar to /home/rubys/jakarta/jakarta-cactus/sample-servlet/target-13/sample/target/test/tomcat40/webapps/test/WEB-INF/lib/log4j.jar
     [java]      [java] ContextConfig[/test]: Configured an authenticator for method BASIC
     [java]      [java] StandardManager[/test]: Seeding random number generator class java.security.SecureRandom
     [java]      [java] StandardManager[/test]: Seeding of random number generator has been
completed
     [java]      [java] HttpConnector[8082] Starting background thread

     [java] test:
     [java]     [junit] Running org.apache.cactus.unit.TestAll
     [java]     [junit] Tests run: 2, Failures: 0, Errors: 1, Time elapsed: 23.785 sec
     [java]     [junit] Testsuite: org.apache.cactus.unit.TestAll
     [java]     [junit] Tests run: 2, Failures: 0, Errors: 1, Time elapsed: 23.785 sec

     [java]     [junit] Testcase: testLongProcess took 3.32 sec
     [java]     [junit] Testcase: testLotsOfData took 20.459 sec
     [java]     [junit] 	Caused an ERROR
     [java]     [junit] Connection reset by peer
     [java]     [junit] java.io.IOException: Connection reset by peer
     [java]     [junit] 	at java.net.SocketOutputStream.socketWrite(Native Method)
     [java]     [junit] 	at java.net.SocketOutputStream.write(SocketOutputStream.java:91)
     [java]     [junit] 	at org.apache.catalina.connector.ResponseBase.flushBuffer(Unknown
Source)
     [java]     [junit] 	at org.apache.catalina.connector.HttpResponseBase.doFlushBuffer(Unknown
Source)
     [java]     [junit] 	at org.apache.catalina.connector.HttpResponseBase.flushBuffer(Unknown
Source)
     [java]     [junit] 	at org.apache.catalina.connector.ResponseBase.write(Unknown Source)
     [java]     [junit] 	at org.apache.catalina.connector.ResponseStream.write(Unknown Source)
     [java]     [junit] 	at org.apache.catalina.connector.http.HttpResponseStream.write(Unknown
Source)
     [java]     [junit] 	at javax.servlet.ServletOutputStream.print(ServletOutputStream.java:135)
     [java]     [junit] 	at org.apache.catalina.connector.http.HttpResponseStream.write(Unknown
Source)
     [java]     [junit] 	at javax.servlet.ServletOutputStream.print(ServletOutputStream.java:135)
     [java]     [junit] 	at javax.servlet.ServletOutputStream.println(ServletOutputStream.java:286)
     [java]     [junit] 	at org.apache.cactus.unit.TestServletTestCase_TestResult.testLotsOfData(Unknown
Source)
     [java]     [junit] 	at org.apache.cactus.AbstractTestCase.runServerTest(AbstractTestCase.java:374)
     [java]     [junit] 	at org.apache.cactus.AbstractTestCase.runBareServerTest(AbstractTestCase.java:249)
     [java]     [junit] 	at org.apache.cactus.server.AbstractWebTestCaller.doTest(AbstractWebTestCaller.java:149)
     [java]     [junit] 	at org.apache.cactus.server.AbstractWebTestController.handleRequest$ajcPostAround7(AbstractWebTestController.java;org/apache/cactus/util/log/LogAspect.java(1k):125)
     [java]     [junit] 	at org.apache.cactus.server.AbstractWebTestController.handleRequest$ajcPostAround7$ajcVoidWrapper(AbstractWebTestController.java;org/apache/cactus/util/log/LogAspect.java(1k))
     [java]     [junit] 	at org.apache.cactus.server.AbstractWebTestController.handleRequest(AbstractWebTestController.java;org/apache/cactus/util/log/LogAspect.java(1k):1144)
     [java]     [junit] 	at org.apache.cactus.server.ServletTestRedirector.doPost$ajcPostAround10(ServletTestRedirector.java;org/apache/cactus/util/log/LogAspect.java(1k):123)
     [java]     [junit] 	at org.apache.cactus.server.ServletTestRedirector.doPost$ajcPostAround10$ajcVoidWrapper(ServletTestRedirector.java;org/apache/cactus/util/log/LogAspect.java(1k))
     [java]     [junit] 	at org.apache.cactus.server.ServletTestRedirector.doPost(ServletTestRedirector.java;org/apache/cactus/util/log/LogAspect.java(1k):1144)
     [java]     [junit] 	at org.apache.cactus.server.ServletTestRedirector.doGet$ajcPostAround6(ServletTestRedirector.java;org/apache/cactus/util/log/LogAspect.java(1k):96)
     [java]     [junit] 	at org.apache.cactus.server.ServletTestRedirector.doGet$ajcPostAround6$ajcVoidWrapper(ServletTestRedirector.java;org/apache/cactus/util/log/LogAspect.java(1k))
     [java]     [junit] 	at org.apache.cactus.server.ServletTestRedirector.doGet(ServletTestRedirector.java;org/apache/cactus/util/log/LogAspect.java(1k):1144)
     [java]     [junit] 	at javax.servlet.http.HttpServlet.service(HttpServlet.java:740)
     [java]     [junit] 	at javax.servlet.http.HttpServlet.service(HttpServlet.java:853)
     [java]     [junit] 	at org.apache.catalina.core.ApplicationFilterChain.internalDoFilter(Unknown
Source)
     [java]     [junit] 	at org.apache.catalina.core.ApplicationFilterChain.doFilter(Unknown
Source)
     [java]     [junit] 	at org.apache.catalina.core.StandardWrapperValve.invoke(Unknown Source)
     [java]     [junit] 	at org.apache.catalina.core.StandardPipeline$StandardPipelineValveContext.invokeNext(Unknown
Source)
     [java]     [junit] 	at org.apache.catalina.core.StandardPipeline.invoke(Unknown Source)
     [java]     [junit] 	at org.apache.catalina.core.ContainerBase.invoke(Unknown Source)
     [java]     [junit] 	at org.apache.catalina.core.StandardContextValve.invoke(Unknown Source)
     [java]     [junit] 	at org.apache.catalina.core.StandardPipeline$StandardPipelineValveContext.invokeNext(Unknown
Source)
     [java]     [junit] 	at org.apache.catalina.authenticator.AuthenticatorBase.invoke(Unknown
Source)
     [java]     [junit] 	at org.apache.catalina.core.StandardPipeline$StandardPipelineValveContext.invokeNext(Unknown
Source)
     [java]     [junit] 	at org.apache.catalina.core.StandardPipeline.invoke(Unknown Source)
     [java]     [junit] 	at org.apache.catalina.core.ContainerBase.invoke(Unknown Source)
     [java]     [junit] 	at org.apache.catalina.core.StandardContext.invoke(Unknown Source)
     [java]     [junit] 	at org.apache.catalina.core.StandardHostValve.invoke(Unknown Source)
     [java]     [junit] 	at org.apache.catalina.core.StandardPipeline$StandardPipelineValveContext.invokeNext(Unknown
Source)
     [java]     [junit] 	at org.apache.catalina.valves.ErrorDispatcherValve.invoke(Unknown
Source)
     [java]     [junit] 	at org.apache.catalina.core.StandardPipeline$StandardPipelineValveContext.invokeNext(Unknown
Source)
     [java]     [junit] 	at org.apache.catalina.valves.ErrorReportValve.invoke(Unknown Source)
     [java]     [junit] 	at org.apache.catalina.core.StandardPipeline$StandardPipelineValveContext.invokeNext(Unknown
Source)
     [java]     [junit] 	at org.apache.catalina.core.StandardPipeline.invoke(Unknown Source)
     [java]     [junit] 	at org.apache.catalina.core.ContainerBase.invoke(Unknown Source)
     [java]     [junit] 	at org.apache.catalina.core.StandardEngineValve.invoke(Unknown Source)
     [java]     [junit] 	at org.apache.catalina.core.StandardPipeline$StandardPipelineValveContext.invokeNext(Unknown
Source)
     [java]     [junit] 	at org.apache.catalina.core.StandardPipeline.invoke(Unknown Source)
     [java]     [junit] 	at org.apache.catalina.core.ContainerBase.invoke(Unknown Source)
     [java]     [junit] 	at org.apache.catalina.connector.http.HttpProcessor.process(Unknown
Source)
     [java]     [junit] 	at org.apache.catalina.connector.http.HttpProcessor.run(Unknown Source)
     [java]     [junit] 	at java.lang.Thread.run(Thread.java:479)

     [java]     [junit] Testcase: testLotsOfData

     [java] stop.tomcat.40:
     [java]      [java] Stopping service Tomcat-Standalone
     [java]      [java] HttpConnector[8082] Stopping background thread
     [java]      [java] StandardHost[localhost]: Removing web application at context path
/test
     [java] [runservertests] Server stopped !

     [java] BUILD FAILED
     [java] file:./build-share.xml:355: Test org.apache.cactus.unit.TestAll failed

     [java] Total time: 38 seconds

BUILD FAILED
file:/home/rubys/jakarta/jakarta-cactus/sample-servlet/build.xml:369: Java returned: 1

Total time: 42 seconds

--
To unsubscribe, e-mail:   <mailto:cactus-dev-unsubscribe@jakarta.apache.org>
For additional commands, e-mail: <mailto:cactus-dev-help@jakarta.apache.org>


Mime
View raw message