jakarta-cactus-dev mailing list archives

Site index · List index
Message view « Date » · « Thread »
Top « Date » · « Thread »
From Vincent Massol <vmas...@apache.org>
Subject [GUMP] Build Failure - jakarta-cactus-sample-servlet-12
Date Thu, 23 May 2002 13:04:46 GMT
----------------------------------------------------
This email is autogenerated from the output from:
<http://jakarta.apache.org/builds/gump/2002-05-23/jakarta-cactus-sample-servlet-12.html>
----------------------------------------------------

Buildfile: sample-servlet/build.xml

display.properties:
     [echo] ----- Cactus Servlet Sample 1.4dev -----

     [echo] java.class.path = /home/rubys/jakarta/xml-commons/java/external/build/xml-apis.jar:.:/usr/java/jdk1.3.1_02/lib/tools.jar:/usr/java/jdk1.3.1_02/jre/lib/rt.jar:/usr/java/jdk1.3.1_02/lib/tools.jar:/home/rubys/jakarta/jakarta-ant/dist/lib/ant.jar:/home/rubys/jakarta/jakarta-ant/dist/lib/optional.jar:/home/rubys/jakarta/xml-xerces2/java/build/xercesImpl.jar:/home/rubys/jakarta/xml-xerces2/java/build/xmlParserAPIs.jar:/opt/aspectj1.0/lib/aspectjtools.jar:/opt/aspectj1.0/lib/aspectjrt.jar:/opt/aspectj1.0/lib/aspectj-ant.jar:/home/rubys/jakarta/jakarta-tomcat/build/tomcat/lib/common/tomcat_core.jar:/home/rubys/jakarta/jakarta-tomcat/build/tomcat/lib/common/core_util.jar:/home/rubys/jakarta/jakarta-tomcat/build/tomcat/lib/container/container_util.jar:/home/rubys/jakarta/jakarta-tomcat/build/tomcat/lib/container/tomcat_modules.jar:/home/rubys/jakarta/dist/servletapi/lib/servlet.jar:/home/rubys/jakarta/jakarta-log4j/dist/lib/log4j-20020523.jar:/home/rubys/jakarta/jakarta-commons/httpclient/dist/commons-httpclient.jar:/home/rubys/jakarta/httpunit/lib/httpunit.jar:/home/rubys/jakarta/dist/junit/junit.jar:/home/rubys/jakarta/jakarta-cactus/framework/dist-12/lib/cactus.jar:/home/rubys/jakarta/jakarta-cactus/anttasks/dist/lib/cactus-ant.jar:/home/rubys/jakarta/jakarta-regexp/bin/jakarta-regexp-20020523.jar:/home/rubys/jakarta/jakarta-slide/lib/antlr-tools.jar:/home/rubys/jakarta/jakarta-slide/lib/antlr.jar

     [echo] java.home = /usr/java/jdk1.3.1_02/jre
     [echo] user.home = /home/rubys
     [echo] ant.home = ${ant.home}

     [echo] cactus.framework.jar = /home/rubys/jakarta/jakarta-cactus/framework/dist-12/lib/cactus.jar
     [echo] cactus.framework.web = framework/dist-12/web
     [echo] cactus.ant.jar = /home/rubys/jakarta/jakarta-cactus/anttasks/dist/lib/cactus-ant.jar
     [echo] j2ee.jar = /home/rubys/jakarta/dist/servletapi/lib/servlet.jar
     [echo] commons.httpclient.jar = /home/rubys/jakarta/jakarta-commons/httpclient/dist/commons-httpclient.jar
     [echo] aspectjrt.jar = /opt/aspectj1.0/lib/aspectjrt.jar
     [echo] junit.jar = /home/rubys/jakarta/dist/junit/junit.jar
     [echo] httpunit.jar = /home/rubys/jakarta/httpunit/lib/httpunit.jar

     [echo] log4j.jar (optional) = /home/rubys/jakarta/jakarta-log4j/dist/lib/log4j-20020523.jar
     [echo] test.port (optional) = 8081


check.properties:

check.j2ee.version:
     [echo] j2ee.api = 12

properties.source:

load.properties:

init:

sample:
    [mkdir] Created dir: /home/rubys/jakarta/jakarta-cactus/sample-servlet/target-12/sample
    [mkdir] Created dir: /home/rubys/jakarta/jakarta-cactus/sample-servlet/target-12/sample/build
    [mkdir] Created dir: /home/rubys/jakarta/jakarta-cactus/sample-servlet/target-12/sample/conf/test
    [mkdir] Created dir: /home/rubys/jakarta/jakarta-cactus/sample-servlet/target-12/sample/src/sample
    [mkdir] Created dir: /home/rubys/jakarta/jakarta-cactus/sample-servlet/target-12/sample/src/unit
    [mkdir] Created dir: /home/rubys/jakarta/jakarta-cactus/sample-servlet/target-12/sample/web/test
     [copy] Copying 13 files to /home/rubys/jakarta/jakarta-cactus/sample-servlet/target-12/sample/build
     [copy] Copying 9 files to /home/rubys/jakarta/jakarta-cactus/sample-servlet/target-12/sample/src/sample
     [copy] Copying 20 files to /home/rubys/jakarta/jakarta-cactus/sample-servlet/target-12/sample/src/unit
     [copy] Copying 32 files to /home/rubys/jakarta/jakarta-cactus/sample-servlet/target-12/sample/conf/test
     [copy] Copying 2 files to /home/rubys/jakarta/jakarta-cactus/sample-servlet/target-12/sample/conf
     [copy] Copying 1 file to /home/rubys/jakarta/jakarta-cactus/sample-servlet/target-12/sample/web/test
     [copy] Copying 1 file to /home/rubys/jakarta/jakarta-cactus/sample-servlet/target-12/sample/web
     [copy] Copying 1 file to /home/rubys/jakarta/jakarta-cactus/sample-servlet/target-12/sample

prepare.dist:
    [mkdir] Created dir: /home/rubys/jakarta/jakarta-cactus/sample-servlet/dist-12/bin
    [mkdir] Created dir: /home/rubys/jakarta/jakarta-cactus/sample-servlet/dist-12/doc/api
      [zip] Building zip: /home/rubys/jakarta/jakarta-cactus/sample-servlet/dist-12/bin/sample-servlet.zip

test:
     [java] Buildfile: sample-servlet/target-12/sample/build/build.xml

     [java] check.test.resin.20:

     [java]      [echo] ******************************************************
     [java]      [echo] WARNING : The 'resin.home.20' property has not been
     [java]      [echo] set. No test will be run on that servlet engine.
     [java]      [echo] ******************************************************


     [java] display.properties:
     [java]      [echo] ----- Cactus Servlet Sample 1.4dev -----

     [java]      [echo] java.class.path = /home/rubys/jakarta/xml-commons/java/external/build/xml-apis.jar:/home/rubys/jakarta/jakarta-cactus:/usr/java/jdk1.3.1_02/lib/tools.jar:/usr/java/jdk1.3.1_02/jre/lib/rt.jar:/home/rubys/jakarta/jakarta-ant/dist/lib/ant.jar:/home/rubys/jakarta/jakarta-ant/dist/lib/optional.jar:/home/rubys/jakarta/xml-xerces2/java/build/xercesImpl.jar:/home/rubys/jakarta/xml-xerces2/java/build/xmlParserAPIs.jar:/opt/aspectj1.0/lib/aspectjtools.jar:/opt/aspectj1.0/lib/aspectjrt.jar:/opt/aspectj1.0/lib/aspectj-ant.jar:/home/rubys/jakarta/jakarta-tomcat/build/tomcat/lib/common/tomcat_core.jar:/home/rubys/jakarta/jakarta-tomcat/build/tomcat/lib/common/core_util.jar:/home/rubys/jakarta/jakarta-tomcat/build/tomcat/lib/container/container_util.jar:/home/rubys/jakarta/jakarta-tomcat/build/tomcat/lib/container/tomcat_modules.jar:/home/rubys/jakarta/dist/servletapi/lib/servlet.jar:/home/rubys/jakarta/jakarta-log4j/dist/lib/log4j-20020523.jar:/home/rubys/jakarta/jakarta-commons/httpclient/dist/commons-httpclient.jar:/home/rubys/jakarta/httpunit/lib/httpunit.jar:/home/rubys/jakarta/dist/junit/junit.jar:/home/rubys/jakarta/jakarta-cactus/framework/dist-12/lib/cactus.jar:/home/rubys/jakarta/jakarta-cactus/anttasks/dist/lib/cactus-ant.jar:/home/rubys/jakarta/jakarta-regexp/bin/jakarta-regexp-20020523.jar:/home/rubys/jakarta/jakarta-slide/lib/antlr-tools.jar:/home/rubys/jakarta/jakarta-slide/lib/antlr.jar

     [java]      [echo] java.home = /usr/java/jdk1.3.1_02/jre
     [java]      [echo] user.home = /home/rubys
     [java]      [echo] ant.home = ${ant.home}

     [java]      [echo] cactus.framework.jar = /home/rubys/jakarta/jakarta-cactus/framework/dist-12/lib/cactus.jar
     [java]      [echo] cactus.ant.jar = /home/rubys/jakarta/jakarta-cactus/anttasks/dist/lib/cactus-ant.jar
     [java]      [echo] servlet.jar = /home/rubys/jakarta/dist/servletapi/lib/servlet.jar
     [java]      [echo] aspectjrt.jar = /opt/aspectj1.0/lib/aspectjrt.jar
     [java]      [echo] commons.httpclient.jar = /home/rubys/jakarta/jakarta-commons/httpclient/dist/commons-httpclient.jar
     [java]      [echo] httpunit.jar = /home/rubys/jakarta/httpunit/lib/httpunit.jar
     [java]      [echo] junit.jar = /home/rubys/jakarta/dist/junit/junit.jar

     [java]      [echo] log4j.jar (optional) = /home/rubys/jakarta/jakarta-log4j/dist/lib/log4j-20020523.jar

     [java]      [echo] test.port = 8081


     [java] check.properties:

     [java] init:

     [java] compile.sample:
     [java]     [mkdir] Created dir: /home/rubys/jakarta/jakarta-cactus/sample-servlet/target-12/sample/target/classes/sample
     [java]     [javac] Compiling 9 source files to /home/rubys/jakarta/jakarta-cactus/sample-servlet/target-12/sample/target/classes/sample

     [java] compile.unit:
     [java]     [mkdir] Created dir: /home/rubys/jakarta/jakarta-cactus/sample-servlet/target-12/sample/target/classes/unit
     [java]     [javac] Compiling 15 source files to /home/rubys/jakarta/jakarta-cactus/sample-servlet/target-12/sample/target/classes/unit

     [java] compile:

     [java] prepare.testwar.log4j:
     [java]     [javac] Note: Some input files use or override a deprecated API.
     [java]     [javac] Note: Recompile with -deprecation for details.
     [java]      [copy] Copying 1 file to /home/rubys/jakarta/jakarta-cactus/sample-servlet/target-12/sample/target/lib

     [java] prepare.test:
     [java]      [copy] Copying 1 file to /home/rubys/jakarta/jakarta-cactus/sample-servlet/target-12/sample/target/conf
     [java]      [copy] Copying 1 file to /home/rubys/jakarta/jakarta-cactus/sample-servlet/target-12/sample/target/conf

     [java] testwar:
     [java]      [copy] Copying 1 file to /home/rubys/jakarta/jakarta-cactus/sample-servlet/target-12/sample/target/lib
     [java]      [copy] Copying 1 file to /home/rubys/jakarta/jakarta-cactus/sample-servlet/target-12/sample/target/lib
     [java]      [copy] Copying 1 file to /home/rubys/jakarta/jakarta-cactus/sample-servlet/target-12/sample/target/lib
     [java]     [mkdir] Created dir: /home/rubys/jakarta/jakarta-cactus/sample-servlet/target-12/sample/target/test
     [java]       [war] Building war: /home/rubys/jakarta/jakarta-cactus/sample-servlet/target-12/sample/target/test/test.war

     [java] prepare.test.resin.20:

     [java] test.resin.20:

     [java] check.test.resin.12:

     [java]      [echo] ******************************************************
     [java]      [echo] WARNING : The 'resin.home.12' property has not been 
     [java]      [echo] set. No test will be run on that servlet engine.
     [java]      [echo] ******************************************************


     [java] prepare.test.resin.12:

     [java] test.resin.12:

     [java] check.test.tomcat.32:

     [java]      [echo] ******************************************************
     [java]      [echo] WARNING : The 'tomcat.home.32' property has not been 
     [java]      [echo] set. No test will be run on that servlet engine.
     [java]      [echo] ******************************************************


     [java] prepare.test.tomcat.32:

     [java] test.tomcat.32:

     [java] check.test.tomcat.33:

     [java] prepare.test.tomcat.33:
     [java]      [echo] tomcat.home.33 = /home/rubys/jakarta/jakarta-tomcat/build/tomcat
     [java]     [mkdir] Created dir: /home/rubys/jakarta/jakarta-cactus/sample-servlet/target-12/sample/target/test/tomcat33/conf
     [java]     [mkdir] Created dir: /home/rubys/jakarta/jakarta-cactus/sample-servlet/target-12/sample/target/test/tomcat33/work
     [java]     [mkdir] Created dir: /home/rubys/jakarta/jakarta-cactus/sample-servlet/target-12/sample/target/test/tomcat33/webapps
     [java]      [copy] Copying 3 files to /home/rubys/jakarta/jakarta-cactus/sample-servlet/target-12/sample/target/test/tomcat33/conf
     [java]      [copy] Copying 1 file to /home/rubys/jakarta/jakarta-cactus/sample-servlet/target-12/sample/target/test/tomcat33/webapps

     [java] test.tomcat.33:

     [java] start.tomcat.33:
     [java]      [java] AutoDeploy: Expanding /home/rubys/jakarta/jakarta-cactus/sample-servlet/target-12/sample/target/test/tomcat33/webapps/test.war
     [java]      [java] SessionIdGenerator: Opening /dev/urandom
     [java]      [java] ServerXmlReader: Config=$TOMCAT_HOME/conf/server.xml
     [java]      [java] PathSetter: install=/home/rubys/jakarta/jakarta-tomcat/build/tomcat
     [java]      [java] PathSetter: home=/home/rubys/jakarta/jakarta-cactus/sample-servlet/target-12/sample/target/test/tomcat33
     [java]      [java] AutoWebApp: Auto-Adding DEFAULT:/test
     [java]      [java] ContextManager: Tomcat configured and in stable state 
     [java]      [java] WorkDirSetup: Creating work dir /home/rubys/jakarta/jakarta-cactus/sample-servlet/target-12/sample/target/test/tomcat33/work/DEFAULT/test
     [java]      [java] ContextManager: Adding  DEFAULT:/test
     [java]      [java] Ctx(/test) : Validating web.xml
     [java]      [java] EmbededTomcat: Init time 4122
     [java]      [java] Http10Interceptor: Starting on 8081
     [java]      [java] Ajp12Interceptor: Starting on 8777
     [java]      [java] EmbededTomcat: Startup time 245

     [java] test:
     [java]     [junit] Running org.apache.cactus.unit.TestAll
     [java]      [java] Ctx(/test) : Compiling: /test/test.jsp to test.test_0
     [java]     [junit] Tests run: 26, Failures: 1, Errors: 0, Time elapsed: 12.333 sec
     [java]     [junit] Testsuite: org.apache.cactus.unit.TestAll
     [java]     [junit] Tests run: 26, Failures: 1, Errors: 0, Time elapsed: 12.333 sec

     [java]     [junit] Testcase: testLongProcess took 5.795 sec
     [java]     [junit] Testcase: testLotsOfData took 0.254 sec
     [java]     [junit] Testcase: testAssertionFailedError took 0.141 sec
     [java]     [junit] Testcase: testExceptionNotSerializable took 0.047 sec
     [java]     [junit] Testcase: testExceptionSerializable took 0.05 sec
     [java]     [junit] Testcase: testNoAutomaticSessionCreation took 0.13 sec
     [java]     [junit] Testcase: testMultiValueParameters took 0.051 sec
     [java]     [junit] Testcase: testWriteOutputStream took 0.055 sec
     [java]     [junit] Testcase: testSetConfigParameter took 0.06 sec
     [java]     [junit] Testcase: testGetServletName took 0.04 sec
     [java]     [junit] Testcase: testSendMultivaluedHeader took 0.048 sec
     [java]     [junit] Testcase: testGetResponseAsStringMultiLines took 0.042 sec
     [java]     [junit] Testcase: testGetResponseAsStringArrayMultiLines took 0.06 sec
     [java]     [junit] Testcase: testCookieEncoding took 0.466 sec
     [java]     [junit] Testcase: testGetRequestDispatcherFromNamedDispatcherOK took 4.386
sec
     [java]     [junit] Testcase: testGetRequestDispatcherFromNamedDispatcherInvalid took
0.078 sec
     [java]     [junit] Testcase: testGetRequestDispatcherFromRequest1 took 0.056 sec
     [java]     [junit] Testcase: testGetRequestDispatcherFromRequest2 took 0.063 sec
     [java]     [junit] Testcase: testGetLogs took 0.064 sec
     [java]     [junit] Testcase: testStatusCode took 0.036 sec
     [java]     [junit] Testcase: testRedirect took 0.089 sec
     [java]     [junit] Testcase: testGetPathTranslated took 0.101 sec
     [java]     [junit] Testcase: testGetReader took 0.044 sec
     [java]     [junit] Testcase: testSendUserData took 0.056 sec
     [java]     [junit] Testcase: testSetContentTypeHeader took 0.04 sec
     [java]     [junit] Testcase: testRemoteClientCheck took 0.044 sec
     [java]     [junit] 	FAILED
     [java]     [junit] expected:<192.168.0.2> but was:<192.168.0.1>
     [java]     [junit] junit.framework.AssertionFailedError: expected:<192.168.0.2>
but was:<192.168.0.1>
     [java]     [junit] 	at org.apache.cactus.unit.TestServletTestCase2.testRemoteClientCheck(Unknown
Source)
     [java]     [junit] 	at org.apache.cactus.AbstractTestCase.runServerTest(AbstractTestCase.java:332)
     [java]     [junit] 	at org.apache.cactus.AbstractTestCase.runBareServerTest(AbstractTestCase.java:236)
     [java]     [junit] 	at org.apache.cactus.server.AbstractWebTestCaller.doTest(AbstractWebTestCaller.java:149)
     [java]     [junit] 	at org.apache.cactus.server.AbstractWebTestController.handleRequest$ajcPostAround7(AbstractWebTestController.java;org/apache/cactus/util/log/LogAspect.java(1k):126)
     [java]     [junit] 	at org.apache.cactus.server.AbstractWebTestController.handleRequest$ajcPostAround7$ajcVoidWrapper(AbstractWebTestController.java;org/apache/cactus/util/log/LogAspect.java(1k))
     [java]     [junit] 	at org.apache.cactus.server.AbstractWebTestController.handleRequest(AbstractWebTestController.java;org/apache/cactus/util/log/LogAspect.java(1k):1136)
     [java]     [junit] 	at org.apache.cactus.server.ServletTestRedirector.doPost$ajcPostAround10(ServletTestRedirector.java;org/apache/cactus/util/log/LogAspect.java(1k):132)
     [java]     [junit] 	at org.apache.cactus.server.ServletTestRedirector.doPost$ajcPostAround10$ajcVoidWrapper(ServletTestRedirector.java;org/apache/cactus/util/log/LogAspect.java(1k))
     [java]     [junit] 	at org.apache.cactus.server.ServletTestRedirector.doPost(ServletTestRedirector.java;org/apache/cactus/util/log/LogAspect.java(1k):1136)
     [java]     [junit] 	at org.apache.cactus.server.ServletTestRedirector.doGet$ajcPostAround6(ServletTestRedirector.java;org/apache/cactus/util/log/LogAspect.java(1k):105)
     [java]     [junit] 	at org.apache.cactus.server.ServletTestRedirector.doGet$ajcPostAround6$ajcVoidWrapper(ServletTestRedirector.java;org/apache/cactus/util/log/LogAspect.java(1k))
     [java]     [junit] 	at org.apache.cactus.server.ServletTestRedirector.doGet(ServletTestRedirector.java;org/apache/cactus/util/log/LogAspect.java(1k):1136)
     [java]     [junit] 	at javax.servlet.http.HttpServlet.service(HttpServlet.java)
     [java]     [junit] 	at javax.servlet.http.HttpServlet.service(HttpServlet.java)
     [java]     [junit] 	at org.apache.tomcat.facade.ServletHandler.doService(ServletHandler.java:574)
     [java]     [junit] 	at org.apache.tomcat.core.Handler.invoke(Handler.java:322)
     [java]     [junit] 	at org.apache.tomcat.core.Handler.service(Handler.java:235)
     [java]     [junit] 	at org.apache.tomcat.facade.ServletHandler.service(ServletHandler.java:485)
     [java]     [junit] 	at org.apache.tomcat.core.ContextManager.internalService(ContextManager.java:917)
     [java]     [junit] 	at org.apache.tomcat.core.ContextManager.service(ContextManager.java:833)
     [java]     [junit] 	at org.apache.tomcat.modules.server.Http10Interceptor.processConnection(Http10Interceptor.java:176)
     [java]     [junit] 	at org.apache.tomcat.util.net.TcpWorkerThread.runIt(PoolTcpEndpoint.java:508)
     [java]     [junit] 	at org.apache.tomcat.util.threads.ThreadPool$ControlRunnable.run(ThreadPool.java:518)
     [java]     [junit] 	at java.lang.Thread.run(Thread.java:484)

     [java]     [junit] Testcase: testRemoteClientCheck

     [java] stop.tomcat.33:
     [java]      [java] Stopping Tomcat.
     [java]      [java] Stopping tomcat on :8777 null
     [java]      [java] Stop reaper 
     [java] [runservertests] Server stopped !

     [java] BUILD FAILED
     [java] /home/rubys/jakarta/jakarta-cactus/sample-servlet/target-12/sample/build/build.xml:344:
Test org.apache.cactus.unit.TestAll failed

     [java] Total time: 45 seconds

BUILD FAILED
/home/rubys/jakarta/jakarta-cactus/sample-servlet/build.xml:357: Java returned: 1

Total time: 56 seconds

--
To unsubscribe, e-mail:   <mailto:cactus-dev-unsubscribe@jakarta.apache.org>
For additional commands, e-mail: <mailto:cactus-dev-help@jakarta.apache.org>


Mime
View raw message