jakarta-bsf-dev mailing list archives

Site index · List index
Message view « Date » · « Thread »
Top « Date » · « Thread »
From Stefan Bodewig <bode...@apache.org>
Subject [GUMP@vmgump]: Project jakarta-bsf3 (in module jakarta-bsf3) failed
Date Tue, 27 Oct 2009 03:54:19 GMT
To whom it may engage...
        
This is an automated request, but not an unsolicited one. For 
more information please visit http://gump.apache.org/nagged.html, 
and/or contact the folk at general@gump.apache.org.

Project jakarta-bsf3 has an issue affecting its community integration.
This issue affects 1 projects,
 and has been outstanding for 49 runs.
The current state of this project is 'Failed', with reason 'Build Failed'.
For reference only, the following projects are affected by this:
    - jakarta-bsf3 :  Bean Scripting Framework


Full details are available at:
    http://vmgump.apache.org/gump/public/jakarta-bsf3/jakarta-bsf3/index.html

That said, some information snippets are provided here.

The following annotations (debug/informational/warning/error messages) were provided:
 -INFO- Optional dependency bsf-api failed with reason build failed
 -INFO- Optional dependency velocity-engine prerequisite failed with reason build failed
 -INFO- Optional dependency javax.servlet prerequisite failed with reason build failed
 -INFO- Optional dependency commons-collections failed with reason build failed
 -INFO- Optional dependency jython failed with reason build failed
 -INFO- Optional dependency groovy failed with reason missing build outputs
 -DEBUG- (Gump generated) Maven2 Settings in: /srv/gump/public/workspace/jakarta-bsf3/gump_mvn_settings.xml
 -INFO- Failed with reason build failed
 -DEBUG- Maven POM in: /srv/gump/public/workspace/jakarta-bsf3/pom.xml



The following work was performed:
http://vmgump.apache.org/gump/public/jakarta-bsf3/jakarta-bsf3/gump_work/build_jakarta-bsf3_jakarta-bsf3.html
Work Name: build_jakarta-bsf3_jakarta-bsf3 (Type: Build)
Work ended in a state of : Failed
Elapsed: 12 secs
Command Line: mvn --batch-mode --settings /srv/gump/public/workspace/jakarta-bsf3/gump_mvn_settings.xml
package 
[Working Directory: /srv/gump/public/workspace/jakarta-bsf3]
CLASSPATH: /usr/lib/jvm/java-6-sun/lib/tools.jar:/srv/gump/public/workspace/ant/dist/lib/ant-jmf.jar:/srv/gump/public/workspace/ant/dist/lib/ant-swing.jar:/srv/gump/public/workspace/ant/dist/lib/ant-apache-resolver.jar:/srv/gump/public/workspace/ant/dist/lib/ant-apache-xalan2.jar:/srv/gump/public/workspace/ant/dist/lib/ant-trax.jar:/srv/gump/public/workspace/ant/dist/lib/ant-junit.jar:/srv/gump/public/workspace/ant/dist/lib/ant-launcher.jar:/srv/gump/public/workspace/ant/dist/lib/ant-nodeps.jar:/srv/gump/public/workspace/ant/dist/lib/ant.jar:/srv/gump/packages/junit3.8.1/junit.jar:/srv/gump/public/workspace/xml-commons/java/build/resolver.jar:/srv/gump/public/workspace/asm/output/dist/lib/asm-analysis-27102009.jar:/srv/gump/public/workspace/asm/output/dist/lib/asm-util-27102009.jar:/srv/gump/public/workspace/asm/output/dist/lib/asm-xml-27102009.jar:/srv/gump/public/workspace/asm/output/dist/lib/asm-commons-27102009.jar:/srv/gump/public/workspace/asm/output/dist/lib/asm-271020
 09.jar:/srv/gump/public/workspace/asm/output/dist/lib/asm-tree-27102009.jar:bsf-api-gump-26102009.jar:commons-collections-gump-26102009.jar:/srv/gump/public/workspace/apache-commons/io/target/commons-io-27102009.jar:/srv/gump/public/workspace/commons-lang-2.x/target/commons-lang-2.4.jar:/srv/gump/public/workspace/groovy/target/groovy-1.7-beta-2-SNAPSHOT.jar:/srv/gump/public/workspace/jakarta-oro/jakarta-oro-27102009.jar:/srv/gump/public/workspace/tomcat-tc6/output/build/lib/servlet-api.jar:/srv/gump/public/workspace/jetty/jetty-client/target/jetty-client-7.0.1-SNAPSHOT.jar:/srv/gump/public/workspace/jetty/jetty-jaspi/target/jetty-jaspi-7.0.1-SNAPSHOT.jar:/srv/gump/public/workspace/jetty/jetty-xml/target/jetty-xml-7.0.1-SNAPSHOT.jar:/srv/gump/public/workspace/jetty/jetty-security/target/jetty-security-7.0.1-SNAPSHOT.jar:/srv/gump/public/workspace/jetty/jetty-policy/target/jetty-policy-7.0.1-SNAPSHOT.jar:/srv/gump/public/workspace/jetty/jetty-centralized-logging/target/jetty-c
 entralized-logging-7.0.1-SNAPSHOT.jar:/srv/gump/public/workspace/jetty/jetty-webapp/target/jetty-webapp-7.0.1-SNAPSHOT.jar:/srv/gump/public/workspace/jetty/jetty-http/target/jetty-http-7.0.1-SNAPSHOT.jar:/srv/gump/public/workspace/jetty/jetty-continuation/target/jetty-continuation-7.0.1-SNAPSHOT.jar:/srv/gump/public/workspace/jetty/jetty-annotations/target/jetty-annotations-7.0.1-SNAPSHOT.jar:/srv/gump/public/workspace/jetty/jetty-start/target/jetty-start-7.0.1-SNAPSHOT.jar:/srv/gump/public/workspace/jetty/jetty-util/target/jetty-util-7.0.1-SNAPSHOT.jar:/srv/gump/public/workspace/jetty/jetty-ajp/target/jetty-ajp-7.0.1-SNAPSHOT.jar:/srv/gump/public/workspace/jetty/jetty-webapp-logging/target/jetty-webapp-logging-7.0.1-SNAPSHOT.jar:/srv/gump/public/workspace/jetty/jetty-io/target/jetty-io-7.0.1-SNAPSHOT.jar:/srv/gump/public/workspace/jetty/jetty-plus/target/jetty-plus-7.0.1-SNAPSHOT.jar:/srv/gump/public/workspace/jetty/jetty-servlet/target/jetty-servlet-7.0.1-SNAPSHOT.jar:/srv
 /gump/public/workspace/jetty/jetty-rewrite/target/jetty-rewrite-7.0.1-SNAPSHOT.jar:/srv/gump/public/workspace/jetty/jetty-server/target/jetty-server-7.0.1-SNAPSHOT.jar:/srv/gump/public/workspace/jetty/jetty-jndi/target/jetty-jndi-7.0.1-SNAPSHOT.jar:/srv/gump/public/workspace/jetty/jetty-deploy/target/jetty-deploy-7.0.1-SNAPSHOT.jar:/srv/gump/public/workspace/jetty/jetty-jmx/target/jetty-jmx-7.0.1-SNAPSHOT.jar:/srv/gump/public/workspace/jetty/jetty-webapp-verifier/target/jetty-webapp-verifier-7.0.1-SNAPSHOT.jar:/srv/gump/public/workspace/jetty/jetty-servlets/target/jetty-servlets-7.0.1-SNAPSHOT.jar:/srv/gump/public/workspace/junit/dist/junit-27102009.jar:/srv/gump/public/workspace/jython/dist/jython-dev.jar:/srv/gump/packages/retroweaver-2.0.7/retroweaver-rt.jar:/srv/gump/packages/retroweaver-2.0.7/retroweaver.jar:/srv/gump/public/workspace/rhino/build/rhino_27102009/js.jar:velocity-gump-26102009.jar:velocity-dep-gump-26102009.jar:/srv/gump/public/workspace/ws-axis2-commons/a
 xiom/modules/axiom-impl/target/axiom-impl-1.2.9-SNAPSHOT.jar:/srv/gump/public/workspace/ws-axis2-commons/axiom/modules/axiom-api/target/axiom-api-1.2.9-SNAPSHOT.jar:/srv/gump/public/workspace/ws-axis2-commons/axiom/modules/axiom-dom/target/axiom-dom-1.2.9-SNAPSHOT.jar:/srv/gump/public/workspace/xml-commons/java/external/build/xml-apis-ext.jar
---------------------------------------------
[INFO] Copying 1 resource
[INFO] [compiler:testCompile]
[INFO] Nothing to compile - all classes are up to date
[INFO] [surefire:test]
[INFO] Surefire report directory: /srv/gump/public/workspace/jakarta-bsf3/bsf-api/target/surefire-reports

-------------------------------------------------------
 T E S T S
-------------------------------------------------------
Running org.apache.bsf.ScriptEngineManagerTest
Tests run: 11, Failures: 0, Errors: 4, Skipped: 0, Time elapsed: 0.109 sec <<< FAILURE!
Running org.apache.bsf.SimpleBindingsTest
Tests run: 3, Failures: 0, Errors: 1, Skipped: 0, Time elapsed: 0.01 sec <<< FAILURE!
Running org.apache.bsf.ScriptExceptionTest
Tests run: 4, Failures: 0, Errors: 2, Skipped: 0, Time elapsed: 0.011 sec <<< FAILURE!
Running org.apache.bsf.SimpleScriptContextTest
Tests run: 5, Failures: 0, Errors: 1, Skipped: 0, Time elapsed: 0.013 sec <<< FAILURE!
Running org.apache.bsf.AbstractScriptEngineTest
Tests run: 7, Failures: 0, Errors: 3, Skipped: 0, Time elapsed: 0.033 sec <<< FAILURE!

Results :

Tests in error: 
  testGetPut(org.apache.bsf.ScriptEngineManagerTest)
  testRegisterEngineExtension(org.apache.bsf.ScriptEngineManagerTest)
  testRegisterEngineName(org.apache.bsf.ScriptEngineManagerTest)
  testRegisterEngineMimeType(org.apache.bsf.ScriptEngineManagerTest)
  testValid(org.apache.bsf.SimpleBindingsTest)
  testException1(org.apache.bsf.ScriptExceptionTest)
  testException2(org.apache.bsf.ScriptExceptionTest)
  testBindings(org.apache.bsf.SimpleScriptContextTest)
  testGetBindings(org.apache.bsf.AbstractScriptEngineTest)
  testgetScriptContext(org.apache.bsf.AbstractScriptEngineTest)
  testPutGet(org.apache.bsf.AbstractScriptEngineTest)

Tests run: 30, Failures: 0, Errors: 11, Skipped: 0

[INFO] ------------------------------------------------------------------------
[ERROR] BUILD FAILURE
[INFO] ------------------------------------------------------------------------
[INFO] There are test failures.

Please refer to /srv/gump/public/workspace/jakarta-bsf3/bsf-api/target/surefire-reports for
the individual test results.
[INFO] ------------------------------------------------------------------------
[INFO] For more information, run Maven with the -e switch
[INFO] ------------------------------------------------------------------------
[INFO] Total time: 10 seconds
[INFO] Finished at: Tue Oct 27 02:54:18 PST 2009
[INFO] Final Memory: 12M/21M
[INFO] ------------------------------------------------------------------------
---------------------------------------------

To subscribe to this information via syndicated feeds:
- RSS: http://vmgump.apache.org/gump/public/jakarta-bsf3/jakarta-bsf3/rss.xml
- Atom: http://vmgump.apache.org/gump/public/jakarta-bsf3/jakarta-bsf3/atom.xml

============================== Gump Tracking Only ===
Produced by Gump version 2.3.
Gump Run 07000027102009, vmgump:vmgump-public:07000027102009
Gump E-mail Identifier (unique within run) #46.

--
Apache Gump
http://gump.apache.org/ [Instance: vmgump]

---------------------------------------------------------------------
To unsubscribe, e-mail: bsf-dev-unsubscribe@jakarta.apache.org
For additional commands, e-mail: bsf-dev-help@jakarta.apache.org


Mime
View raw message