jackrabbit-users mailing list archives

Site index · List index
Message view « Date » · « Thread »
Top « Date » · « Thread »
From "Trommen, Marcus" <Marcus.Trom...@actano.de>
Subject version 1.3.1 BUILD FAILED while unit tests e.g. testExportDocView_handler_session_skipBinary_noRecurse
Date Fri, 24 Aug 2007 16:22:12 GMT
> Hello,
> 
> while source build of JackRabbit for Sun Java 1.4.2_06 (target system
> need) I run into BUILD FAILED problem (details see below).
> 
> Any suggestions or advice is greatly appreciated!
> 
> Best regards,
> Marcus Trommen
> 
> --
> Marcus Trommen
> Marcus.Trommen@actano.de
> 
> 
> PROBLEM DETAILS
> 
> 1) Build environment:
>    Maven version: 2.0.7
>    Java version: 1.4.2_06
>    OS name: "windows xp" version: "5.1" arch: "x86"
> 
> 2) from Subversion I have checked out JackRabbit as tagged version
> 1.3.1
> 
> 3) as in readme file suggested I run from command line
>    mvn install
> 
>    But after a while maven quited the running job with a BUILD FAILED
> message.
>    You'll find the relevant console output below.
> 
> -------------------------------------------------------
>  T E S T S
> -------------------------------------------------------
> Running org.apache.jackrabbit.core.util.TestAll
> Tests run: 3, Failures: 0, Errors: 0, Skipped: 0, Time elapsed: 0.11
> sec
> Running org.apache.jackrabbit.core.nodetype.compact.TestAll
> Tests run: 1, Failures: 0, Errors: 0, Skipped: 0, Time elapsed: 0.078
> sec
> Running org.apache.jackrabbit.test.TestAll
> [Fatal Error] :1:10: Attribute name "is" associated with an element
> type "this" must be followed by the ' = ' character.
> 
> [Fatal Error] :1:10: Attribute name "is" associated with an element
> type "this" must be followed by the ' = ' character.
> 
> [Fatal Error] :-1:-1: Premature end of file.
> [Fatal Error] :-1:-1: Premature end of file.
> Tests run: 1055, Failures: 8, Errors: 0, Skipped: 0, Time elapsed:
> 82.657 sec <<< FAILURE!
> Running org.apache.jackrabbit.core.xml.TestAll
> Tests run: 2, Failures: 0, Errors: 0, Skipped: 0, Time elapsed: 0.125
> sec
> Running org.apache.jackrabbit.core.query.TestAll
> Tests run: 102, Failures: 0, Errors: 0, Skipped: 0, Time elapsed:
> 15.359 sec
> Running org.apache.jackrabbit.core.observation.TestAll
> Tests run: 10, Failures: 0, Errors: 0, Skipped: 0, Time elapsed: 0.422
> sec
> Running org.apache.jackrabbit.core.config.TestAll
> Tests run: 9, Failures: 0, Errors: 0, Skipped: 0, Time elapsed: 0.875
> sec
> Running org.apache.jackrabbit.core.nodetype.xml.TestAll
> Tests run: 34, Failures: 0, Errors: 0, Skipped: 0, Time elapsed: 0.719
> sec
> Running org.apache.jackrabbit.core.TestAll
> Tests run: 29, Failures: 0, Errors: 0, Skipped: 0, Time elapsed: 0.828
> sec
> Running org.apache.jackrabbit.core.state.TestAll
> Tests run: 3, Failures: 0, Errors: 0, Skipped: 0, Time elapsed: 0.015
> sec
> 
> Results :   
> Failed tests:
>  
> testExportDocView_handler_session_skipBinary_noRecurse(org.apache.jack
> rabbit.test.api.ExportDocViewTest)
>  
> testExportDocView_handler_session_skipBinary_recurse(org.apache.jackra
> bbit.test.api.ExportDocViewTest)
>  
> testExportDocView_handler_session_saveBinary_noRecurse(org.apache.jack
> rabbit.test.api.ExportDocViewTest)
>  
> testExportDocView_handler_session_saveBinary_recurse(org.apache.jackra
> bbit.test.api.ExportDocViewTest)
>  
> testExportDocView_stream_session_skipBinary_recurse(org.apache.jackrab
> bit.test.api.ExportDocViewTest)
>  
> testExportDocView_stream_session_skipBinary_noRecurse(org.apache.jackr
> abbit.test.api.ExportDocViewTest)
>  
> testExportDocView_stream_session_saveBinary_noRecurse(org.apache.jackr
> abbit.test.api.ExportDocViewTest)
>  
> testExportDocView_stream_session_saveBinary_recurse(org.apache.jackrab
> bit.test.api.ExportDocViewTest)

Mime
  • Unnamed multipart/alternative (inline, None, 0 bytes)
View raw message