jackrabbit-oak-issues mailing list archives

Site index · List index
Message view « Date » · « Thread »
Top « Date » · « Thread »
From "Davide Giannella (JIRA)" <j...@apache.org>
Subject [jira] [Updated] (OAK-6833) LuceneIndex*Test failures
Date Tue, 04 Jun 2019 15:34:04 GMT

     [ https://issues.apache.org/jira/browse/OAK-6833?page=com.atlassian.jira.plugin.system.issuetabpanels:all-tabpanel
]

Davide Giannella updated OAK-6833:
----------------------------------
    Fix Version/s: 1.16.0

> LuceneIndex*Test failures
> -------------------------
>
>                 Key: OAK-6833
>                 URL: https://issues.apache.org/jira/browse/OAK-6833
>             Project: Jackrabbit Oak
>          Issue Type: Bug
>          Components: lucene
>            Reporter: Julian Reschke
>            Assignee: Vikas Saurabh
>            Priority: Major
>             Fix For: 1.14.0, 1.16.0
>
>         Attachments: TEST-org.apache.jackrabbit.oak.plugins.index.lucene.LuceneIndexAugmentTest.xml,
TEST-org.apache.jackrabbit.oak.plugins.index.lucene.LuceneIndexAugmentTest.xml, TEST-org.apache.jackrabbit.oak.plugins.index.lucene.LuceneIndexAugmentTest.xml,
TEST-org.apache.jackrabbit.oak.plugins.index.lucene.LuceneIndexAugmentTest.xml, TEST-org.apache.jackrabbit.oak.plugins.index.lucene.LuceneIndexAugmentTest.xml,
TEST-org.apache.jackrabbit.oak.plugins.index.lucene.LuceneIndexEditorTest.xml, TEST-org.apache.jackrabbit.oak.plugins.index.lucene.LuceneIndexEditorTest.xml,
TEST-org.apache.jackrabbit.oak.plugins.index.lucene.LuceneIndexEditorTest.xml, TEST-org.apache.jackrabbit.oak.plugins.index.lucene.LuceneIndexEditorTest.xml,
TEST-org.apache.jackrabbit.oak.plugins.index.lucene.LuceneIndexEditorTest.xml, TEST-org.apache.jackrabbit.oak.plugins.index.lucene.LuceneIndexEditorTest.xml,
TEST-org.apache.jackrabbit.oak.plugins.index.lucene.LuceneIndexEditorTest.xml, org.apache.jackrabbit.oak.plugins.index.lucene.LuceneIndexAugmentTest.txt,
org.apache.jackrabbit.oak.plugins.index.lucene.LuceneIndexAugmentTest.txt, org.apache.jackrabbit.oak.plugins.index.lucene.LuceneIndexAugmentTest.txt,
org.apache.jackrabbit.oak.plugins.index.lucene.LuceneIndexAugmentTest.txt, org.apache.jackrabbit.oak.plugins.index.lucene.LuceneIndexAugmentTest.txt,
org.apache.jackrabbit.oak.plugins.index.lucene.LuceneIndexEditorTest.txt, org.apache.jackrabbit.oak.plugins.index.lucene.LuceneIndexEditorTest.txt,
org.apache.jackrabbit.oak.plugins.index.lucene.LuceneIndexEditorTest.txt, org.apache.jackrabbit.oak.plugins.index.lucene.LuceneIndexEditorTest.txt,
org.apache.jackrabbit.oak.plugins.index.lucene.LuceneIndexEditorTest.txt, org.apache.jackrabbit.oak.plugins.index.lucene.LuceneIndexEditorTest.txt,
org.apache.jackrabbit.oak.plugins.index.lucene.LuceneIndexEditorTest.txt, unit-tests.log,
unit-tests.log, unit-tests.log
>
>
> {noformat}
> [ERROR] testLuceneWithRelativeProperty[1: useBlobStore (false)](org.apache.jackrabbit.oak.plugins.index.lucene.LuceneIndexEditorTest)
 Time elapsed: 0.063 s  <<< FAILURE!
> java.lang.AssertionError: expected:</test> but was:<null>
>         at org.apache.jackrabbit.oak.plugins.index.lucene.LuceneIndexEditorTest.testLuceneWithRelativeProperty(LuceneIndexEditorTest.java:341)
> {noformat}



--
This message was sent by Atlassian JIRA
(v7.6.3#76005)

Mime
View raw message