jackrabbit-oak-issues mailing list archives

Site index · List index
Message view « Date » · « Thread »
Top « Date » · « Thread »
From "Marcel Reutegger (JIRA)" <j...@apache.org>
Subject [jira] [Updated] (OAK-7938) Test failure: MBeanIT.testClientAndServerEmptyConfig
Date Wed, 05 Dec 2018 07:35:00 GMT

     [ https://issues.apache.org/jira/browse/OAK-7938?page=com.atlassian.jira.plugin.system.issuetabpanels:all-tabpanel
]

Marcel Reutegger updated OAK-7938:
----------------------------------
    Fix Version/s: 1.10
      Description: 
No description is provided

The build Jackrabbit Oak #1826 has failed.
First failed run: [Jackrabbit Oak #1826|https://builds.apache.org/job/Jackrabbit%20Oak/1826/]
[console log|https://builds.apache.org/job/Jackrabbit%20Oak/1826/console]

{noformat}
[ERROR] Tests run: 4, Failures: 1, Errors: 0, Skipped: 0, Time elapsed: 7.782 s <<<
FAILURE! - in org.apache.jackrabbit.oak.segment.standby.MBeanIT
[ERROR] testClientAndServerEmptyConfig(org.apache.jackrabbit.oak.segment.standby.MBeanIT)
 Time elapsed: 2.499 s  <<< FAILURE!
org.junit.ComparisonFailure: expected:<[0]> but was:<[1]>
	at org.junit.Assert.assertEquals(Assert.java:115)
	at org.junit.Assert.assertEquals(Assert.java:144)
	at org.apache.jackrabbit.oak.segment.standby.MBeanIT.testClientAndServerEmptyConfig(MBeanIT.java:194)
{noformat}

  was:
No description is provided

The build Jackrabbit Oak #1826 has failed.
First failed run: [Jackrabbit Oak #1826|https://builds.apache.org/job/Jackrabbit%20Oak/1826/]
[console log|https://builds.apache.org/job/Jackrabbit%20Oak/1826/console]

      Component/s: segment-tar
          Summary: Test failure: MBeanIT.testClientAndServerEmptyConfig  (was: Build Jackrabbit
Oak #1826 failed)

> Test failure: MBeanIT.testClientAndServerEmptyConfig
> ----------------------------------------------------
>
>                 Key: OAK-7938
>                 URL: https://issues.apache.org/jira/browse/OAK-7938
>             Project: Jackrabbit Oak
>          Issue Type: Bug
>          Components: continuous integration, segment-tar
>            Reporter: Hudson
>            Priority: Major
>             Fix For: 1.10
>
>
> No description is provided
> The build Jackrabbit Oak #1826 has failed.
> First failed run: [Jackrabbit Oak #1826|https://builds.apache.org/job/Jackrabbit%20Oak/1826/]
[console log|https://builds.apache.org/job/Jackrabbit%20Oak/1826/console]
> {noformat}
> [ERROR] Tests run: 4, Failures: 1, Errors: 0, Skipped: 0, Time elapsed: 7.782 s <<<
FAILURE! - in org.apache.jackrabbit.oak.segment.standby.MBeanIT
> [ERROR] testClientAndServerEmptyConfig(org.apache.jackrabbit.oak.segment.standby.MBeanIT)
 Time elapsed: 2.499 s  <<< FAILURE!
> org.junit.ComparisonFailure: expected:<[0]> but was:<[1]>
> 	at org.junit.Assert.assertEquals(Assert.java:115)
> 	at org.junit.Assert.assertEquals(Assert.java:144)
> 	at org.apache.jackrabbit.oak.segment.standby.MBeanIT.testClientAndServerEmptyConfig(MBeanIT.java:194)
> {noformat}



--
This message was sent by Atlassian JIRA
(v7.6.3#76005)

Mime
View raw message