jackrabbit-oak-issues mailing list archives

Site index · List index
Message view « Date » · « Thread »
Top « Date » · « Thread »
From "Davide Giannella (JIRA)" <j...@apache.org>
Subject [jira] [Updated] (OAK-6288) Test failure: upgrade tests failing: Failed to copy content
Date Thu, 01 Nov 2018 11:26:02 GMT

     [ https://issues.apache.org/jira/browse/OAK-6288?page=com.atlassian.jira.plugin.system.issuetabpanels:all-tabpanel
]

Davide Giannella updated OAK-6288:
----------------------------------
    Fix Version/s: 1.9.11

> Test failure: upgrade tests failing: Failed to copy content
> -----------------------------------------------------------
>
>                 Key: OAK-6288
>                 URL: https://issues.apache.org/jira/browse/OAK-6288
>             Project: Jackrabbit Oak
>          Issue Type: Bug
>          Components: continuous integration, upgrade
>            Reporter: Hudson
>            Priority: Major
>              Labels: CI, jenkins, test-failure
>             Fix For: 1.10, 1.9.10, 1.9.11
>
>
> Jenkins CI failure: https://builds.apache.org/view/J/job/Jackrabbit%20Oak/
> The build Jackrabbit Oak #364 has failed.
> First failed run: [Jackrabbit Oak #364|https://builds.apache.org/job/Jackrabbit%20Oak/364/]
[console log|https://builds.apache.org/job/Jackrabbit%20Oak/364/console]
> Failing tests:
> {noformat}
>     org.apache.jackrabbit.oak.upgrade.CopyCheckpointsTest.validateMigration[Suppress
the warning]
>     org.apache.jackrabbit.oak.upgrade.CopyCheckpointsTest.validateMigration[Source data
store defined, checkpoints migrated]
>     org.apache.jackrabbit.oak.upgrade.IgnoreMissingBinariesTest.validateMigration
>     org.apache.jackrabbit.oak.upgrade.UpgradeOldSegmentTest.upgradeFrom10
>     org.apache.jackrabbit.oak.upgrade.cli.SegmentTarToSegmentTest.validateMigration
>     org.apache.jackrabbit.oak.upgrade.cli.SegmentToJdbcTest.validateMigration
>     org.apache.jackrabbit.oak.upgrade.cli.SegmentToSegmentTarTest.validateMigration
>     org.apache.jackrabbit.oak.upgrade.cli.SegmentToSegmentTarWithMissingDestinationDirectoryTest.validateMigration
>     org.apache.jackrabbit.oak.upgrade.cli.SegmentToSegmentTest.validateMigration
>     org.apache.jackrabbit.oak.upgrade.cli.SegmentToSegmentWithMissingDestinationDirectoryTest.validateMigration
>     org.apache.jackrabbit.oak.upgrade.cli.blob.CopyBinariesTest.validateMigration[Copy
references, no blobstores defined, segment -> segment]
>     org.apache.jackrabbit.oak.upgrade.cli.blob.CopyBinariesTest.validateMigration[Copy
references, no blobstores defined, segment-tar -> segment-tar]
>     org.apache.jackrabbit.oak.upgrade.cli.blob.CopyBinariesTest.validateMigration[Copy
references, no blobstores defined, segment -> segment-tar]
>     org.apache.jackrabbit.oak.upgrade.cli.blob.CopyBinariesTest.validateMigration[Copy
embedded to embedded, no blobstores defined]
>     org.apache.jackrabbit.oak.upgrade.cli.blob.CopyBinariesTest.validateMigration[Copy
embedded to external, no blobstores defined]
>     org.apache.jackrabbit.oak.upgrade.cli.blob.CopyBinariesTest.validateMigration[Copy
references, src blobstore defined]
>     org.apache.jackrabbit.oak.upgrade.cli.blob.CopyBinariesTest.validateMigration[Copy
external to embedded, src blobstore defined]
>     org.apache.jackrabbit.oak.upgrade.cli.blob.CopyBinariesTest.validateMigration[Copy
external to external, src blobstore defined]
>     org.apache.jackrabbit.oak.upgrade.cli.blob.FbsToFbsTest.validateMigration
>     org.apache.jackrabbit.oak.upgrade.cli.blob.FbsToFdsTest.validateMigration
>     org.apache.jackrabbit.oak.upgrade.cli.blob.FdsToFbsTest.validateMigration
> {noformat}
> All seem to fail with
> {noformat}
> [ERROR] Tests run: 1, Failures: 0, Errors: 1, Skipped: 0, Time elapsed: 3.737 s <<<
FAILURE! - in org.apache.jackrabbit.oak.upgrade.cli.SegmentTarToSegmentTest
> [ERROR] validateMigration(org.apache.jackrabbit.oak.upgrade.cli.SegmentTarToSegmentTest)
 Time elapsed: 3.73 s  <<< ERROR!
> java.lang.RuntimeException: javax.jcr.RepositoryException: Failed to copy content
> Caused by: javax.jcr.RepositoryException: Failed to copy content
> Caused by: java.lang.IllegalArgumentException
> {noformat}



--
This message was sent by Atlassian JIRA
(v7.6.3#76005)

Mime
View raw message