jackrabbit-oak-issues mailing list archives

Site index · List index
Message view « Date » · « Thread »
Top « Date » · « Thread »
From "Julian Reschke (JIRA)" <j...@apache.org>
Subject [jira] [Updated] (OAK-7651) oak-solr-core test failures with java 11
Date Mon, 23 Jul 2018 12:17:00 GMT

     [ https://issues.apache.org/jira/browse/OAK-7651?page=com.atlassian.jira.plugin.system.issuetabpanels:all-tabpanel
]

Julian Reschke updated OAK-7651:
--------------------------------
    Labels: candidate_oak_1_8  (was: )

> oak-solr-core test failures with java 11
> ----------------------------------------
>
>                 Key: OAK-7651
>                 URL: https://issues.apache.org/jira/browse/OAK-7651
>             Project: Jackrabbit Oak
>          Issue Type: Task
>          Components: solr
>            Reporter: Julian Reschke
>            Assignee: Julian Reschke
>            Priority: Minor
>              Labels: candidate_oak_1_8
>             Fix For: 1.10, 1.9.7
>
>
> {noformat}
> [ERROR] Tests run: 29, Failures: 2, Errors: 0, Skipped: 2, Time elapsed: 156.134 s <<<
FAILURE! - in org.apache.jackrabbit.oak.plugins.index.solr.query.SolrIndexIT
> [ERROR] testNativeMLTQueryWithStream(org.apache.jackrabbit.oak.plugins.index.solr.query.SolrIndexIT)
 Time elapsed: 5.501 s  <<< FAILURE!
> org.junit.ComparisonFailure: expected:</test/[a]> but was:</test/[b]>
>         at org.apache.jackrabbit.oak.plugins.index.solr.query.SolrIndexIT.testNativeMLTQueryWithStream(SolrIndexIT.java:281)
> [ERROR] testNativeMLTQuery(org.apache.jackrabbit.oak.plugins.index.solr.query.SolrIndexIT)
 Time elapsed: 5.523 s  <<< FAILURE!
> org.junit.ComparisonFailure: expected:</test/[a]> but was:</test/[b]>
>         at org.apache.jackrabbit.oak.plugins.index.solr.query.SolrIndexIT.testNativeMLTQuery(SolrIndexIT.java:259)
> {noformat}



--
This message was sent by Atlassian JIRA
(v7.6.3#76005)

Mime
View raw message