jackrabbit-oak-issues mailing list archives

Site index · List index
Message view « Date » · « Thread »
Top « Date » · « Thread »
From "Amit Jain (JIRA)" <j...@apache.org>
Subject [jira] [Updated] (OAK-7646) UploadStagingCacheTest#testConcurrentSameAddRequest fails intermittently
Date Mon, 23 Jul 2018 04:24:00 GMT

     [ https://issues.apache.org/jira/browse/OAK-7646?page=com.atlassian.jira.plugin.system.issuetabpanels:all-tabpanel
]

Amit Jain updated OAK-7646:
---------------------------
    Fix Version/s: 1.9.7
                   1.10

> UploadStagingCacheTest#testConcurrentSameAddRequest fails intermittently
> ------------------------------------------------------------------------
>
>                 Key: OAK-7646
>                 URL: https://issues.apache.org/jira/browse/OAK-7646
>             Project: Jackrabbit Oak
>          Issue Type: Test
>          Components: blob-plugins
>            Reporter: Vikas Saurabh
>            Assignee: Amit Jain
>            Priority: Minor
>             Fix For: 1.10, 1.9.7
>
>
> As noted on VOTE mail thread for 1.9.6 \[0], {{UploadStagingCacheTest#testConcurrentSameAddRequest}}
fails intermittently as:
> {noformat}
> [INFO] Running org.apache.jackrabbit.oak.plugins.blob.UploadStagingCacheTest
> [ERROR] Tests run: 22, Failures: 1, Errors: 0, Skipped: 0, Time
> elapsed: 15.595 s <<< FAILURE! - in
> org.apache.jackrabbit.oak.plugins.blob.UploadStagingCacheTest
> [ERROR] testConcurrentSameAddRequest(org.apache.jackrabbit.oak.plugins.blob.UploadStagingCacheTest)
>  Time elapsed: 0.214 s  <<< FAILURE!
> java.lang.AssertionError: expected:<2> but was:<1>
>         at org.apache.jackrabbit.oak.plugins.blob.UploadStagingCacheTest.assertCacheStats(UploadStagingCacheTest.java:843)
>         at org.apache.jackrabbit.oak.plugins.blob.UploadStagingCacheTest.testConcurrentSameAddRequest(UploadStagingCacheTest.java:456)
> [INFO]
> [INFO] Results:
> [INFO]
> [ERROR] Failures:
> [ERROR]   UploadStagingCacheTest.testConcurrentSameAddRequest:456->assertCacheStats:843
> expected:<2> but was:<1>
> [INFO]
> [ERROR] Tests run: 179, Failures: 1, Errors: 0, Skipped: 0
> [INFO]
> [INFO] ------------------------------------------------------------------------
> [INFO] Reactor Summary:
> [INFO]
> [INFO] Oak Parent POM ..................................... SUCCESS
> [01:22 min]
> ....
> ....
> [INFO] Oak Blob Plugins ................................... FAILURE [
> 38.111 s]
> [INFO] Oak Core ........................................... SKIPPED
> ....
> ....
> [INFO] Jackrabbit Oak ..................................... SKIPPED
> [INFO] ------------------------------------------------------------------------
> [INFO] BUILD FAILURE
> [INFO] ------------------------------------------------------------------------
> {noformat}
> [~amjain], should I assign it to you?
> \[0]: https://lists.apache.org/thread.html/42e50349cd7e559f0b579093e56e421e6127a2fdec563debc393fcdd@%3Coak-dev.jackrabbit.apache.org%3E



--
This message was sent by Atlassian JIRA
(v7.6.3#76005)

Mime
View raw message