jackrabbit-oak-issues mailing list archives

Site index · List index
Message view « Date » · « Thread »
Top « Date » · « Thread »
From "Andrei Dulceanu (JIRA)" <j...@apache.org>
Subject [jira] [Assigned] (OAK-7642) oak-pojosr fails when run twice
Date Wed, 18 Jul 2018 05:59:00 GMT

     [ https://issues.apache.org/jira/browse/OAK-7642?page=com.atlassian.jira.plugin.system.issuetabpanels:all-tabpanel
]

Andrei Dulceanu reassigned OAK-7642:
------------------------------------

    Assignee: Andrei Dulceanu

> oak-pojosr fails when run twice
> -------------------------------
>
>                 Key: OAK-7642
>                 URL: https://issues.apache.org/jira/browse/OAK-7642
>             Project: Jackrabbit Oak
>          Issue Type: Bug
>          Components: pojosr
>            Reporter: Julian Reschke
>            Assignee: Andrei Dulceanu
>            Priority: Major
>
> ...because segment store apparently creates the repository folder in the wrong location,
and thus doesn't get wiped out on "mvn clean".
> {noformat}
> [INFO] -------------------------------------------------------
> [INFO]  T E S T S
> [INFO] -------------------------------------------------------
> [INFO] Running org.apache.jackrabbit.oak.run.osgi.ConfigTest
> [INFO] Tests run: 3, Failures: 0, Errors: 0, Skipped: 0, Time elapsed: 2 s - in org.apache.jackrabbit.oak.run.osgi.ConfigTest
> [INFO] Running org.apache.jackrabbit.oak.run.osgi.DocumentNodeStoreConfigTest
> [WARNING] Tests run: 10, Failures: 0, Errors: 0, Skipped: 2, Time elapsed: 10.327 s -
in org.apache.jackrabbit.oak.run.osgi.DocumentNodeStoreConfigTest
> [INFO] Running org.apache.jackrabbit.oak.run.osgi.HybridIndexDisabledTest
> [INFO] Tests run: 1, Failures: 0, Errors: 0, Skipped: 0, Time elapsed: 1.149 s - in org.apache.jackrabbit.oak.run.osgi.HybridIndexDisabledTest
> [INFO] Running org.apache.jackrabbit.oak.run.osgi.JaasConfigSpiTest
> [INFO] Tests run: 1, Failures: 0, Errors: 0, Skipped: 0, Time elapsed: 0.475 s - in org.apache.jackrabbit.oak.run.osgi.JaasConfigSpiTest
> [INFO] Running org.apache.jackrabbit.oak.run.osgi.JsonConfigRepFactoryTest
> [INFO] Tests run: 1, Failures: 0, Errors: 0, Skipped: 0, Time elapsed: 0.547 s - in org.apache.jackrabbit.oak.run.osgi.JsonConfigRepFactoryTest
> [INFO] Running org.apache.jackrabbit.oak.run.osgi.LuceneSupportTest
> [ERROR] Tests run: 1, Failures: 0, Errors: 1, Skipped: 0, Time elapsed: 0.518 s <<<
FAILURE! - in org.apache.jackrabbit.oak.run.osgi.LuceneSupportTest
> [ERROR] fullTextSearch(org.apache.jackrabbit.oak.run.osgi.LuceneSupportTest)  Time elapsed:
0.518 s  <<< ERROR!
> javax.jcr.ItemExistsException: myFile
>         at org.apache.jackrabbit.oak.run.osgi.LuceneSupportTest.fullTextSearch(LuceneSupportTest.groovy:65)
> [INFO] Running org.apache.jackrabbit.oak.run.osgi.MBeanIntegrationTest
> [INFO] Tests run: 1, Failures: 0, Errors: 0, Skipped: 0, Time elapsed: 0.522 s - in org.apache.jackrabbit.oak.run.osgi.MBeanIntegrationTest
> [INFO] Running org.apache.jackrabbit.oak.run.osgi.NodeStoreConfigTest
> [INFO] Tests run: 1, Failures: 0, Errors: 0, Skipped: 0, Time elapsed: 0.36 s - in org.apache.jackrabbit.oak.run.osgi.NodeStoreConfigTest
> [INFO] Running org.apache.jackrabbit.oak.run.osgi.OakOSGiRepositoryFactoryTest
> [INFO] Tests run: 1, Failures: 0, Errors: 0, Skipped: 0, Time elapsed: 1.545 s - in org.apache.jackrabbit.oak.run.osgi.OakOSGiRepositoryFactoryTest
> [INFO] Running org.apache.jackrabbit.oak.run.osgi.PropertyIndexReindexingTest
> [ERROR] Tests run: 1, Failures: 0, Errors: 1, Skipped: 0, Time elapsed: 6.374 s <<<
FAILURE! - in org.apache.jackrabbit.oak.run.osgi.PropertyIndexReindexingTest
> [ERROR] propertyIndexState(org.apache.jackrabbit.oak.run.osgi.PropertyIndexReindexingTest)
 Time elapsed: 6.358 s  <<< ERROR!
> javax.jcr.ItemExistsException: a1
>         at org.apache.jackrabbit.oak.run.osgi.PropertyIndexReindexingTest.propertyIndexState(PropertyIndexReindexingTest.groovy:50)
> [INFO] Running org.apache.jackrabbit.oak.run.osgi.RepositoryClosedTest
> [INFO] Tests run: 1, Failures: 0, Errors: 0, Skipped: 0, Time elapsed: 5.595 s - in org.apache.jackrabbit.oak.run.osgi.RepositoryClosedTest
> [INFO] Running org.apache.jackrabbit.oak.run.osgi.RepositoryShutdownTest
> [INFO] Tests run: 2, Failures: 0, Errors: 0, Skipped: 0, Time elapsed: 0.515 s - in org.apache.jackrabbit.oak.run.osgi.RepositoryShutdownTest
> [INFO] Running org.apache.jackrabbit.oak.run.osgi.SecurityProviderRegistrationTest
> [INFO] Tests run: 11, Failures: 0, Errors: 0, Skipped: 0, Time elapsed: 2.421 s - in
org.apache.jackrabbit.oak.run.osgi.SecurityProviderRegistrationTest
> [INFO] Running org.apache.jackrabbit.oak.run.osgi.SegmentNodeStoreConfigTest
> [INFO] Tests run: 1, Failures: 0, Errors: 0, Skipped: 0, Time elapsed: 0.703 s - in org.apache.jackrabbit.oak.run.osgi.SegmentNodeStoreConfigTest
> [INFO] Running org.apache.jackrabbit.oak.run.osgi.SimpleRepositoryFactoryTest
> [INFO] Tests run: 1, Failures: 0, Errors: 0, Skipped: 0, Time elapsed: 0.481 s - in org.apache.jackrabbit.oak.run.osgi.SimpleRepositoryFactoryTest
> [INFO] Running org.apache.jackrabbit.oak.run.osgi.TarSegmentNodeStoreConfigTest
> [INFO] Tests run: 1, Failures: 0, Errors: 0, Skipped: 0, Time elapsed: 0.36 s - in org.apache.jackrabbit.oak.run.osgi.TarSegmentNodeStoreConfigTest
> [INFO] Running org.apache.jackrabbit.oak.run.osgi.TokenAuthenticationTest
> [INFO] Tests run: 1, Failures: 0, Errors: 0, Skipped: 0, Time elapsed: 5.471 s - in org.apache.jackrabbit.oak.run.osgi.TokenAuthenticationTest
> [INFO] Running org.apache.jackrabbit.oak.run.osgi.TrackerSupportTest
> [INFO] Tests run: 1, Failures: 0, Errors: 0, Skipped: 0, Time elapsed: 1.031 s - in org.apache.jackrabbit.oak.run.osgi.TrackerSupportTest
> [INFO]
> [INFO] Results:
> [INFO]
> [ERROR] Errors:
> [ERROR]   LuceneSupportTest.fullTextSearch:65 ▒ ItemExists myFile
> [ERROR]   PropertyIndexReindexingTest.propertyIndexState:50 ▒ ItemExists a1
> [INFO]
> [ERROR] Tests run: 40, Failures: 0, Errors: 2, Skipped: 2
> {noformat}



--
This message was sent by Atlassian JIRA
(v7.6.3#76005)

Mime
View raw message