jackrabbit-oak-issues mailing list archives

Site index · List index
Message view « Date » · « Thread »
Top « Date » · « Thread »
From "Alex Deparvu (JIRA)" <j...@apache.org>
Subject [jira] [Commented] (OAK-7507) Test failure UserPrincipalProviderWithCacheTest.testConcurrentLoginWithCacheRemoval
Date Tue, 05 Jun 2018 13:11:00 GMT

    [ https://issues.apache.org/jira/browse/OAK-7507?page=com.atlassian.jira.plugin.system.issuetabpanels:comment-tabpanel&focusedCommentId=16501742#comment-16501742
] 

Alex Deparvu commented on OAK-7507:
-----------------------------------

{noformat}
[ERROR] Tests run: 36, Failures: 0, Errors: 1, Skipped: 0, Time elapsed: 3.571 s <<<
FAILURE! - in org.apache.jackrabbit.oak.security.user.UserPrincipalProviderWithCacheTest
[ERROR] testConcurrentLoginWithCacheRemoval(org.apache.jackrabbit.oak.security.user.UserPrincipalProviderWithCacheTest)
 Time elapsed: 0.162 s  <<< ERROR!
java.lang.OutOfMemoryError: unable to create new native thread
	at org.apache.jackrabbit.oak.security.user.UserPrincipalProviderWithCacheTest.testConcurrentLoginWithCacheRemoval(UserPrincipalProviderWithCacheTest.java:589)
{noformat}

> Test failure UserPrincipalProviderWithCacheTest.testConcurrentLoginWithCacheRemoval
> -----------------------------------------------------------------------------------
>
>                 Key: OAK-7507
>                 URL: https://issues.apache.org/jira/browse/OAK-7507
>             Project: Jackrabbit Oak
>          Issue Type: Bug
>          Components: continuous integration
>            Reporter: Hudson
>            Priority: Major
>
> No description is provided
> The build Jackrabbit Oak #1456 has failed.
> First failed run: [Jackrabbit Oak #1456|https://builds.apache.org/job/Jackrabbit%20Oak/1456/]
[console log|https://builds.apache.org/job/Jackrabbit%20Oak/1456/console]



--
This message was sent by Atlassian JIRA
(v7.6.3#76005)

Mime
View raw message