jackrabbit-oak-dev mailing list archives

Site index · List index
Message view « Date » · « Thread »
Top « Date » · « Thread »
From Apache Jenkins Server <jenk...@builds.apache.org>
Subject BUILD FAILURE: Jackrabbit Oak - Build # 954 - Still Failing
Date Wed, 08 Nov 2017 11:01:10 GMT
The Apache Jenkins build system has built Jackrabbit Oak (build #954)

Status: Still Failing

Check console output at https://builds.apache.org/job/Jackrabbit%20Oak/954/ to view the results.

Changes:
[tommaso] OAK-6710 - more debug logs for stats and mitigations

 

Test results:
1 tests failed.
FAILED:  org.apache.jackrabbit.oak.segment.standby.ExternalPrivateStoreIT.testSyncFailingDueToTooShortTimeout

Error Message:
expected:<1> but was:<0>

Stack Trace:
java.lang.AssertionError: expected:<1> but was:<0>
	at org.apache.jackrabbit.oak.segment.standby.ExternalPrivateStoreIT.testSyncFailingDueToTooShortTimeout(ExternalPrivateStoreIT.java:88)
Mime
  • Unnamed multipart/mixed (inline, None, 0 bytes)
View raw message