jackrabbit-oak-dev mailing list archives

Site index · List index
Message view « Date » · « Thread »
Top « Date » · « Thread »
From Alex Parvulescu <alex.parvule...@gmail.com>
Subject Re: jackrabbit-oak build #4085: Errored
Date Thu, 10 Apr 2014 17:55:47 GMT
this build timed out, but the previous one failed and I can see the same
error locally:


Running org.apache.jackrabbit.oak.upgrade.RepositoryGroupMemberUpgradeTest
Tests run: 3, Failures: 0, Errors: 3, Skipped: 0, Time elapsed: 97.983 sec
<<< FAILURE!
verifyMembers(org.apache.jackrabbit.oak.upgrade.RepositoryGroupMemberUpgradeTest)
 Time elapsed: 41.335 sec  <<< ERROR!
javax.jcr.RepositoryException: Failed to copy content
at
org.apache.jackrabbit.oak.upgrade.RepositoryUpgrade.copy(RepositoryUpgrade.java:250)
at
org.apache.jackrabbit.oak.upgrade.RepositoryUpgrade.copy(RepositoryUpgrade.java:169)
at
org.apache.jackrabbit.oak.upgrade.RepositoryUpgrade.copy(RepositoryUpgrade.java:154)
at
org.apache.jackrabbit.oak.upgrade.AbstractRepositoryUpgradeTest.upgradeRepository(AbstractRepositoryUpgradeTest.java:85)
at sun.reflect.NativeMethodAccessorImpl.invoke0(Native Method)
at
sun.reflect.NativeMethodAccessorImpl.invoke(NativeMethodAccessorImpl.java:57)
at
sun.reflect.DelegatingMethodAccessorImpl.invoke(DelegatingMethodAccessorImpl.java:43)
at java.lang.reflect.Method.invoke(Method.java:606)
at
org.junit.runners.model.FrameworkMethod$1.runReflectiveCall(FrameworkMethod.java:45)
at
org.junit.internal.runners.model.ReflectiveCallable.run(ReflectiveCallable.java:15)
at
org.junit.runners.model.FrameworkMethod.invokeExplosively(FrameworkMethod.java:42)
at
org.junit.internal.runners.statements.RunBefores.evaluate(RunBefores.java:27)
at org.junit.runners.ParentRunner.runLeaf(ParentRunner.java:263)
at
org.junit.runners.BlockJUnit4ClassRunner.runChild(BlockJUnit4ClassRunner.java:68)
at
org.junit.runners.BlockJUnit4ClassRunner.runChild(BlockJUnit4ClassRunner.java:47)
at org.junit.runners.ParentRunner$3.run(ParentRunner.java:231)
at org.junit.runners.ParentRunner$1.schedule(ParentRunner.java:60)
at org.junit.runners.ParentRunner.runChildren(ParentRunner.java:229)
at org.junit.runners.ParentRunner.access$000(ParentRunner.java:50)
at org.junit.runners.ParentRunner$2.evaluate(ParentRunner.java:222)
at
org.junit.internal.runners.statements.RunBefores.evaluate(RunBefores.java:28)
at org.junit.runners.ParentRunner.run(ParentRunner.java:300)
at
org.apache.maven.surefire.junit4.JUnit4Provider.execute(JUnit4Provider.java:252)
at
org.apache.maven.surefire.junit4.JUnit4Provider.executeTestSet(JUnit4Provider.java:141)
at
org.apache.maven.surefire.junit4.JUnit4Provider.invoke(JUnit4Provider.java:112)
at sun.reflect.NativeMethodAccessorImpl.invoke0(Native Method)
at
sun.reflect.NativeMethodAccessorImpl.invoke(NativeMethodAccessorImpl.java:57)
at
sun.reflect.DelegatingMethodAccessorImpl.invoke(DelegatingMethodAccessorImpl.java:43)
at java.lang.reflect.Method.invoke(Method.java:606)
at
org.apache.maven.surefire.util.ReflectionUtils.invokeMethodWithArray(ReflectionUtils.java:189)
at
org.apache.maven.surefire.booter.ProviderFactory$ProviderProxy.invoke(ProviderFactory.java:165)
at
org.apache.maven.surefire.booter.ProviderFactory.invokeProvider(ProviderFactory.java:85)
at
org.apache.maven.surefire.booter.ForkedBooter.runSuitesInProcess(ForkedBooter.java:115)
at org.apache.maven.surefire.booter.ForkedBooter.main(ForkedBooter.java:75)
Caused by: org.apache.jackrabbit.oak.api.CommitFailedException:
OakMerge0001: OakMerge0001: Failed to merge changes to the underlying store
(retries 7, 23585 ms)
at
org.apache.jackrabbit.oak.spi.state.AbstractNodeStoreBranch.merge(AbstractNodeStoreBranch.java:315)
at
org.apache.jackrabbit.oak.kernel.KernelNodeStoreBranch.merge(KernelNodeStoreBranch.java:135)
at
org.apache.jackrabbit.oak.kernel.KernelRootBuilder.merge(KernelRootBuilder.java:144)
at
org.apache.jackrabbit.oak.kernel.KernelNodeStore.merge(KernelNodeStore.java:164)
at
org.apache.jackrabbit.oak.upgrade.RepositoryUpgrade.copy(RepositoryUpgrade.java:248)
... 33 more
Caused by: java.lang.IllegalStateException: This builder does not exist:
default
at com.google.common.base.Preconditions.checkState(Preconditions.java:150)
at
org.apache.jackrabbit.oak.plugins.memory.MemoryNodeBuilder.setChildNode(MemoryNodeBuilder.java:326)
at
org.apache.jackrabbit.oak.plugins.memory.MemoryNodeBuilder.setChildNode(MemoryNodeBuilder.java:321)
at
org.apache.jackrabbit.oak.plugins.memory.MemoryNodeBuilder.child(MemoryNodeBuilder.java:309)
at
org.apache.jackrabbit.oak.security.authorization.permission.PermissionStoreEditor.updatePermissionEntries(PermissionStoreEditor.java:200)
at
org.apache.jackrabbit.oak.security.authorization.permission.PermissionHook.apply(PermissionHook.java:112)
at
org.apache.jackrabbit.oak.security.authorization.permission.PermissionHook.processCommit(PermissionHook.java:103)
at
org.apache.jackrabbit.oak.spi.commit.CompositeHook.processCommit(CompositeHook.java:60)
at
org.apache.jackrabbit.oak.spi.state.AbstractNodeStoreBranch$Persisted$1.call(AbstractNodeStoreBranch.java:596)
at
org.apache.jackrabbit.oak.spi.state.AbstractNodeStoreBranch$Persisted$1.call(AbstractNodeStoreBranch.java:593)
at
org.apache.jackrabbit.oak.spi.state.AbstractNodeStoreBranch.withCurrentBranch(AbstractNodeStoreBranch.java:726)
at
org.apache.jackrabbit.oak.spi.state.AbstractNodeStoreBranch.access$300(AbstractNodeStoreBranch.java:50)
at
org.apache.jackrabbit.oak.spi.state.AbstractNodeStoreBranch$Persisted.merge(AbstractNodeStoreBranch.java:593)
at
org.apache.jackrabbit.oak.spi.state.AbstractNodeStoreBranch.merge(AbstractNodeStoreBranch.java:299)
... 37 more


On Thu, Apr 10, 2014 at 7:46 PM, Travis CI <jukka@apache.org> wrote:

> Build Update for apache/jackrabbit-oak
> -------------------------------------
>
> Build: #4085
> Status: Errored
>
> Duration: 3002 seconds
> Commit: 12ebfadf954551ec137eb5f0a494142bae0a6013 (trunk)
> Author: Jukka Zitting
> Message: OAK-1696: Repository fails to restart on Windows
>
> Avoid memory-mapping a tar file before we're sure that it has a valid
> index.
> Make the recovery code in TarReader more resilient against unexpected
> problems.
>
> git-svn-id: https://svn.apache.org/repos/asf/jackrabbit/oak/trunk@158636413f79535-47bb-0310-9956-ffa450edef68
>
> View the changeset:
> https://github.com/apache/jackrabbit-oak/compare/c325eccf22bd...12ebfadf9545
>
> View the full build log and details:
> https://travis-ci.org/apache/jackrabbit-oak/builds/22708471
>
> --
> sent by Jukka's Travis notification gateway
>

Mime
  • Unnamed multipart/alternative (inline, None, 0 bytes)
View raw message