jackrabbit-oak-dev mailing list archives

Site index · List index
Message view « Date » · « Thread »
Top « Date » · « Thread »
From Jukka Zitting <jukka.zitt...@gmail.com>
Subject Re: buildbot failure in ASF Buildbot on oak-trunk
Date Wed, 05 Mar 2014 19:44:34 GMT
Hi,

On Wed, Mar 5, 2014 at 2:33 PM,  <buildbot@apache.org> wrote:
>  http://ci.apache.org/builders/oak-trunk/builds/4579

Running org.apache.jackrabbit.oak.plugins.document.ConcurrentConflictTest
Tests run: 2, Failures: 1, Errors: 0, Skipped: 1, Time elapsed: 0.415
sec <<< FAILURE!
concurrentUpdates(org.apache.jackrabbit.oak.plugins.document.ConcurrentConflictTest)
 Time elapsed: 0.413 sec  <<< FAILURE!
java.lang.AssertionError: expected:<1000> but was:<1020>
at org.junit.Assert.fail(Assert.java:93)
at org.junit.Assert.failNotEquals(Assert.java:647)
at org.junit.Assert.assertEquals(Assert.java:128)
at org.junit.Assert.assertEquals(Assert.java:472)
at org.junit.Assert.assertEquals(Assert.java:456)
at org.apache.jackrabbit.oak.plugins.document.ConcurrentConflictTest.concurrentUpdates(ConcurrentConflictTest.java:189)
at org.apache.jackrabbit.oak.plugins.document.ConcurrentConflictTest.concurrentUpdates(ConcurrentConflictTest.java:83)

BR,

Jukka Zitting

Mime
View raw message