jackrabbit-oak-dev mailing list archives

Site index · List index
Message view « Date » · « Thread »
Top « Date » · « Thread »
From Jukka Zitting <jukka.zitt...@gmail.com>
Subject Re: buildbot failure in ASF Buildbot on oak-trunk
Date Thu, 06 Mar 2014 18:01:54 GMT
Hi,

On Thu, Mar 6, 2014 at 12:54 PM,  <buildbot@apache.org> wrote:
> Full details are available at:
>  http://ci.apache.org/builders/oak-trunk/builds/4597

Running org.apache.jackrabbit.oak.jcr.ConcurrentAddReferenceTest
Tests run: 6, Failures: 1, Errors: 1, Skipped: 1, Time elapsed: 9.449
sec <<< FAILURE!
addReferences[2](org.apache.jackrabbit.oak.jcr.ConcurrentAddReferenceTest)
 Time elapsed: 3.839 sec  <<< FAILURE!
java.lang.AssertionError: javax.jcr.InvalidItemStateException:
OakState0001: Unresolved conflicts in /test/node0
at org.junit.Assert.fail(Assert.java:93)
at org.apache.jackrabbit.oak.jcr.ConcurrentAddReferenceTest.addReferences(ConcurrentAddReferenceTest.java:95)

BR,

Jukka Zitting

Mime
View raw message