jackrabbit-oak-dev mailing list archives

Site index · List index
Message view « Date » · « Thread »
Top « Date » · « Thread »
From Jukka Zitting <jukka.zitt...@gmail.com>
Subject Re: buildbot failure in ASF Buildbot on oak-trunk-win7
Date Wed, 05 Mar 2014 15:09:48 GMT
Hi,

On Wed, Mar 5, 2014 at 10:07 AM,  <buildbot@apache.org> wrote:
> Full details are available at:
>  http://ci.apache.org/builders/oak-trunk-win7/builds/4756

The problem was:

Running org.apache.jackrabbit.oak.spi.commit.BackgroundObserverTest
Tests run: 1, Failures: 1, Errors: 0, Skipped: 0, Time elapsed: 5.031
sec <<< FAILURE!
concurrentObservers(org.apache.jackrabbit.oak.spi.commit.BackgroundObserverTest)
 Time elapsed: 5.031 sec  <<< FAILURE!
java.lang.AssertionError
at org.junit.Assert.fail(Assert.java:92)
at org.junit.Assert.assertTrue(Assert.java:43)
at org.junit.Assert.assertTrue(Assert.java:54)
at org.apache.jackrabbit.oak.spi.commit.BackgroundObserverTest.concurrentObservers(BackgroundObserverTest.java:60)

BR,

Jukka Zitting

Mime
View raw message