jackrabbit-oak-dev mailing list archives

Site index · List index
Message view « Date » · « Thread »
Top « Date » · « Thread »
From Davide Giannella <giannella.dav...@gmail.com>
Subject Failing tests
Date Mon, 31 Mar 2014 08:55:52 GMT
Hello everyone,

I think all of us is aware of those but I have a fairly consistent
failing test (first one at the end) and a more randomly failing one.

Did a pull from upstream this morning as usual.

While the second is randomly failing and not really blocking the build,
the first one succeed probably only once in 5 builds.

Cheers
Davide

java.lang.Exception: Results in target/sql2.txt don't match expected
results in src/test/resources/sql2.txt; compare the files for details
    at
org.apache.jackrabbit.oak.query.AbstractQueryTest.test(AbstractQueryTest.java:218)
    at
org.apache.jackrabbit.oak.plugins.index.solr.query.SolrIndexQueryTest.sql2(SolrIndexQueryTest.java:86)
    at sun.reflect.NativeMethodAccessorImpl.invoke0(Native Method)
    at
sun.reflect.NativeMethodAccessorImpl.invoke(NativeMethodAccessorImpl.java:39)
    at
sun.reflect.DelegatingMethodAccessorImpl.invoke(DelegatingMethodAccessorImpl.java:25)
    at java.lang.reflect.Method.invoke(Method.java:597)
    at
org.junit.runners.model.FrameworkMethod$1.runReflectiveCall(FrameworkMethod.java:45)
    at
org.junit.internal.runners.model.ReflectiveCallable.run(ReflectiveCallable.java:15)
    at
org.junit.runners.model.FrameworkMethod.invokeExplosively(FrameworkMethod.java:42)
    at
org.junit.internal.runners.statements.InvokeMethod.evaluate(InvokeMethod.java:20)
    at
org.junit.internal.runners.statements.RunBefores.evaluate(RunBefores.java:28)
    at
org.junit.internal.runners.statements.RunAfters.evaluate(RunAfters.java:30)
    at org.junit.runners.ParentRunner.runLeaf(ParentRunner.java:263)
    at
org.junit.runners.BlockJUnit4ClassRunner.runChild(BlockJUnit4ClassRunner.java:68)
    at
org.junit.runners.BlockJUnit4ClassRunner.runChild(BlockJUnit4ClassRunner.java:47)
    at org.junit.runners.ParentRunner$3.run(ParentRunner.java:231)
    at org.junit.runners.ParentRunner$1.schedule(ParentRunner.java:60)
    at org.junit.runners.ParentRunner.runChildren(ParentRunner.java:229)
    at org.junit.runners.ParentRunner.access$000(ParentRunner.java:50)
    at org.junit.runners.ParentRunner$2.evaluate(ParentRunner.java:222)
    at org.junit.runners.ParentRunner.run(ParentRunner.java:300)
    at
org.apache.maven.surefire.junit4.JUnit4Provider.execute(JUnit4Provider.java:252)
    at
org.apache.maven.surefire.junit4.JUnit4Provider.executeTestSet(JUnit4Provider.java:141)
    at
org.apache.maven.surefire.junit4.JUnit4Provider.invoke(JUnit4Provider.java:112)
    at sun.reflect.NativeMethodAccessorImpl.invoke0(Native Method)
    at
sun.reflect.NativeMethodAccessorImpl.invoke(NativeMethodAccessorImpl.java:39)
    at
sun.reflect.DelegatingMethodAccessorImpl.invoke(DelegatingMethodAccessorImpl.java:25)
    at java.lang.reflect.Method.invoke(Method.java:597)
    at
org.apache.maven.surefire.util.ReflectionUtils.invokeMethodWithArray(ReflectionUtils.java:189)
    at
org.apache.maven.surefire.booter.ProviderFactory$ProviderProxy.invoke(ProviderFactory.java:165)
    at
org.apache.maven.surefire.booter.ProviderFactory.invokeProvider(ProviderFactory.java:85)
    at
org.apache.maven.surefire.booter.ForkedBooter.runSuitesInProcess(ForkedBooter.java:115)
    at
org.apache.maven.surefire.booter.ForkedBooter.main(ForkedBooter.java:75)

----------

Tests run: 2, Failures: 1, Errors: 0, Skipped: 1, Time elapsed: 0.089
sec <<< FAILURE!
concurrentUpdates(org.apache.jackrabbit.oak.plugins.document.ConcurrentConflictTest) 
Time elapsed: 0.088 sec  <<< FAILURE!
java.lang.AssertionError: expected:<1000> but was:<1010>
    at org.junit.Assert.fail(Assert.java:93)
    at org.junit.Assert.failNotEquals(Assert.java:647)
    at org.junit.Assert.assertEquals(Assert.java:128)
    at org.junit.Assert.assertEquals(Assert.java:472)
    at org.junit.Assert.assertEquals(Assert.java:456)
    at
org.apache.jackrabbit.oak.plugins.document.ConcurrentConflictTest.concurrentUpdates(ConcurrentConflictTest.java:189)
    at
org.apache.jackrabbit.oak.plugins.document.ConcurrentConflictTest.concurrentUpdates(ConcurrentConflictTest.java:83)
    at sun.reflect.NativeMethodAccessorImpl.invoke0(Native Method)
    at
sun.reflect.NativeMethodAccessorImpl.invoke(NativeMethodAccessorImpl.java:39)
    at
sun.reflect.DelegatingMethodAccessorImpl.invoke(DelegatingMethodAccessorImpl.java:25)
    at java.lang.reflect.Method.invoke(Method.java:597)
    at
org.junit.runners.model.FrameworkMethod$1.runReflectiveCall(FrameworkMethod.java:45)
    at
org.junit.internal.runners.model.ReflectiveCallable.run(ReflectiveCallable.java:15)
    at
org.junit.runners.model.FrameworkMethod.invokeExplosively(FrameworkMethod.java:42)
    at
org.junit.internal.runners.statements.InvokeMethod.evaluate(InvokeMethod.java:20)
    at
org.junit.internal.runners.statements.RunBefores.evaluate(RunBefores.java:28)
    at
org.junit.internal.runners.statements.RunAfters.evaluate(RunAfters.java:30)
    at org.junit.runners.ParentRunner.runLeaf(ParentRunner.java:263)
    at
org.junit.runners.BlockJUnit4ClassRunner.runChild(BlockJUnit4ClassRunner.java:68)
    at
org.junit.runners.BlockJUnit4ClassRunner.runChild(BlockJUnit4ClassRunner.java:47)
    at org.junit.runners.ParentRunner$3.run(ParentRunner.java:231)
    at org.junit.runners.ParentRunner$1.schedule(ParentRunner.java:60)
    at org.junit.runners.ParentRunner.runChildren(ParentRunner.java:229)
    at org.junit.runners.ParentRunner.access$000(ParentRunner.java:50)
    at org.junit.runners.ParentRunner$2.evaluate(ParentRunner.java:222)
    at org.junit.runners.ParentRunner.run(ParentRunner.java:300)
    at
org.apache.maven.surefire.junit4.JUnit4Provider.execute(JUnit4Provider.java:252)
    at
org.apache.maven.surefire.junit4.JUnit4Provider.executeTestSet(JUnit4Provider.java:141)
    at
org.apache.maven.surefire.junit4.JUnit4Provider.invoke(JUnit4Provider.java:112)
    at sun.reflect.NativeMethodAccessorImpl.invoke0(Native Method)
    at
sun.reflect.NativeMethodAccessorImpl.invoke(NativeMethodAccessorImpl.java:39)
    at
sun.reflect.DelegatingMethodAccessorImpl.invoke(DelegatingMethodAccessorImpl.java:25)
    at java.lang.reflect.Method.invoke(Method.java:597)
    at
org.apache.maven.surefire.util.ReflectionUtils.invokeMethodWithArray(ReflectionUtils.java:189)
    at
org.apache.maven.surefire.booter.ProviderFactory$ProviderProxy.invoke(ProviderFactory.java:165)
    at
org.apache.maven.surefire.booter.ProviderFactory.invokeProvider(ProviderFactory.java:85)
    at
org.apache.maven.surefire.booter.ForkedBooter.runSuitesInProcess(ForkedBooter.java:115)
    at
org.apache.maven.surefire.booter.ForkedBooter.main(ForkedBooter.java:75)




Mime
View raw message