jackrabbit-oak-dev mailing list archives

Site index · List index
Message view « Date » · « Thread »
Top « Date » · « Thread »
From Tommaso Teofili <tommaso.teof...@gmail.com>
Subject Re: buildbot failure in ASF Buildbot on oak-trunk
Date Mon, 24 Feb 2014 11:25:02 GMT
right, sorry my bad, I'll fix that.
Tommaso


2014-02-24 11:08 GMT+01:00 Michael Dürig <mduerig@apache.org>:

>
>
> On 24.2.14 11:02 , Alex Parvulescu wrote:
>
>> This doesn't look like something I did:
>>
>> Failed tests:
>> org.apache.jackrabbit.oak.plugins.index.solr.configuration.
>> DefaultAnalyzersConfigurationTest:
>> fix your classpath to have tests-framework.jar before lucene-core.jar
>>
>
> Maybe related to OAK-1444 / http://svn.apache.org/r1570568?
>
> Michael
>
>
>
>>
>> Running
>> org.apache.jackrabbit.oak.plugins.index.solr.configuration.
>> DefaultAnalyzersConfigurationTest
>> Tests run: 1, Failures: 1, Errors: 0, Skipped: 0, Time elapsed: 0.334 sec
>> <<< FAILURE!
>> org.apache.jackrabbit.oak.plugins.index.solr.configuration.
>> DefaultAnalyzersConfigurationTest
>>   Time elapsed: 0.332 sec  <<< FAILURE!
>> java.lang.AssertionError: fix your classpath to have tests-framework.jar
>> before lucene-core.jar
>> at __randomizedtesting.SeedInfo.seed([4AADE1E558B1742F]:0)
>> at
>> org.apache.lucene.util.TestRuleSetupAndRestoreClassEnv.before(
>> TestRuleSetupAndRestoreClassEnv.java:144)
>> at
>> org.apache.lucene.util.AbstractBeforeAfterRule$1.evaluate(
>> AbstractBeforeAfterRule.java:45)
>> at
>> org.apache.lucene.util.TestRuleStoreClassName$1.evaluate(
>> TestRuleStoreClassName.java:42)
>> at
>> com.carrotsearch.randomizedtesting.rules.SystemPropertiesInvariantRule$
>> 1.evaluate(SystemPropertiesInvariantRule.java:55)
>> at
>> com.carrotsearch.randomizedtesting.rules.NoShadowingOrOverridesOnMethod
>> sRule$1.evaluate(NoShadowingOrOverridesOnMethodsRule.java:39)
>> at
>> com.carrotsearch.randomizedtesting.rules.NoShadowingOrOverridesOnMethod
>> sRule$1.evaluate(NoShadowingOrOverridesOnMethodsRule.java:39)
>> at
>> com.carrotsearch.randomizedtesting.rules.StatementAdapter.evaluate(
>> StatementAdapter.java:36)
>> at
>> org.apache.lucene.util.TestRuleAssertionsRequired$1.evaluate(
>> TestRuleAssertionsRequired.java:43)
>> at
>> org.apache.lucene.util.TestRuleMarkFailure$1.
>> evaluate(TestRuleMarkFailure.java:48)
>> at
>> org.apache.lucene.util.TestRuleIgnoreAfterMaxFailures$1.evaluate(
>> TestRuleIgnoreAfterMaxFailures.java:70)
>> at
>> org.apache.lucene.util.TestRuleIgnoreTestSuites$1.evaluate(
>> TestRuleIgnoreTestSuites.java:55)
>> at
>> com.carrotsearch.randomizedtesting.rules.StatementAdapter.evaluate(
>> StatementAdapter.java:36)
>> at
>> com.carrotsearch.randomizedtesting.ThreadLeakControl$StatementRunner.run(
>> ThreadLeakControl.java:358)
>> at java.lang.Thread.run(Thread.java:701)
>>
>>
>> On Mon, Feb 24, 2014 at 10:57 AM, <buildbot@apache.org> wrote:
>>
>>  The Buildbot has detected a new failure on builder oak-trunk while
>>> building ASF Buildbot.
>>> Full details are available at:
>>>   http://ci.apache.org/builders/oak-trunk/builds/4469
>>>
>>> Buildbot URL: http://ci.apache.org/
>>>
>>> Buildslave for this Build: osiris_ubuntu
>>>
>>> Build Reason: scheduler
>>> Build Source Stamp: [branch jackrabbit/oak/trunk] 1571195
>>> Blamelist: alexparvulescu
>>>
>>> BUILD FAILED: failed compile
>>>
>>> sincerely,
>>>   -The Buildbot
>>>
>>>
>>>
>>>
>>>
>>

Mime
  • Unnamed multipart/alternative (inline, None, 0 bytes)
View raw message