jackrabbit-oak-dev mailing list archives

Site index · List index
Message view « Date » · « Thread »
Top « Date » · « Thread »
From Julian Reschke <julian.resc...@gmx.de>
Subject Re: jackrabbit-oak build #3355: Broken
Date Thu, 13 Feb 2014 12:09:14 GMT
On 2014-02-13 11:21, Michael Dürig wrote:
>
> concurrent[4](org.apache.jackrabbit.oak.jcr.ConcurrentAddRemoveIT)  Time
> elapsed: 17.599 sec  <<< FAILURE!
> java.lang.AssertionError: javax.jcr.PathNotFoundException: Node with
> path /test does not exist.
>      at org.junit.Assert.fail(Assert.java:93)
>      at
> org.apache.jackrabbit.oak.jcr.ConcurrentAddRemoveIT.concurrent(ConcurrentAddRemoveIT.java:64)
>
>
>
>  > concurrent[4]
>
> This is NodeStoreFixture.DOCUMENT_JDBC. Julian, any idea?
> ...

Not right away. I also have occasional test failures, but they all seem 
to be about events not being delivered.

Best regards, Julian

Mime
View raw message