jackrabbit-oak-dev mailing list archives

Site index · List index
Message view « Date » · « Thread »
Top « Date » · « Thread »
From Marcel Reutegger <mreut...@adobe.com>
Subject RE: buildbot failure in ASF Buildbot on oak-trunk
Date Fri, 21 Feb 2014 20:43:44 GMT
looks unrelated to my changes:

Running org.apache.jackrabbit.oak.plugins.index.solr.configuration.DefaultAnalyzersConfigurationTest
Tests run: 1, Failures: 1, Errors: 0, Skipped: 0, Time elapsed: 0.338 sec <<< FAILURE!
org.apache.jackrabbit.oak.plugins.index.solr.configuration.DefaultAnalyzersConfigurationTest
 Time elapsed: 0.336 sec  <<< FAILURE!
java.lang.AssertionError: fix your classpath to have tests-framework.jar before lucene-core.jar
	at __randomizedtesting.SeedInfo.seed([2D2BF15F40402070]:0)
	at org.apache.lucene.util.TestRuleSetupAndRestoreClassEnv.before(TestRuleSetupAndRestoreClassEnv.java:144)
	at org.apache.lucene.util.AbstractBeforeAfterRule$1.evaluate(AbstractBeforeAfterRule.java:45)
	at org.apache.lucene.util.TestRuleStoreClassName$1.evaluate(TestRuleStoreClassName.java:42)
	at com.carrotsearch.randomizedtesting.rules.SystemPropertiesInvariantRule$1.evaluate(SystemPropertiesInvariantRule.java:55)
	at com.carrotsearch.randomizedtesting.rules.NoShadowingOrOverridesOnMethodsRule$1.evaluate(NoShadowingOrOverridesOnMethodsRule.java:39)
	at com.carrotsearch.randomizedtesting.rules.NoShadowingOrOverridesOnMethodsRule$1.evaluate(NoShadowingOrOverridesOnMethodsRule.java:39)
	at com.carrotsearch.randomizedtesting.rules.StatementAdapter.evaluate(StatementAdapter.java:36)
	at org.apache.lucene.util.TestRuleAssertionsRequired$1.evaluate(TestRuleAssertionsRequired.java:43)
	at org.apache.lucene.util.TestRuleMarkFailure$1.evaluate(TestRuleMarkFailure.java:48)
	at org.apache.lucene.util.TestRuleIgnoreAfterMaxFailures$1.evaluate(TestRuleIgnoreAfterMaxFailures.java:70)
	at org.apache.lucene.util.TestRuleIgnoreTestSuites$1.evaluate(TestRuleIgnoreTestSuites.java:55)
	at com.carrotsearch.randomizedtesting.rules.StatementAdapter.evaluate(StatementAdapter.java:36)
	at com.carrotsearch.randomizedtesting.ThreadLeakControl$StatementRunner.run(ThreadLeakControl.java:358)
	at java.lang.Thread.run(Thread.java:701)

regards
 marcel

> -----Original Message-----
> From: buildbot@apache.org [mailto:buildbot@apache.org]
> Sent: Freitag, 21. Februar 2014 21:26
> To: oak-dev@jackrabbit.apache.org
> Subject: buildbot failure in ASF Buildbot on oak-trunk
> 
> The Buildbot has detected a new failure on builder oak-trunk while building
> ASF Buildbot.
> Full details are available at:
>  http://ci.apache.org/builders/oak-trunk/builds/4462
> 
> Buildbot URL: http://ci.apache.org/
> 
> Buildslave for this Build: osiris_ubuntu
> 
> Build Reason: scheduler
> Build Source Stamp: [branch jackrabbit/oak/trunk] 1570693
> Blamelist: mreutegg
> 
> BUILD FAILED: failed compile
> 
> sincerely,
>  -The Buildbot
> 
> 

Mime
View raw message