jackrabbit-oak-dev mailing list archives

Site index · List index
Message view « Date » · « Thread »
Top « Date » · « Thread »
From Marcel Reutegger <mreut...@adobe.com>
Subject RE: Build failure
Date Tue, 07 May 2013 14:17:21 GMT
Hi,

I extended the list of known issues. The IT tests don't report
failures anymore on my machine.

regards
 marcel

> -----Original Message-----
> From: Marcel Reutegger [mailto:mreutegg@adobe.com]
> Sent: Dienstag, 7. Mai 2013 16:01
> To: oak-dev@jackrabbit.apache.org
> Subject: RE: Build failure
> 
> Hi,
> 
> that's probably my bad, I flipped the version support descriptor for
> versioning, but only checked the VersionIT test. I'll fix it.
> 
> regards
>  marcel
> 
> > -----Original Message-----
> > From: Jukka Zitting [mailto:jukka.zitting@gmail.com]
> > Sent: Dienstag, 7. Mai 2013 15:18
> > To: Oak devs
> > Subject: Build failure
> >
> > Hi,
> >
> > Not sure if it's just me, but my Oak build is failing with:
> >
> > Failed tests:
> > testCheckedIn(org.apache.jackrabbit.test.api.NodeCanAddMixinTest):
> >   Node.canAddMixin(String mixinName) must return false if the node is
> > checked-in.
> >
> > Tests in error:
> > testValue(org.apache.jackrabbit.test.api.SetValueVersionExceptionTest):
> >   javax.jcr.version.VersionException: Cannot change property prop1 on
> > checked in node
> > testNode(org.apache.jackrabbit.test.api.SetValueVersionExceptionTest):
> >   javax.jcr.version.VersionException: Cannot change property
> > jcr:content on checked in node
> > testDouble(org.apache.jackrabbit.test.api.SetValueVersionExceptionTest):
> >   javax.jcr.version.VersionException: Cannot change property prop1 on
> > checked in node
> >
> testCalendar(org.apache.jackrabbit.test.api.SetValueVersionExceptionTest):
> >   javax.jcr.version.VersionException: Cannot change property prop1 on
> > checked in node
> > testLong(org.apache.jackrabbit.test.api.SetValueVersionExceptionTest):
> >   javax.jcr.version.VersionException: Cannot change property prop1 on
> > checked in node
> >
> testBoolean(org.apache.jackrabbit.test.api.SetValueVersionExceptionTest):
> >   javax.jcr.version.VersionException: Cannot change property prop1 on
> > checked in node
> > testString(org.apache.jackrabbit.test.api.SetValueVersionExceptionTest):
> >   javax.jcr.version.VersionException: Cannot change property prop1 on
> > checked in node
> >
> testValueArray(org.apache.jackrabbit.test.api.SetValueVersionExceptionTes
> > t):
> >   javax.jcr.version.VersionException: Cannot change property prop2 on
> > checked in node
> >
> testStringArray(org.apache.jackrabbit.test.api.SetValueVersionExceptionTes
> > t):
> >   javax.jcr.version.VersionException: Cannot change property prop2 on
> > checked in node
> >
> testInputStream(org.apache.jackrabbit.test.api.SetValueVersionExceptionTe
> > st):
> >   javax.jcr.version.VersionException: Cannot change property prop1 on
> > checked in node
> > testCheckedInUnlock(org.apache.jackrabbit.test.api.lock.LockTest)
> > testCheckedIn(org.apache.jackrabbit.test.api.lock.LockTest):
> >   javax.jcr.version.VersionException: Cannot change property
> > jcr:lockIsDeep on checked in node
> >
> testVersioning(org.apache.jackrabbit.test.api.observation.GetUserDataTest)
> > :
> >   User data not supported
> >
> > Both our CI builds are out of luck at the moment (buildbot with some
> > system issue, travis with still missing Jackrabbit 2.8-SNAPSHOT
> > dependencies), so the error might be occurring more generally than
> > just on my laptop.
> >
> > BR,
> >
> > Jukka Zitting

Mime
View raw message