jackrabbit-oak-dev mailing list archives

Site index · List index
Message view « Date » · « Thread »
Top « Date » · « Thread »
From Julian Reschke <julian.resc...@gmx.de>
Subject Re: [VOTE] Release Apache Jackrabbit Oak 0.7
Date Fri, 10 May 2013 11:16:48 GMT
I'm getting:

[ERROR] Failed to execute goal 
org.apache.rat:apache-rat-plugin:0.8:check (default) on project 
oak-core: Too many unapproved licenses: 1 -> [Help 1]

Full log below:


[INFO] 
------------------------------------------------------------------------
[INFO] JACKRABBIT RELEASE CHECKER 

[INFO] 
------------------------------------------------------------------------
[INFO]
[INFO] 1. Retrieve latest release candidates
[INFO]
[INFO]    Retrieving release candidates...
Updating '.':
At revision 1955.
[INFO]    Retrieving KEYS...
gpg: WARNING: using insecure memory!
gpg: please see http://www.gnupg.org/documentation/faqs.html for more 
information
gpg: key E04F9A89: "Roy T. Fielding <fielding@gbiv.com>" not changed
gpg: key 8A26D9A6: "Jukka Zitting <jukka.zitting@gmail.com>" not changed
gpg: key A355A63E: "Jukka Zitting <jukka@apache.org>" not changed
gpg: key F79B7715: "Felix Meschberger <fmeschbe@apache.org>" not changed
gpg: key AEFCA72E: "Alex Parvulescu (CODE SIGNING KEY) 
<alexparvulescu@apache.org>" not changed
gpg: key AE0B5181: "Ard Schrijvers (CODE SIGNING KEY) <ard@apache.org>" 
not changed
gpg: key A23CB531: "Bart van der Schans (CODE SIGNING KEY) 
<schans@apache.org>" not changed
gpg: key 6301DF93: "Bart van der Schans <bart@vanderschans.nl>" not changed
gpg: key EB2F0489: "Julian Reschke (CODE SIGNING KEY) 
<julian.reschke@gmx.de>" not changed
gpg: key 1BB83D7C: "Manfred Baedke (CODE SIGNING KEY) 
<baedke@apache.org>" not changed
gpg: Total number processed: 10
gpg:              unchanged: 10
[INFO]
[INFO] 2. Check for the presence of the staged release candidate
[INFO]
[INFO]    OK: jackrabbit-oak-0.7-src.zip
[INFO]    OK: RELEASE-NOTES.txt
[INFO]
[INFO] 3. Verify checksums and signatures
[INFO]
[INFO]    Verifying jackrabbit-oak-0.7-src.zip...
gpg: WARNING: using insecure memory!
gpg: please see http://www.gnupg.org/documentation/faqs.html for more 
information
gpg: Signature made Mon May  6 17:48:11 2013 MEZ using DSA key ID A355A63E
gpg: Good signature from "Jukka Zitting <jukka@apache.org>"
gpg: WARNING: This key is not certified with a trusted signature!
gpg:          There is no indication that the signature belongs to the 
owner.
Primary key fingerprint: EAA5 26B9 1DD8 3BA3 E1B9  636F A730 529C A355 A63E
[INFO]    OK: jackrabbit-oak-0.7-src.zip.asc
[INFO]    OK: jackrabbit-oak-0.7-src.zip.md5
[INFO]    OK: jackrabbit-oak-0.7-src.zip.sha
[INFO]
[INFO] 4. Compare provided SHA1 checksum with that of the release
[INFO]
[INFO]    OK: b195f9d41dc47b46a95eaa2e5e30c7048af91aa7
[INFO]
[INFO] 5. Compare svn tag with src zip contents
[INFO]
[INFO]    Exporting 
https://svn.apache.org/repos/asf/jackrabbit/oak/tags/jackrabbit-oak-0.7...
[INFO]    Unzipping jackrabbit-oak-0.7-src.zip...
[INFO]    Comparing sources...
[INFO]
[INFO]    OK: No differences found
[INFO]
[INFO] 6. Build the release candidate
[INFO]
[INFO]    Running the Maven build...
[INFO]
[INFO] Scanning for projects...
[INFO] 
------------------------------------------------------------------------
[INFO] Reactor Build Order:
[INFO]
[INFO] Oak Parent POM
[INFO] Oak Commons
[INFO] Oak MicroKernel API
[INFO] Oak MicroKernel
[INFO] Oak MicroKernel Remoting
[INFO] Oak Mongo MicroKernel
[INFO] Oak Integration Tests for MicroKernel implementations
[INFO] Oak Core
[INFO] Oak JCR Binding
[INFO] Oak upgrade
[INFO] Oak support for Apache Sling
[INFO] Oak HTTP Binding
[INFO] Oak Lucene
[INFO] Oak Solr core
[INFO] Oak Solr remote
[INFO] Oak Solr embedded
[INFO] Oak Runnable Jar
[INFO] Oak Integration Tests for OSGi deployments
[INFO] Oak Integration Tests
[INFO] Jackrabbit Oak
[INFO] 

[INFO] 
------------------------------------------------------------------------
[INFO] Building Oak Parent POM 0.7
[INFO] 
------------------------------------------------------------------------
[INFO]
[INFO] --- maven-remote-resources-plugin:1.2.1:process (default) @ 
oak-parent ---
[INFO]
[INFO] --- maven-site-plugin:3.0:attach-descriptor (attach-descriptor) @ 
oak-parent ---
[INFO]
[INFO] --- apache-rat-plugin:0.8:check (default) @ oak-parent ---
[INFO] No excludes
[INFO]
[INFO] --- maven-checkstyle-plugin:2.9.1:check (default) @ oak-parent ---
[INFO]
[INFO]
[INFO] >>> findbugs-maven-plugin:2.5.2:check (default) @ oak-parent >>>
[INFO]
[INFO] --- findbugs-maven-plugin:2.5.2:findbugs (findbugs) @ oak-parent ---
[INFO]
[INFO] <<< findbugs-maven-plugin:2.5.2:check (default) @ oak-parent <<<
[INFO]
[INFO] --- findbugs-maven-plugin:2.5.2:check (default) @ oak-parent ---
[INFO] 

[INFO] 
------------------------------------------------------------------------
[INFO] Building Oak Commons 0.7
[INFO] 
------------------------------------------------------------------------
[INFO]
[INFO] --- maven-remote-resources-plugin:1.2.1:process (default) @ 
oak-commons ---
[INFO]
[INFO] --- maven-resources-plugin:2.5:resources (default-resources) @ 
oak-commons ---
[debug] execute contextualize
[INFO] Using 'UTF-8' encoding to copy filtered resources.
[INFO] skip non existing resourceDirectory 
C:\projects\apache\jackrabbit\jackrabbit-dev\target\jackrabbit-oak-0.7\zip\jackrabbit-oak-0.7\oak-commons\src\main\resources
[INFO] Copying 3 resources
[INFO]
[INFO] --- maven-compiler-plugin:2.3.2:compile (default-compile) @ 
oak-commons ---
[INFO] Compiling 1 source file to 
C:\projects\apache\jackrabbit\jackrabbit-dev\target\jackrabbit-oak-0.7\zip\jackrabbit-oak-0.7\oak-commons\target\classes
[INFO]
[INFO] --- maven-resources-plugin:2.5:testResources 
(default-testResources) @ oak-commons ---
[debug] execute contextualize
[INFO] Using 'UTF-8' encoding to copy filtered resources.
[INFO] skip non existing resourceDirectory 
C:\projects\apache\jackrabbit\jackrabbit-dev\target\jackrabbit-oak-0.7\zip\jackrabbit-oak-0.7\oak-commons\src\test\resources
[INFO] Copying 3 resources
[INFO]
[INFO] --- maven-compiler-plugin:2.3.2:testCompile (default-testCompile) 
@ oak-commons ---
[INFO] Compiling 1 source file to 
C:\projects\apache\jackrabbit\jackrabbit-dev\target\jackrabbit-oak-0.7\zip\jackrabbit-oak-0.7\oak-commons\target\test-classes
[INFO]
[INFO] --- maven-surefire-plugin:2.9:test (default-test) @ oak-commons ---
[INFO] Surefire report directory: 
C:\projects\apache\jackrabbit\jackrabbit-dev\target\jackrabbit-oak-0.7\zip\jackrabbit-oak-0.7\oak-commons\target\surefire-reports

-------------------------------------------------------
  T E S T S
-------------------------------------------------------
Running org.apache.jackrabbit.oak.commons.PathTest
Tests run: 6, Failures: 0, Errors: 0, Skipped: 0, Time elapsed: 0.09 sec

Results :

Tests run: 6, Failures: 0, Errors: 0, Skipped: 0

[INFO]
[INFO] --- maven-bundle-plugin:2.3.7:bundle (default-bundle) @ 
oak-commons ---
[INFO]
[INFO] --- maven-site-plugin:3.0:attach-descriptor (attach-descriptor) @ 
oak-commons ---
[INFO]
[INFO] --- apache-rat-plugin:0.8:check (default) @ oak-commons ---
[INFO] No excludes
[INFO]
[INFO] --- maven-checkstyle-plugin:2.9.1:check (default) @ oak-commons ---
[INFO]
[INFO] There are 41 checkstyle errors.
[WARNING] checkstyle:check violations detected but failOnViolation set 
to false
[INFO]
[INFO] >>> findbugs-maven-plugin:2.5.2:check (default) @ oak-commons >>>
[INFO]
[INFO] --- findbugs-maven-plugin:2.5.2:findbugs (findbugs) @ oak-commons ---
[INFO] Fork Value is true
[INFO] Done FindBugs Analysis....
[INFO]
[INFO] <<< findbugs-maven-plugin:2.5.2:check (default) @ oak-commons <<<
[INFO]
[INFO] --- findbugs-maven-plugin:2.5.2:check (default) @ oak-commons ---
[INFO] BugInstance size is 0
[INFO] Error size is 0
[INFO] No errors/warnings found
[INFO] 

[INFO] 
------------------------------------------------------------------------
[INFO] Building Oak MicroKernel API 0.7
[INFO] 
------------------------------------------------------------------------
[INFO]
[INFO] --- maven-remote-resources-plugin:1.2.1:process (default) @ 
oak-mk-api ---
[INFO]
[INFO] --- maven-resources-plugin:2.5:resources (default-resources) @ 
oak-mk-api ---
[debug] execute contextualize
[INFO] Using 'UTF-8' encoding to copy filtered resources.
[INFO] skip non existing resourceDirectory 
C:\projects\apache\jackrabbit\jackrabbit-dev\target\jackrabbit-oak-0.7\zip\jackrabbit-oak-0.7\oak-mk-api\src\main\resources
[INFO] Copying 3 resources
[INFO]
[INFO] --- maven-compiler-plugin:2.3.2:compile (default-compile) @ 
oak-mk-api ---
[INFO] Compiling 3 source files to 
C:\projects\apache\jackrabbit\jackrabbit-dev\target\jackrabbit-oak-0.7\zip\jackrabbit-oak-0.7\oak-mk-api\target\classes
[INFO]
[INFO] --- maven-scr-plugin:1.9.0:scr (generate-scr-scrdescriptor) @ 
oak-mk-api ---
[INFO]
[INFO] --- maven-resources-plugin:2.5:testResources 
(default-testResources) @ oak-mk-api ---
[debug] execute contextualize
[INFO] Using 'UTF-8' encoding to copy filtered resources.
[INFO] skip non existing resourceDirectory 
C:\projects\apache\jackrabbit\jackrabbit-dev\target\jackrabbit-oak-0.7\zip\jackrabbit-oak-0.7\oak-mk-api\src\test\resources
[INFO] Copying 3 resources
[INFO]
[INFO] --- maven-compiler-plugin:2.3.2:testCompile (default-testCompile) 
@ oak-mk-api ---
[INFO] No sources to compile
[INFO]
[INFO] --- maven-surefire-plugin:2.9:test (default-test) @ oak-mk-api ---
[INFO] Surefire report directory: 
C:\projects\apache\jackrabbit\jackrabbit-dev\target\jackrabbit-oak-0.7\zip\jackrabbit-oak-0.7\oak-mk-api\target\surefire-reports

-------------------------------------------------------
  T E S T S
-------------------------------------------------------

Results :

Tests run: 0, Failures: 0, Errors: 0, Skipped: 0

[INFO]
[INFO] --- maven-bundle-plugin:2.3.7:bundle (default-bundle) @ 
oak-mk-api ---
[INFO]
[INFO] --- maven-site-plugin:3.0:attach-descriptor (attach-descriptor) @ 
oak-mk-api ---
[INFO]
[INFO] --- apache-rat-plugin:0.8:check (default) @ oak-mk-api ---
[INFO] No excludes
[INFO]
[INFO] --- maven-checkstyle-plugin:2.9.1:check (default) @ oak-mk-api ---
[INFO]
[INFO] There are 135 checkstyle errors.
[WARNING] checkstyle:check violations detected but failOnViolation set 
to false
[INFO]
[INFO] >>> findbugs-maven-plugin:2.5.2:check (default) @ oak-mk-api >>>
[INFO]
[INFO] --- findbugs-maven-plugin:2.5.2:findbugs (findbugs) @ oak-mk-api ---
[INFO] Fork Value is true
[INFO] Done FindBugs Analysis....
[INFO]
[INFO] <<< findbugs-maven-plugin:2.5.2:check (default) @ oak-mk-api <<<
[INFO]
[INFO] --- findbugs-maven-plugin:2.5.2:check (default) @ oak-mk-api ---
[INFO] BugInstance size is 0
[INFO] Error size is 0
[INFO] No errors/warnings found
[INFO] 

[INFO] 
------------------------------------------------------------------------
[INFO] Building Oak MicroKernel 0.7
[INFO] 
------------------------------------------------------------------------
[INFO]
[INFO] --- maven-remote-resources-plugin:1.2.1:process (default) @ 
oak-mk ---
[INFO]
[INFO] --- maven-resources-plugin:2.5:resources (default-resources) @ 
oak-mk ---
[debug] execute contextualize
[INFO] Using 'UTF-8' encoding to copy filtered resources.
[INFO] skip non existing resourceDirectory 
C:\projects\apache\jackrabbit\jackrabbit-dev\target\jackrabbit-oak-0.7\zip\jackrabbit-oak-0.7\oak-mk\src\main\resources
[INFO] Copying 3 resources
[INFO]
[INFO] --- maven-compiler-plugin:2.3.2:compile (default-compile) @ 
oak-mk ---
[INFO] Compiling 74 source files to 
C:\projects\apache\jackrabbit\jackrabbit-dev\target\jackrabbit-oak-0.7\zip\jackrabbit-oak-0.7\oak-mk\target\classes
[INFO]
[INFO] --- maven-scr-plugin:1.9.0:scr (generate-scr-scrdescriptor) @ 
oak-mk ---
SLF4J: Failed to load class "org.slf4j.impl.StaticLoggerBinder".
SLF4J: Defaulting to no-operation (NOP) logger implementation
SLF4J: See http://www.slf4j.org/codes.html#StaticLoggerBinder for 
further details.
[INFO] Writing 1 Service Component Descriptors to 
C:\projects\apache\jackrabbit\jackrabbit-dev\target\jackrabbit-oak-0.7\zip\jackrabbit-oak-0.7\oak-mk\target\scr-plugin-generated\OSGI-INF\org.apache.jackrabbit.mk.osgi.MicroKernelService.xml
[INFO]
[INFO] --- maven-resources-plugin:2.5:testResources 
(default-testResources) @ oak-mk ---
[debug] execute contextualize
[INFO] Using 'UTF-8' encoding to copy filtered resources.
[INFO] Copying 1 resource
[INFO] Copying 3 resources
[INFO]
[INFO] --- maven-compiler-plugin:2.3.2:testCompile (default-testCompile) 
@ oak-mk ---
[INFO] Compiling 21 source files to 
C:\projects\apache\jackrabbit\jackrabbit-dev\target\jackrabbit-oak-0.7\zip\jackrabbit-oak-0.7\oak-mk\target\test-classes
[INFO]
[INFO] --- maven-surefire-plugin:2.9:test (default-test) @ oak-mk ---
[INFO] Surefire report directory: 
C:\projects\apache\jackrabbit\jackrabbit-dev\target\jackrabbit-oak-0.7\zip\jackrabbit-oak-0.7\oak-mk\target\surefire-reports

-------------------------------------------------------
  T E S T S
-------------------------------------------------------
Running org.apache.jackrabbit.mk.blobs.DbBlobStoreTest
Tests run: 10, Failures: 0, Errors: 0, Skipped: 0, Time elapsed: 6.512 sec
Running org.apache.jackrabbit.mk.blobs.FileBlobStoreTest
Tests run: 10, Failures: 0, Errors: 0, Skipped: 0, Time elapsed: 13.698 sec
Running org.apache.jackrabbit.mk.blobs.MemoryBlobStoreTest
Tests run: 10, Failures: 0, Errors: 0, Skipped: 0, Time elapsed: 0.17 sec
Running org.apache.jackrabbit.mk.concurrent.ConcurrentBlobTest
Tests run: 1, Failures: 0, Errors: 0, Skipped: 0, Time elapsed: 1.062 sec
Running org.apache.jackrabbit.mk.concurrent.ConcurrentCacheTest
Tests run: 1, Failures: 0, Errors: 0, Skipped: 0, Time elapsed: 0.999 sec
Running org.apache.jackrabbit.mk.concurrent.ConcurrentTest
Tests run: 2, Failures: 0, Errors: 0, Skipped: 1, Time elapsed: 4.289 sec
Running org.apache.jackrabbit.mk.json.JsopStreamTest
Tests run: 5, Failures: 0, Errors: 0, Skipped: 0, Time elapsed: 0.001 sec
Running org.apache.jackrabbit.mk.json.JsopTest
Tests run: 9, Failures: 0, Errors: 0, Skipped: 0, Time elapsed: 0.001 sec
Running org.apache.jackrabbit.mk.MicroKernelImplTest
Tests run: 21, Failures: 0, Errors: 0, Skipped: 0, Time elapsed: 4.824 sec
Running org.apache.jackrabbit.mk.model.IdTest
Tests run: 4, Failures: 0, Errors: 0, Skipped: 0, Time elapsed: 0.001 sec
Running org.apache.jackrabbit.mk.persistence.GCPersistenceTest
Tests run: 8, Failures: 0, Errors: 0, Skipped: 0, Time elapsed: 1.204 sec
Running org.apache.jackrabbit.mk.store.DefaultRevisionStoreTest
Tests run: 5, Failures: 0, Errors: 0, Skipped: 2, Time elapsed: 0.194 sec
Running org.apache.jackrabbit.mk.util.IOUtilsTest
Tests run: 7, Failures: 0, Errors: 0, Skipped: 0, Time elapsed: 2.059 sec
Running org.apache.jackrabbit.mk.util.MicroKernelInputStreamTest
Tests run: 3, Failures: 0, Errors: 0, Skipped: 0, Time elapsed: 0.004 sec
Running org.apache.jackrabbit.mk.util.NameFilterTest
Tests run: 1, Failures: 0, Errors: 0, Skipped: 0, Time elapsed: 0.048 sec
Running org.apache.jackrabbit.mk.util.StringUtilsTest
Tests run: 1, Failures: 0, Errors: 0, Skipped: 0, Time elapsed: 0.001 sec

Results :

Tests run: 98, Failures: 0, Errors: 0, Skipped: 3

[INFO]
[INFO] --- maven-bundle-plugin:2.3.7:bundle (default-bundle) @ oak-mk ---
[INFO]
[INFO] --- maven-site-plugin:3.0:attach-descriptor (attach-descriptor) @ 
oak-mk ---
[INFO]
[INFO] --- apache-rat-plugin:0.8:check (default) @ oak-mk ---
[INFO] No excludes
[INFO]
[INFO] --- maven-checkstyle-plugin:2.9.1:check (default) @ oak-mk ---
[INFO]
[INFO] There are 2884 checkstyle errors.
[WARNING] checkstyle:check violations detected but failOnViolation set 
to false
[INFO]
[INFO] >>> findbugs-maven-plugin:2.5.2:check (default) @ oak-mk >>>
[INFO]
[INFO] --- findbugs-maven-plugin:2.5.2:findbugs (findbugs) @ oak-mk ---
[INFO] Fork Value is true
      [java] Warnings generated: 51
[INFO] Done FindBugs Analysis....
[INFO]
[INFO] <<< findbugs-maven-plugin:2.5.2:check (default) @ oak-mk <<<
[INFO]
[INFO] --- findbugs-maven-plugin:2.5.2:check (default) @ oak-mk ---
[INFO] BugInstance size is 51
[INFO] Error size is 0
[INFO] Total bugs: 51
[INFO] exceptional return value of java.io.File.delete() ignored in 
org.apache.jackrabbit.mk.blobs.AbstractBlobStore.writeBlob(String) 
["org.apache.jackrabbit.mk.blobs.AbstractBlobStore"] At 
AbstractBlobStore.java:[lines 65-460]
[INFO] 
org.apache.jackrabbit.mk.blobs.AbstractBlobStore$BlockId.getDigest() may 
expose internal representation by returning 
AbstractBlobStore$BlockId.digest 
["org.apache.jackrabbit.mk.blobs.AbstractBlobStore$BlockId"] At 
AbstractBlobStore.java:[lines 421-452]
[INFO] org.apache.jackrabbit.mk.blobs.DbBlobStore.sweep() may fail to 
clean up java.sql.Statement 
["org.apache.jackrabbit.mk.blobs.DbBlobStore", "java.sql.Statement"] At 
DbBlobStore.java:[lines 33-194]In Statement.java
[INFO] 
org.apache.jackrabbit.mk.blobs.DbBlobStore.mark(AbstractBlobStore$BlockId) 
may fail to clean up java.sql.Statement on checked exception 
["org.apache.jackrabbit.mk.blobs.DbBlobStore", "java.sql.Statement"] At 
DbBlobStore.java:[lines 33-194]In Statement.java
[INFO] 
org.apache.jackrabbit.mk.blobs.DbBlobStore.setConnectionPool(JdbcConnectionPool) 
may fail to clean up java.sql.Statement on checked exception 
["org.apache.jackrabbit.mk.blobs.DbBlobStore", "java.sql.Statement"] At 
DbBlobStore.java:[lines 33-194]In Statement.java
[INFO] org.apache.jackrabbit.mk.blobs.DbBlobStore.sweep() may fail to 
close PreparedStatement ["org.apache.jackrabbit.mk.blobs.DbBlobStore"] 
At DbBlobStore.java:[lines 33-194]
[INFO] Dead store to f in 
org.apache.jackrabbit.mk.blobs.FileBlobStore.mark(AbstractBlobStore$BlockId) 
["org.apache.jackrabbit.mk.blobs.FileBlobStore"] At 
FileBlobStore.java:[lines 40-201]
[INFO] org.apache.jackrabbit.mk.blobs.FileBlobStore.storeBlock(byte[], 
int, byte[]) may fail to clean up java.io.OutputStream on checked 
exception ["org.apache.jackrabbit.mk.blobs.FileBlobStore", 
"java.io.OutputStream"] At FileBlobStore.java:[lines 40-201]At 
OutputStream.java:[lines 29-135]
[INFO] org.apache.jackrabbit.mk.blobs.FileBlobStore.writeBlob(String) 
may fail to clean up java.io.InputStream on checked exception 
["org.apache.jackrabbit.mk.blobs.FileBlobStore", "java.io.InputStream"] 
At FileBlobStore.java:[lines 40-201]At InputStream.java:[lines 28-350]
[INFO] exceptional return value of java.io.File.mkdirs() ignored in new 
org.apache.jackrabbit.mk.blobs.FileBlobStore(String) 
["org.apache.jackrabbit.mk.blobs.FileBlobStore"] At 
FileBlobStore.java:[lines 40-201]
[INFO] exceptional return value of java.io.File.mkdir() ignored in 
org.apache.jackrabbit.mk.blobs.FileBlobStore.mark(AbstractBlobStore$BlockId) 
["org.apache.jackrabbit.mk.blobs.FileBlobStore"] At 
FileBlobStore.java:[lines 40-201]
[INFO] exceptional return value of java.io.File.renameTo(File) ignored 
in 
org.apache.jackrabbit.mk.blobs.FileBlobStore.mark(AbstractBlobStore$BlockId) 
["org.apache.jackrabbit.mk.blobs.FileBlobStore"] At 
FileBlobStore.java:[lines 40-201]
[INFO] exceptional return value of java.io.File.mkdir() ignored in 
org.apache.jackrabbit.mk.blobs.FileBlobStore.readBlockFromBackend(AbstractBlobStore$BlockId) 
["org.apache.jackrabbit.mk.blobs.FileBlobStore"] At 
FileBlobStore.java:[lines 40-201]
[INFO] exceptional return value of java.io.File.renameTo(File) ignored 
in 
org.apache.jackrabbit.mk.blobs.FileBlobStore.readBlockFromBackend(AbstractBlobStore$BlockId) 
["org.apache.jackrabbit.mk.blobs.FileBlobStore"] At 
FileBlobStore.java:[lines 40-201]
[INFO] exceptional return value of java.io.File.renameTo(File) ignored 
in org.apache.jackrabbit.mk.blobs.FileBlobStore.startMark() 
["org.apache.jackrabbit.mk.blobs.FileBlobStore"] At 
FileBlobStore.java:[lines 40-201]
[INFO] exceptional return value of java.io.File.mkdirs() ignored in 
org.apache.jackrabbit.mk.blobs.FileBlobStore.storeBlock(byte[], int, 
byte[]) ["org.apache.jackrabbit.mk.blobs.FileBlobStore"] At 
FileBlobStore.java:[lines 40-201]
[INFO] exceptional return value of java.io.File.renameTo(File) ignored 
in org.apache.jackrabbit.mk.blobs.FileBlobStore.storeBlock(byte[], int, 
byte[]) ["org.apache.jackrabbit.mk.blobs.FileBlobStore"] At 
FileBlobStore.java:[lines 40-201]
[INFO] exceptional return value of java.io.File.delete() ignored in 
org.apache.jackrabbit.mk.blobs.FileBlobStore.sweep() 
["org.apache.jackrabbit.mk.blobs.FileBlobStore"] At 
FileBlobStore.java:[lines 40-201]
[INFO] exceptional return value of java.io.File.delete() ignored in 
org.apache.jackrabbit.mk.blobs.FileBlobStore.writeBlob(String) 
["org.apache.jackrabbit.mk.blobs.FileBlobStore"] At 
FileBlobStore.java:[lines 40-201]
[INFO] exceptional return value of java.io.File.mkdirs() ignored in 
org.apache.jackrabbit.mk.blobs.FileBlobStore.writeBlob(String) 
["org.apache.jackrabbit.mk.blobs.FileBlobStore"] At 
FileBlobStore.java:[lines 40-201]
[INFO] exceptional return value of java.io.File.renameTo(File) ignored 
in org.apache.jackrabbit.mk.blobs.FileBlobStore.writeBlob(String) 
["org.apache.jackrabbit.mk.blobs.FileBlobStore"] At 
FileBlobStore.java:[lines 40-201]
[INFO] Possible null pointer dereference in 
org.apache.jackrabbit.mk.core.MicroKernelImpl.commit(String, String, 
String, String) due to return value of called method 
["org.apache.jackrabbit.mk.core.MicroKernelImpl"] At 
MicroKernelImpl.java:[lines 50-695]
[INFO] Nullcheck of commit at line 221 of value previously dereferenced 
in org.apache.jackrabbit.mk.core.MicroKernelImpl.getJournal(String, 
String, String) ["org.apache.jackrabbit.mk.core.MicroKernelImpl"] At 
MicroKernelImpl.java:[lines 50-695]
[INFO] instanceof will always return false in 
org.apache.jackrabbit.mk.core.Repository.init(), since a 
org.apache.jackrabbit.mk.persistence.H2Persistence can't be a 
org.apache.jackrabbit.mk.blobs.BlobStore 
["org.apache.jackrabbit.mk.core.Repository"] At Repository.java:[lines 
48-204]
[INFO] org.apache.jackrabbit.mk.htree.HashDirectory defines equals and 
uses Object.hashCode() ["org.apache.jackrabbit.mk.htree.HashDirectory"] 
At HashDirectory.java:[lines 37-660]
[INFO] Switch statement found in 
org.apache.jackrabbit.mk.htree.HashDirectory.deserialize(Binding) where 
default case is missing ["org.apache.jackrabbit.mk.htree.HashDirectory"] 
At HashDirectory.java:[lines 37-660]
[INFO] org.apache.jackrabbit.mk.htree.HashDirectory$BucketEntry inherits 
equals and uses Object.hashCode() 
["org.apache.jackrabbit.mk.htree.HashDirectory$BucketEntry"] At 
HashDirectory.java:[lines 601-629]
[INFO] org.apache.jackrabbit.mk.htree.HashDirectory$DirectoryEntry 
inherits equals and uses Object.hashCode() 
["org.apache.jackrabbit.mk.htree.HashDirectory$DirectoryEntry"] At 
HashDirectory.java:[lines 560-595]
[INFO] Possible null pointer dereference in 
org.apache.jackrabbit.mk.json.JsonObject.create(JsopTokenizer) due to 
return value of called method 
["org.apache.jackrabbit.mk.json.JsonObject"] At JsonObject.java:[lines 
25-69]
[INFO] org.apache.jackrabbit.mk.model.ChildNodeEntriesMap defines equals 
and uses Object.hashCode() 
["org.apache.jackrabbit.mk.model.ChildNodeEntriesMap"] At 
ChildNodeEntriesMap.java:[lines 35-230]
[INFO] org.apache.jackrabbit.mk.model.ChildNodeEntriesTree defines 
equals and uses Object.hashCode() 
["org.apache.jackrabbit.mk.model.ChildNodeEntriesTree"] At 
ChildNodeEntriesTree.java:[lines 36-697]
[INFO] org.apache.jackrabbit.mk.model.ChildNodeEntriesTree$Bucket 
defines equals and uses Object.hashCode() 
["org.apache.jackrabbit.mk.model.ChildNodeEntriesTree$Bucket"] At 
ChildNodeEntriesTree.java:[lines 647-667]
[INFO] org.apache.jackrabbit.mk.model.ChildNodeEntriesTree$BucketInfo 
defines equals and uses Object.hashCode() 
["org.apache.jackrabbit.mk.model.ChildNodeEntriesTree$BucketInfo"] At 
ChildNodeEntriesTree.java:[lines 619-641]
[INFO] org.apache.jackrabbit.mk.model.ChildNodeEntriesTree$NodeInfo 
defines equals and uses Object.hashCode() 
["org.apache.jackrabbit.mk.model.ChildNodeEntriesTree$NodeInfo"] At 
ChildNodeEntriesTree.java:[lines 674-689]
[INFO] org.apache.jackrabbit.mk.model.ChildNodeEntry defines equals and 
uses Object.hashCode() ["org.apache.jackrabbit.mk.model.ChildNodeEntry"] 
At ChildNodeEntry.java:[lines 27-50]
[INFO] org.apache.jackrabbit.mk.model.Id.getBytes() may expose internal 
representation by returning Id.raw ["org.apache.jackrabbit.mk.model.Id"] 
At Id.java:[lines 36-133]
[INFO] new org.apache.jackrabbit.mk.model.Id(byte[]) may expose internal 
representation by storing an externally mutable object into Id.raw 
["org.apache.jackrabbit.mk.model.Id"] At Id.java:[lines 36-133]
[INFO] return value of StagedNodeTree$StagedNode.add(String, JsonObject) 
ignored, is this OK in 
org.apache.jackrabbit.mk.model.StagedNodeTree.add(String, String, 
JsonObject) ["org.apache.jackrabbit.mk.model.StagedNodeTree"] At 
StagedNodeTree.java:[lines 36-588]
[INFO] return value of add(String, JsonObject) ignored, is this OK in 
org.apache.jackrabbit.mk.model.StagedNodeTree$StagedNode.add(String, 
JsonObject) ["org.apache.jackrabbit.mk.model.StagedNodeTree$StagedNode"] 
At StagedNodeTree.java:[lines 592-721]
[INFO] 
org.apache.jackrabbit.mk.persistence.H2Persistence.initialize(File) may 
fail to clean up java.sql.Statement 
["org.apache.jackrabbit.mk.persistence.H2Persistence", 
"java.sql.Statement"] At H2Persistence.java:[lines 44-379]In Statement.java
[INFO] org.apache.jackrabbit.mk.persistence.H2Persistence.readHead() may 
fail to clean up java.sql.ResultSet on checked exception 
["org.apache.jackrabbit.mk.persistence.H2Persistence", 
"java.sql.ResultSet"] At H2Persistence.java:[lines 44-379]In ResultSet.java
[INFO] org.apache.jackrabbit.mk.persistence.H2Persistence.readHead() may 
fail to clean up java.sql.Statement on checked exception 
["org.apache.jackrabbit.mk.persistence.H2Persistence", 
"java.sql.Statement"] At H2Persistence.java:[lines 44-379]In Statement.java
[INFO] 
org.apache.jackrabbit.mk.persistence.H2Persistence.readLastCommitId() 
may fail to clean up java.sql.ResultSet on checked exception 
["org.apache.jackrabbit.mk.persistence.H2Persistence", 
"java.sql.ResultSet"] At H2Persistence.java:[lines 44-379]In ResultSet.java
[INFO] 
org.apache.jackrabbit.mk.persistence.H2Persistence.readLastCommitId() 
may fail to clean up java.sql.Statement on checked exception 
["org.apache.jackrabbit.mk.persistence.H2Persistence", 
"java.sql.Statement"] At H2Persistence.java:[lines 44-379]In Statement.java
[INFO] org.apache.jackrabbit.mk.persistence.H2Persistence.writeHead(Id) 
may fail to clean up java.sql.Statement on checked exception 
["org.apache.jackrabbit.mk.persistence.H2Persistence", 
"java.sql.Statement"] At H2Persistence.java:[lines 44-379]In Statement.java
[INFO] 
org.apache.jackrabbit.mk.persistence.H2Persistence.initialize(File) may 
fail to close Statement 
["org.apache.jackrabbit.mk.persistence.H2Persistence"] At 
H2Persistence.java:[lines 44-379]
[INFO] exceptional return value of java.io.File.mkdirs() ignored in 
org.apache.jackrabbit.mk.persistence.H2Persistence.initialize(File) 
["org.apache.jackrabbit.mk.persistence.H2Persistence"] At 
H2Persistence.java:[lines 44-379]
[INFO] instanceof will always return true for all nonnull values in 
org.apache.jackrabbit.mk.store.DefaultRevisionStore.putNode(RevisionStore$PutToken, 
MutableNode), since all org.apache.jackrabbit.mk.model.MutableNode are 
instances of org.apache.jackrabbit.mk.store.PersistHook 
["org.apache.jackrabbit.mk.store.DefaultRevisionStore"] At 
DefaultRevisionStore.java:[lines 61-710]
[INFO] Unused public or protected field: 
org.apache.jackrabbit.mk.util.AbstractFilteringIterator.count 
["org.apache.jackrabbit.mk.util.AbstractFilteringIterator"] At 
AbstractFilteringIterator.java:[lines 30-60]
[INFO] return value of java.util.concurrent.CountDownLatch.await(long, 
TimeUnit) ignored in 
org.apache.jackrabbit.mk.util.CommitGate.waitForCommit(String, long) 
["org.apache.jackrabbit.mk.util.CommitGate"] At CommitGate.java:[lines 
26-73]
[INFO] Possible null pointer dereference in 
org.apache.jackrabbit.mk.util.NodeFilter.parse(String) due to return 
value of called method ["org.apache.jackrabbit.mk.util.NodeFilter"] At 
NodeFilter.java:[lines 45-97]
[INFO] 

[INFO] 
------------------------------------------------------------------------
[INFO] Building Oak MicroKernel Remoting 0.7
[INFO] 
------------------------------------------------------------------------
[INFO]
[INFO] --- maven-remote-resources-plugin:1.2.1:process (default) @ 
oak-mk-remote ---
[INFO]
[INFO] --- maven-resources-plugin:2.5:resources (default-resources) @ 
oak-mk-remote ---
[debug] execute contextualize
[INFO] Using 'UTF-8' encoding to copy filtered resources.
[INFO] Copying 20 resources
[INFO] Copying 3 resources
[INFO]
[INFO] --- maven-compiler-plugin:2.3.2:compile (default-compile) @ 
oak-mk-remote ---
[INFO] Compiling 15 source files to 
C:\projects\apache\jackrabbit\jackrabbit-dev\target\jackrabbit-oak-0.7\zip\jackrabbit-oak-0.7\oak-mk-remote\target\classes
[INFO]
[INFO] --- maven-scr-plugin:1.9.0:scr (generate-scr-scrdescriptor) @ 
oak-mk-remote ---
[INFO]
[INFO] --- maven-resources-plugin:2.5:testResources 
(default-testResources) @ oak-mk-remote ---
[debug] execute contextualize
[INFO] Using 'UTF-8' encoding to copy filtered resources.
[INFO] skip non existing resourceDirectory 
C:\projects\apache\jackrabbit\jackrabbit-dev\target\jackrabbit-oak-0.7\zip\jackrabbit-oak-0.7\oak-mk-remote\src\test\resources
[INFO] Copying 3 resources
[INFO]
[INFO] --- maven-compiler-plugin:2.3.2:testCompile (default-testCompile) 
@ oak-mk-remote ---
[INFO] Compiling 1 source file to 
C:\projects\apache\jackrabbit\jackrabbit-dev\target\jackrabbit-oak-0.7\zip\jackrabbit-oak-0.7\oak-mk-remote\target\test-classes
[INFO]
[INFO] --- maven-surefire-plugin:2.9:test (default-test) @ oak-mk-remote ---
[INFO] Surefire report directory: 
C:\projects\apache\jackrabbit\jackrabbit-dev\target\jackrabbit-oak-0.7\zip\jackrabbit-oak-0.7\oak-mk-remote\target\surefire-reports

-------------------------------------------------------
  T E S T S
-------------------------------------------------------
Running org.apache.jackrabbit.mk.server.BoundaryInputStreamTest
Tests run: 1, Failures: 0, Errors: 0, Skipped: 0, Time elapsed: 0.048 sec

Results :

Tests run: 1, Failures: 0, Errors: 0, Skipped: 0

[INFO]
[INFO] --- maven-bundle-plugin:2.3.7:bundle (default-bundle) @ 
oak-mk-remote ---
[INFO]
[INFO] --- maven-site-plugin:3.0:attach-descriptor (attach-descriptor) @ 
oak-mk-remote ---
[INFO]
[INFO] --- apache-rat-plugin:0.8:check (default) @ oak-mk-remote ---
[INFO] No excludes
[INFO]
[INFO] --- maven-checkstyle-plugin:2.9.1:check (default) @ oak-mk-remote ---
[INFO]
[INFO] There are 676 checkstyle errors.
[WARNING] checkstyle:check violations detected but failOnViolation set 
to false
[INFO]
[INFO] >>> findbugs-maven-plugin:2.5.2:check (default) @ oak-mk-remote >>>
[INFO]
[INFO] --- findbugs-maven-plugin:2.5.2:findbugs (findbugs) @ 
oak-mk-remote ---
[INFO] Fork Value is true
      [java] Warnings generated: 27
[INFO] Done FindBugs Analysis....
[INFO]
[INFO] <<< findbugs-maven-plugin:2.5.2:check (default) @ oak-mk-remote <<<
[INFO]
[INFO] --- findbugs-maven-plugin:2.5.2:check (default) @ oak-mk-remote ---
[INFO] BugInstance size is 27
[INFO] Error size is 0
[INFO] Total bugs: 27
[INFO] Unused field: org.apache.jackrabbit.mk.client.Client.executor 
["org.apache.jackrabbit.mk.client.Client"] At Client.java:[lines 39-383]
[INFO] Found reliance on default encoding in 
org.apache.jackrabbit.mk.client.HttpExecutor.execute(String, Map, 
InputStream): String.getBytes() 
["org.apache.jackrabbit.mk.client.HttpExecutor"] At 
HttpExecutor.java:[lines 57-292]
[INFO] Found reliance on default encoding in 
org.apache.jackrabbit.mk.client.HttpExecutor.execute(String, Map, 
InputStream): String.getBytes() 
["org.apache.jackrabbit.mk.client.HttpExecutor"] At 
HttpExecutor.java:[lines 57-292]
[INFO] Found reliance on default encoding in 
org.apache.jackrabbit.mk.client.HttpExecutor.execute(String, Map, 
InputStream): String.getBytes() 
["org.apache.jackrabbit.mk.client.HttpExecutor"] At 
HttpExecutor.java:[lines 57-292]
[INFO] Found reliance on default encoding in 
org.apache.jackrabbit.mk.client.HttpExecutor.execute(String, Map, 
InputStream): String.getBytes() 
["org.apache.jackrabbit.mk.client.HttpExecutor"] At 
HttpExecutor.java:[lines 57-292]
[INFO] Found reliance on default encoding in 
org.apache.jackrabbit.mk.client.HttpExecutor.execute(String, Map, 
InputStream): String.getBytes() 
["org.apache.jackrabbit.mk.client.HttpExecutor"] At 
HttpExecutor.java:[lines 57-292]
[INFO] Found reliance on default encoding in 
org.apache.jackrabbit.mk.client.HttpExecutor.execute(String, Map, 
InputStream): String.getBytes() 
["org.apache.jackrabbit.mk.client.HttpExecutor"] At 
HttpExecutor.java:[lines 57-292]
[INFO] Found reliance on default encoding in 
org.apache.jackrabbit.mk.client.HttpExecutor.execute(String, Map, 
InputStream): String.getBytes() 
["org.apache.jackrabbit.mk.client.HttpExecutor"] At 
HttpExecutor.java:[lines 57-292]
[INFO] Found reliance on default encoding in 
org.apache.jackrabbit.mk.client.HttpExecutor.execute(String, Map, 
InputStream): String.getBytes() 
["org.apache.jackrabbit.mk.client.HttpExecutor"] At 
HttpExecutor.java:[lines 57-292]
[INFO] Found reliance on default encoding in 
org.apache.jackrabbit.mk.client.HttpExecutor.execute(String, Map, 
InputStream): String.getBytes() 
["org.apache.jackrabbit.mk.client.HttpExecutor"] At 
HttpExecutor.java:[lines 57-292]
[INFO] Found reliance on default encoding in 
org.apache.jackrabbit.mk.client.HttpExecutor.execute(String, Map, 
InputStream): String.getBytes() 
["org.apache.jackrabbit.mk.client.HttpExecutor"] At 
HttpExecutor.java:[lines 57-292]
[INFO] Found reliance on default encoding in 
org.apache.jackrabbit.mk.client.HttpExecutor.execute(String, Map, 
InputStream): String.getBytes() 
["org.apache.jackrabbit.mk.client.HttpExecutor"] At 
HttpExecutor.java:[lines 57-292]
[INFO] Found reliance on default encoding in 
org.apache.jackrabbit.mk.client.HttpExecutor.writeLine(String): 
String.getBytes() ["org.apache.jackrabbit.mk.client.HttpExecutor"] At 
HttpExecutor.java:[lines 57-292]
[INFO] Found reliance on default encoding in 
org.apache.jackrabbit.mk.client.HttpExecutor.writeLine(String): 
String.getBytes() ["org.apache.jackrabbit.mk.client.HttpExecutor"] At 
HttpExecutor.java:[lines 57-292]
[INFO] org.apache.jackrabbit.mk.remote.util.BoundedInputStream.close() 
ignores result of java.io.InputStream.skip(long) 
["org.apache.jackrabbit.mk.remote.util.BoundedInputStream"] At 
BoundedInputStream.java:[lines 39-91]
[INFO] Found reliance on default encoding in 
org.apache.jackrabbit.mk.remote.util.ChunkedInputStream.<static 
initializer>(): String.getBytes() 
["org.apache.jackrabbit.mk.remote.util.ChunkedInputStream"] At 
ChunkedInputStream.java:[lines 42-222]
[INFO] Found reliance on default encoding in 
org.apache.jackrabbit.mk.remote.util.ChunkedOutputStream.<static 
initializer>(): String.getBytes() 
["org.apache.jackrabbit.mk.remote.util.ChunkedOutputStream"] At 
ChunkedOutputStream.java:[lines 34-188]
[INFO] Found reliance on default encoding in 
org.apache.jackrabbit.mk.remote.util.ChunkedOutputStream.<static 
initializer>(): String.getBytes() 
["org.apache.jackrabbit.mk.remote.util.ChunkedOutputStream"] At 
ChunkedOutputStream.java:[lines 34-188]
[INFO] Found reliance on default encoding in new 
org.apache.jackrabbit.mk.server.BoundaryInputStream(InputStream, String, 
int): String.getBytes() 
["org.apache.jackrabbit.mk.server.BoundaryInputStream"] At 
BoundaryInputStream.java:[lines 49-144]
[INFO] Found reliance on default encoding in 
org.apache.jackrabbit.mk.server.MicroKernelServlet.service(MicroKernel, 
Request, Response): new java.io.PrintStream(OutputStream) 
["org.apache.jackrabbit.mk.server.MicroKernelServlet"] At 
MicroKernelServlet.java:[lines 38-90]
[INFO] Found reliance on default encoding in 
org.apache.jackrabbit.mk.server.MicroKernelServlet.service(MicroKernel, 
Request, Response): new java.io.PrintStream(OutputStream) 
["org.apache.jackrabbit.mk.server.MicroKernelServlet"] At 
MicroKernelServlet.java:[lines 38-90]
[INFO] Found reliance on default encoding in 
org.apache.jackrabbit.mk.server.Request.getParameter(String): 
java.io.ByteArrayOutputStream.toString() 
["org.apache.jackrabbit.mk.server.Request"] At Request.java:[lines 35-286]
[INFO] Found reliance on default encoding in 
org.apache.jackrabbit.mk.server.Response.writeBody(byte[], int, int): 
String.getBytes() ["org.apache.jackrabbit.mk.server.Response"] At 
Response.java:[lines 32-216]
[INFO] Found reliance on default encoding in 
org.apache.jackrabbit.mk.server.Response.writeBody(byte[], int, int): 
String.getBytes() ["org.apache.jackrabbit.mk.server.Response"] At 
Response.java:[lines 32-216]
[INFO] Found reliance on default encoding in 
org.apache.jackrabbit.mk.server.Response.writeLine(String): 
String.getBytes() ["org.apache.jackrabbit.mk.server.Response"] At 
Response.java:[lines 32-216]
[INFO] Found reliance on default encoding in 
org.apache.jackrabbit.mk.server.Response.writeLine(String): 
String.getBytes() ["org.apache.jackrabbit.mk.server.Response"] At 
Response.java:[lines 32-216]
[INFO] Format string should use %n rather than \n in 
org.apache.jackrabbit.mk.server.Response.writeBody(byte[], int, int) 
["org.apache.jackrabbit.mk.server.Response"] At Response.java:[lines 32-216]
[INFO] 

[INFO] 
------------------------------------------------------------------------
[INFO] Building Oak Mongo MicroKernel 0.7
[INFO] 
------------------------------------------------------------------------
[WARNING] The POM for com.jamonapi:jamon:jar:2.4 is missing, no 
dependency information available
[INFO]
[INFO] --- maven-remote-resources-plugin:1.2.1:process (default) @ 
oak-mongomk ---
[WARNING] Missing POM for com.jamonapi:jamon:jar:2.4
[INFO]
[INFO] --- maven-resources-plugin:2.5:resources (default-resources) @ 
oak-mongomk ---
[debug] execute contextualize
[INFO] Using 'UTF-8' encoding to copy filtered resources.
[INFO] Copying 1 resource
[INFO] Copying 3 resources
[INFO]
[INFO] --- maven-compiler-plugin:2.3.2:compile (default-compile) @ 
oak-mongomk ---
[INFO] Compiling 29 source files to 
C:\projects\apache\jackrabbit\jackrabbit-dev\target\jackrabbit-oak-0.7\zip\jackrabbit-oak-0.7\oak-mongomk\target\classes
[INFO]
[INFO] --- maven-scr-plugin:1.9.0:scr (generate-scr-scrdescriptor) @ 
oak-mongomk ---
[INFO] Generating 1 MetaType Descriptor in 
C:\projects\apache\jackrabbit\jackrabbit-dev\target\jackrabbit-oak-0.7\zip\jackrabbit-oak-0.7\oak-mongomk\target\scr-plugin-generated\OSGI-INF\metatype\org.apache.jackrabbit.mongomk.osgi.MongoMicroKernelService.xml
[INFO] Writing 1 Service Component Descriptors to 
C:\projects\apache\jackrabbit\jackrabbit-dev\target\jackrabbit-oak-0.7\zip\jackrabbit-oak-0.7\oak-mongomk\target\scr-plugin-generated\OSGI-INF\org.apache.jackrabbit.mongomk.osgi.MongoMicroKernelService.xml
[INFO]
[INFO] --- maven-resources-plugin:2.5:testResources 
(default-testResources) @ oak-mongomk ---
[debug] execute contextualize
[INFO] Using 'UTF-8' encoding to copy filtered resources.
[INFO] Copying 2 resources
[INFO] Copying 3 resources
[INFO]
[INFO] --- maven-compiler-plugin:2.3.2:testCompile (default-testCompile) 
@ oak-mongomk ---
[INFO] Compiling 42 source files to 
C:\projects\apache\jackrabbit\jackrabbit-dev\target\jackrabbit-oak-0.7\zip\jackrabbit-oak-0.7\oak-mongomk\target\test-classes
[INFO]
[INFO] --- maven-surefire-plugin:2.9:test (default-test) @ oak-mongomk ---
[INFO] Surefire report directory: 
C:\projects\apache\jackrabbit\jackrabbit-dev\target\jackrabbit-oak-0.7\zip\jackrabbit-oak-0.7\oak-mongomk\target\surefire-reports

-------------------------------------------------------
  T E S T S
-------------------------------------------------------
Running org.apache.jackrabbit.mongomk.blob.MongoBlobStoreTest
Tests run: 1, Failures: 0, Errors: 0, Skipped: 1, Time elapsed: 9.085 sec
Running org.apache.jackrabbit.mongomk.blob.MongoMKGetLengthGridFSTest
Tests run: 1, Failures: 0, Errors: 0, Skipped: 1, Time elapsed: 0.001 sec
Running org.apache.jackrabbit.mongomk.blob.MongoMKGetLengthTest
Tests run: 1, Failures: 0, Errors: 0, Skipped: 1, Time elapsed: 0.001 sec
Running org.apache.jackrabbit.mongomk.blob.MongoMKReadGridFSTest
Tests run: 1, Failures: 0, Errors: 0, Skipped: 1, Time elapsed: 0.001 sec
Running org.apache.jackrabbit.mongomk.blob.MongoMKReadTest
Tests run: 1, Failures: 0, Errors: 0, Skipped: 1, Time elapsed: 0 sec
Running org.apache.jackrabbit.mongomk.blob.MongoMKWriteGridFSTest
Tests run: 1, Failures: 0, Errors: 0, Skipped: 1, Time elapsed: 0 sec
Running org.apache.jackrabbit.mongomk.blob.MongoMKWriteTest
Tests run: 1, Failures: 0, Errors: 0, Skipped: 1, Time elapsed: 0.001 sec
Running org.apache.jackrabbit.mongomk.BlobTest
Tests run: 1, Failures: 0, Errors: 0, Skipped: 0, Time elapsed: 0.176 sec
Running org.apache.jackrabbit.mongomk.ClusterTest
Tests run: 7, Failures: 0, Errors: 0, Skipped: 0, Time elapsed: 0.105 sec
Running org.apache.jackrabbit.mongomk.ConflictTest
Tests run: 45, Failures: 0, Errors: 0, Skipped: 0, Time elapsed: 0.131 sec
Running 
org.apache.jackrabbit.mongomk.impl.command.ConcurrentWriteMultipleMkMongoTest
Tests run: 1, Failures: 0, Errors: 0, Skipped: 1, Time elapsed: 0 sec
Running org.apache.jackrabbit.mongomk.impl.MongoMKConcurrentAddTest
Tests run: 1, Failures: 0, Errors: 0, Skipped: 1, Time elapsed: 0 sec
Running org.apache.jackrabbit.mongomk.impl.MongoMKGetChildCountTest
Tests run: 1, Failures: 0, Errors: 0, Skipped: 1, Time elapsed: 0 sec
Running org.apache.jackrabbit.mongomk.impl.MongoMKGetJournalTest
Tests run: 1, Failures: 0, Errors: 0, Skipped: 1, Time elapsed: 0.001 sec
Running org.apache.jackrabbit.mongomk.impl.MongoMKGetRevisionHistoryTest
Tests run: 1, Failures: 0, Errors: 0, Skipped: 1, Time elapsed: 0 sec
Running org.apache.jackrabbit.mongomk.impl.MongoMKLimitsTest
Tests run: 1, Failures: 0, Errors: 0, Skipped: 1, Time elapsed: 0 sec
Running org.apache.jackrabbit.mongomk.impl.MongoMKWaitForCommitTest
Tests run: 1, Failures: 0, Errors: 0, Skipped: 1, Time elapsed: 0 sec
Running org.apache.jackrabbit.mongomk.MongoDbTest
Tests run: 1, Failures: 0, Errors: 0, Skipped: 1, Time elapsed: 0 sec
Running org.apache.jackrabbit.mongomk.MongoDocumentStoreTest
Tests run: 4, Failures: 0, Errors: 0, Skipped: 1, Time elapsed: 0 sec
Running org.apache.jackrabbit.mongomk.MongoMKBranchMergeTest
Tests run: 19, Failures: 0, Errors: 0, Skipped: 2, Time elapsed: 0.416 sec
Running org.apache.jackrabbit.mongomk.MongoMKBranchTest
Tests run: 2, Failures: 0, Errors: 0, Skipped: 0, Time elapsed: 0.001 sec
Running org.apache.jackrabbit.mongomk.MongoMKCommitAddTest
Tests run: 14, Failures: 0, Errors: 0, Skipped: 1, Time elapsed: 0.013 sec
Running org.apache.jackrabbit.mongomk.MongoMKCommitCopyTest
Tests run: 21, Failures: 0, Errors: 0, Skipped: 14, Time elapsed: 0.011 sec
Running org.apache.jackrabbit.mongomk.MongoMKCommitMoveTest
Tests run: 1, Failures: 0, Errors: 0, Skipped: 1, Time elapsed: 0 sec
Running org.apache.jackrabbit.mongomk.MongoMKCommitRemoveTest
Tests run: 6, Failures: 0, Errors: 0, Skipped: 1, Time elapsed: 0.001 sec
Running org.apache.jackrabbit.mongomk.MongoMKDiffTest
Tests run: 1, Failures: 0, Errors: 0, Skipped: 1, Time elapsed: 0 sec
Running org.apache.jackrabbit.mongomk.MongoMKGetHeadRevisionTest
Tests run: 1, Failures: 0, Errors: 0, Skipped: 0, Time elapsed: 0 sec
Running org.apache.jackrabbit.mongomk.MongoMKGetNodesTest
Tests run: 7, Failures: 0, Errors: 0, Skipped: 3, Time elapsed: 0.001 sec
Running org.apache.jackrabbit.mongomk.MongoMKNodeExistsTest
Tests run: 8, Failures: 0, Errors: 0, Skipped: 0, Time elapsed: 0.01 sec
Running org.apache.jackrabbit.mongomk.MongoMKRebaseTest
Tests run: 1, Failures: 0, Errors: 0, Skipped: 1, Time elapsed: 0 sec
Running org.apache.jackrabbit.mongomk.multitenancy.MultiTenancyTest
Tests run: 1, Failures: 0, Errors: 0, Skipped: 1, Time elapsed: 0.001 sec
Running org.apache.jackrabbit.mongomk.RandomizedClusterTest
Tests run: 1, Failures: 0, Errors: 0, Skipped: 1, Time elapsed: 0 sec
Running org.apache.jackrabbit.mongomk.RandomizedTest
Tests run: 2, Failures: 0, Errors: 0, Skipped: 0, Time elapsed: 1.783 sec
Running org.apache.jackrabbit.mongomk.RevisionTest
Tests run: 6, Failures: 0, Errors: 0, Skipped: 0, Time elapsed: 0.033 sec
Running org.apache.jackrabbit.mongomk.SimpleTest
Tests run: 18, Failures: 0, Errors: 0, Skipped: 0, Time elapsed: 0.024 sec

Results :

Tests run: 181, Failures: 0, Errors: 0, Skipped: 42

[INFO]
[INFO] --- maven-bundle-plugin:2.3.7:bundle (default-bundle) @ 
oak-mongomk ---
[INFO]
[INFO] --- maven-site-plugin:3.0:attach-descriptor (attach-descriptor) @ 
oak-mongomk ---
[INFO]
[INFO] --- apache-rat-plugin:0.8:check (default) @ oak-mongomk ---
[INFO] No excludes
[INFO]
[INFO] --- maven-checkstyle-plugin:2.9.1:check (default) @ oak-mongomk ---
[INFO]
[INFO] There are 1583 checkstyle errors.
[WARNING] checkstyle:check violations detected but failOnViolation set 
to false
[INFO]
[INFO] >>> findbugs-maven-plugin:2.5.2:check (default) @ oak-mongomk >>>
[INFO]
[INFO] --- findbugs-maven-plugin:2.5.2:findbugs (findbugs) @ oak-mongomk ---
[INFO] Fork Value is true
      [java] Warnings generated: 19
[INFO] Done FindBugs Analysis....
[INFO]
[INFO] <<< findbugs-maven-plugin:2.5.2:check (default) @ oak-mongomk <<<
[INFO]
[INFO] --- findbugs-maven-plugin:2.5.2:check (default) @ oak-mongomk ---
[INFO] BugInstance size is 19
[INFO] Error size is 0
[INFO] Total bugs: 19
[INFO] Vacuous comparison of integer value 
org.apache.jackrabbit.mongomk.Commit.createOrUpdateNode(DocumentStore, 
UpdateOp) ["org.apache.jackrabbit.mongomk.Commit"] At Commit.java:[lines 
41-520]
[INFO] org.apache.jackrabbit.mongomk.Commit.splitDocument(Map) makes 
inefficient use of keySet iterator instead of entrySet iterator 
["org.apache.jackrabbit.mongomk.Commit"] At Commit.java:[lines 41-520]
[INFO] Possible null pointer dereference in 
org.apache.jackrabbit.mongomk.MemoryDocumentStore.createOrUpdate(DocumentStore$Collection, 
UpdateOp) due to return value of called method 
["org.apache.jackrabbit.mongomk.MemoryDocumentStore"] At 
MemoryDocumentStore.java:[lines 37-301]
[INFO] org.apache.jackrabbit.mongomk.MemoryDocumentStore.toString() 
makes inefficient use of keySet iterator instead of entrySet iterator 
["org.apache.jackrabbit.mongomk.MemoryDocumentStore"] At 
MemoryDocumentStore.java:[lines 37-301]
[INFO] org.apache.jackrabbit.mongomk.MongoDocumentStore.finalize() is 
public; should be protected 
["org.apache.jackrabbit.mongomk.MongoDocumentStore"] At 
MongoDocumentStore.java:[lines 53-452]
[INFO] Possible null pointer dereference in 
org.apache.jackrabbit.mongomk.MongoDocumentStore.createOrUpdate(DocumentStore$Collection, 
UpdateOp) due to return value of called method 
["org.apache.jackrabbit.mongomk.MongoDocumentStore"] At 
MongoDocumentStore.java:[lines 53-452]
[INFO] Synchronization performed on 
java.util.concurrent.atomic.AtomicBoolean in 
org.apache.jackrabbit.mongomk.MongoMK.dispose() 
["org.apache.jackrabbit.mongomk.MongoMK"] At MongoMK.java:[lines 65-1419]
[INFO] Load of known null value in 
org.apache.jackrabbit.mongomk.MongoMK.diff(String, String, String, int) 
["org.apache.jackrabbit.mongomk.MongoMK"] At MongoMK.java:[lines 65-1419]
[INFO] Possible null pointer dereference in 
org.apache.jackrabbit.mongomk.MongoMK.backgroundRead() due to return 
value of called method ["org.apache.jackrabbit.mongomk.MongoMK"] At 
MongoMK.java:[lines 65-1419]
[INFO] Possible null pointer dereference in 
org.apache.jackrabbit.mongomk.MongoMK.commit(String, String, String, 
String) due to return value of called method 
["org.apache.jackrabbit.mongomk.MongoMK"] At MongoMK.java:[lines 65-1419]
[INFO] Possible null pointer dereference in 
org.apache.jackrabbit.mongomk.MongoMK.parseAddNode(Commit, JsopReader, 
String) due to return value of called method 
["org.apache.jackrabbit.mongomk.MongoMK"] At MongoMK.java:[lines 65-1419]
[INFO] org.apache.jackrabbit.mongomk.MongoMK.getLatestValue(Map, 
Revision, Revision) makes inefficient use of keySet iterator instead of 
entrySet iterator ["org.apache.jackrabbit.mongomk.MongoMK"] At 
MongoMK.java:[lines 65-1419]
[INFO] org.apache.jackrabbit.mongomk.MongoMK.getLiveRevision(Map, 
Revision, Set) makes inefficient use of keySet iterator instead of 
entrySet iterator ["org.apache.jackrabbit.mongomk.MongoMK"] At 
MongoMK.java:[lines 65-1419]
[INFO] org.apache.jackrabbit.mongomk.MongoMK.readNode(String, Revision) 
makes inefficient use of keySet iterator instead of entrySet iterator 
["org.apache.jackrabbit.mongomk.MongoMK"] At MongoMK.java:[lines 65-1419]
[INFO] Synchronization performed on 
java.util.concurrent.atomic.AtomicBoolean in 
org.apache.jackrabbit.mongomk.MongoMK$BackgroundOperation.run() 
["org.apache.jackrabbit.mongomk.MongoMK$BackgroundOperation"] At 
MongoMK.java:[lines 1285-1305]
[INFO] org.apache.jackrabbit.mongomk.Revision.equals(Object) does not 
check for null argument ["org.apache.jackrabbit.mongomk.Revision"] At 
Revision.java:[lines 55-182]
[INFO] org.apache.jackrabbit.mongomk.Revision$RevisionComparator 
implements Comparator but not Serializable 
["org.apache.jackrabbit.mongomk.Revision$RevisionComparator"] At 
Revision.java:[lines 213-357]
[INFO] Possible null pointer dereference in 
org.apache.jackrabbit.mongomk.UnmergedBranches.init(DocumentStore, int) 
due to return value of called method 
["org.apache.jackrabbit.mongomk.UnmergedBranches"] At 
UnmergedBranches.java:[lines 39-147]
[INFO] new 
org.apache.jackrabbit.mongomk.blob.gridfs.ReadBlobCommandGridFS(GridFS, 
String, long, byte[], int, int) may expose internal representation by 
storing an externally mutable object into ReadBlobCommandGridFS.buffer 
["org.apache.jackrabbit.mongomk.blob.gridfs.ReadBlobCommandGridFS"] At 
ReadBlobCommandGridFS.java:[lines 32-86]
[INFO] 

[INFO] 
------------------------------------------------------------------------
[INFO] Building Oak Integration Tests for MicroKernel implementations 0.7
[INFO] 
------------------------------------------------------------------------
[INFO]
[INFO] --- maven-remote-resources-plugin:1.2.1:process (default) @ 
oak-it-mk ---
[INFO]
[INFO] --- maven-resources-plugin:2.5:resources (default-resources) @ 
oak-it-mk ---
[debug] execute contextualize
[INFO] Using 'UTF-8' encoding to copy filtered resources.
[INFO] skip non existing resourceDirectory 
C:\projects\apache\jackrabbit\jackrabbit-dev\target\jackrabbit-oak-0.7\zip\jackrabbit-oak-0.7\oak-it\mk\src\main\resources
[INFO] Copying 3 resources
[INFO]
[INFO] --- maven-compiler-plugin:2.3.2:compile (default-compile) @ 
oak-it-mk ---
[INFO] Compiling 6 source files to 
C:\projects\apache\jackrabbit\jackrabbit-dev\target\jackrabbit-oak-0.7\zip\jackrabbit-oak-0.7\oak-it\mk\target\classes
[INFO]
[INFO] --- maven-resources-plugin:2.5:testResources 
(default-testResources) @ oak-it-mk ---
[debug] execute contextualize
[INFO] Using 'UTF-8' encoding to copy filtered resources.
[INFO] Copying 3 resources
[INFO] Copying 3 resources
[INFO]
[INFO] --- maven-compiler-plugin:2.3.2:testCompile (default-testCompile) 
@ oak-it-mk ---
[INFO] Compiling 6 source files to 
C:\projects\apache\jackrabbit\jackrabbit-dev\target\jackrabbit-oak-0.7\zip\jackrabbit-oak-0.7\oak-it\mk\target\test-classes
[INFO]
[INFO] --- maven-surefire-plugin:2.9:test (default-test) @ oak-it-mk ---
[INFO] Surefire report directory: 
C:\projects\apache\jackrabbit\jackrabbit-dev\target\jackrabbit-oak-0.7\zip\jackrabbit-oak-0.7\oak-it\mk\target\surefire-reports

-------------------------------------------------------
  T E S T S
-------------------------------------------------------

Results :

Tests run: 0, Failures: 0, Errors: 0, Skipped: 0

[INFO]
[INFO] --- maven-jar-plugin:2.3.1:jar (default-jar) @ oak-it-mk ---
[INFO] Building jar: 
C:\projects\apache\jackrabbit\jackrabbit-dev\target\jackrabbit-oak-0.7\zip\jackrabbit-oak-0.7\oak-it\mk\target\oak-it-mk-0.7.jar
[INFO]
[INFO] --- maven-site-plugin:3.0:attach-descriptor (attach-descriptor) @ 
oak-it-mk ---
[INFO]
[INFO] --- apache-rat-plugin:0.8:check (default) @ oak-it-mk ---
[INFO] Exclude: README.md
[INFO]
[INFO] --- maven-checkstyle-plugin:2.9.1:check (default) @ oak-it-mk ---
[INFO]
[INFO] There are 518 checkstyle errors.
[WARNING] checkstyle:check violations detected but failOnViolation set 
to false
[INFO]
[INFO] >>> findbugs-maven-plugin:2.5.2:check (default) @ oak-it-mk >>>
[INFO]
[INFO] --- findbugs-maven-plugin:2.5.2:findbugs (findbugs) @ oak-it-mk ---
[INFO] Fork Value is true
      [java] Warnings generated: 8
[INFO] Done FindBugs Analysis....
[INFO]
[INFO] <<< findbugs-maven-plugin:2.5.2:check (default) @ oak-it-mk <<<
[INFO]
[INFO] --- findbugs-maven-plugin:2.5.2:check (default) @ oak-it-mk ---
[INFO] BugInstance size is 8
[INFO] Error size is 0
[INFO] Total bugs: 8
[INFO] 
org.apache.jackrabbit.mk.test.AbstractMicroKernelIT.assertPropertyValue(JSONObject, 
String, Object[]) invokes inefficient new Long(long) constructor; use 
Long.valueOf(long) instead 
["org.apache.jackrabbit.mk.test.AbstractMicroKernelIT"] At 
AbstractMicroKernelIT.java:[lines 55-392]
[INFO] Inconsistent synchronization of 
org.apache.jackrabbit.mk.test.AbstractMicroKernelIT.parser; locked 75% 
of time ["org.apache.jackrabbit.mk.test.AbstractMicroKernelIT"] At 
AbstractMicroKernelIT.java:[lines 55-392]
[INFO] org.apache.jackrabbit.mk.test.DataStoreIT.doTestRead(byte[], int, 
String) may fail to close stream 
["org.apache.jackrabbit.mk.test.DataStoreIT"] At DataStoreIT.java:[lines 
37-128]
[INFO] 
org.apache.jackrabbit.mk.test.MicroKernelIT.trunkMergeNotAllowed() might 
ignore java.lang.Exception 
["org.apache.jackrabbit.mk.test.MicroKernelIT", "java.lang.Exception"] 
At MicroKernelIT.java:[lines 52-1338]At Exception.java:[lines 29-78]
[INFO] Dead store to array in 
org.apache.jackrabbit.mk.test.MicroKernelIT.branchAndMerge() 
["org.apache.jackrabbit.mk.test.MicroKernelIT"] At 
MicroKernelIT.java:[lines 52-1338]
[INFO] Dead store to rev1 in 
org.apache.jackrabbit.mk.test.MicroKernelIT.diffDepthLimited() 
["org.apache.jackrabbit.mk.test.MicroKernelIT"] At 
MicroKernelIT.java:[lines 52-1338]
[INFO] Dead store to rev1 in 
org.apache.jackrabbit.mk.test.MicroKernelIT.diffFiltered() 
["org.apache.jackrabbit.mk.test.MicroKernelIT"] At 
MicroKernelIT.java:[lines 52-1338]
[INFO] org.apache.jackrabbit.mk.test.MicroKernelIT.testBlobs(int, int) 
may fail to close stream ["org.apache.jackrabbit.mk.test.MicroKernelIT"] 
At MicroKernelIT.java:[lines 52-1338]
[INFO] 

[INFO] 
------------------------------------------------------------------------
[INFO] Building Oak Core 0.7
[INFO] 
------------------------------------------------------------------------
[INFO]
[INFO] --- maven-remote-resources-plugin:1.2.1:process (default) @ 
oak-core ---
[INFO]
[INFO] --- maven-resources-plugin:2.5:resources (default-resources) @ 
oak-core ---
[debug] execute contextualize
[INFO] Using 'UTF-8' encoding to copy filtered resources.
[INFO] Copying 1 resource
[INFO] Copying 3 resources
[INFO]
[INFO] --- maven-compiler-plugin:2.3.2:compile (default-compile) @ 
oak-core ---
[INFO] Compiling 485 source files to 
C:\projects\apache\jackrabbit\jackrabbit-dev\target\jackrabbit-oak-0.7\zip\jackrabbit-oak-0.7\oak-core\target\classes
[INFO]
[INFO] --- maven-scr-plugin:1.9.0:scr (generate-scr-scrdescriptor) @ 
oak-core ---
[INFO] Writing 1 Service Component Descriptors to 
C:\projects\apache\jackrabbit\jackrabbit-dev\target\jackrabbit-oak-0.7\zip\jackrabbit-oak-0.7\oak-core\target\scr-plugin-generated\OSGI-INF\org.apache.jackrabbit.oak.plugins.commit.ConflictValidatorProvider.xml
[INFO] Writing 1 Service Component Descriptors to 
C:\projects\apache\jackrabbit\jackrabbit-dev\target\jackrabbit-oak-0.7\zip\jackrabbit-oak-0.7\oak-core\target\scr-plugin-generated\OSGI-INF\org.apache.jackrabbit.oak.plugins.index.property.PropertyIndexEditorProvider.xml
[INFO] Writing 1 Service Component Descriptors to 
C:\projects\apache\jackrabbit\jackrabbit-dev\target\jackrabbit-oak-0.7\zip\jackrabbit-oak-0.7\oak-core\target\scr-plugin-generated\OSGI-INF\org.apache.jackrabbit.oak.plugins.index.property.PropertyIndexProvider.xml
[INFO] Writing 1 Service Component Descriptors to 
C:\projects\apache\jackrabbit\jackrabbit-dev\target\jackrabbit-oak-0.7\zip\jackrabbit-oak-0.7\oak-core\target\scr-plugin-generated\OSGI-INF\org.apache.jackrabbit.oak.plugins.name.NamespaceValidatorProvider.xml
[INFO] Writing 1 Service Component Descriptors to 
C:\projects\apache\jackrabbit\jackrabbit-dev\target\jackrabbit-oak-0.7\zip\jackrabbit-oak-0.7\oak-core\target\scr-plugin-generated\OSGI-INF\org.apache.jackrabbit.oak.plugins.name.NameValidatorProvider.xml
[INFO] Writing 1 Service Component Descriptors to 
C:\projects\apache\jackrabbit\jackrabbit-dev\target\jackrabbit-oak-0.7\zip\jackrabbit-oak-0.7\oak-core\target\scr-plugin-generated\OSGI-INF\org.apache.jackrabbit.oak.plugins.nodetype.RegistrationEditorProvider.xml
[INFO] Writing 1 Service Component Descriptors to 
C:\projects\apache\jackrabbit\jackrabbit-dev\target\jackrabbit-oak-0.7\zip\jackrabbit-oak-0.7\oak-core\target\scr-plugin-generated\OSGI-INF\org.apache.jackrabbit.oak.plugins.nodetype.TypeEditorProvider.xml
[INFO] Writing 1 Service Component Descriptors to 
C:\projects\apache\jackrabbit\jackrabbit-dev\target\jackrabbit-oak-0.7\zip\jackrabbit-oak-0.7\oak-core\target\scr-plugin-generated\OSGI-INF\org.apache.jackrabbit.oak.plugins.nodetype.write.InitialContent.xml
[INFO] Writing 1 Service Component Descriptors to 
C:\projects\apache\jackrabbit\jackrabbit-dev\target\jackrabbit-oak-0.7\zip\jackrabbit-oak-0.7\oak-core\target\scr-plugin-generated\OSGI-INF\org.apache.jackrabbit.oak.plugins.segment.SegmentNodeStoreService.xml
[INFO] Writing 1 Service Component Descriptors to 
C:\projects\apache\jackrabbit\jackrabbit-dev\target\jackrabbit-oak-0.7\zip\jackrabbit-oak-0.7\oak-core\target\scr-plugin-generated\OSGI-INF\org.apache.jackrabbit.oak.plugins.version.VersionEditorProvider.xml
[INFO]
[INFO] --- maven-resources-plugin:2.5:testResources 
(default-testResources) @ oak-core ---
[debug] execute contextualize
[INFO] Using 'UTF-8' encoding to copy filtered resources.
[INFO] Copying 9 resources
[INFO] Copying 3 resources
[INFO]
[INFO] --- maven-compiler-plugin:2.3.2:testCompile (default-testCompile) 
@ oak-core ---
[INFO] Compiling 119 source files to 
C:\projects\apache\jackrabbit\jackrabbit-dev\target\jackrabbit-oak-0.7\zip\jackrabbit-oak-0.7\oak-core\target\test-classes
[INFO]
[INFO] --- maven-surefire-plugin:2.9:test (default-test) @ oak-core ---
[INFO] Surefire report directory: 
C:\projects\apache\jackrabbit\jackrabbit-dev\target\jackrabbit-oak-0.7\zip\jackrabbit-oak-0.7\oak-core\target\surefire-reports

-------------------------------------------------------
  T E S T S
-------------------------------------------------------
Running org.apache.jackrabbit.oak.api.ContentSessionTest
Tests run: 3, Failures: 0, Errors: 0, Skipped: 0, Time elapsed: 0.452 sec
Running org.apache.jackrabbit.oak.api.QueryTest
Tests run: 1, Failures: 0, Errors: 0, Skipped: 0, Time elapsed: 2.303 sec
Running org.apache.jackrabbit.oak.api.RootTest
Tests run: 2, Failures: 0, Errors: 0, Skipped: 0, Time elapsed: 0.028 sec
Running org.apache.jackrabbit.oak.api.TreeTest
Tests run: 11, Failures: 0, Errors: 0, Skipped: 0, Time elapsed: 0.056 sec
Running org.apache.jackrabbit.oak.api.UniquePropertyTest
Tests run: 1, Failures: 0, Errors: 0, Skipped: 0, Time elapsed: 1.785 sec
Running org.apache.jackrabbit.oak.core.DefaultConflictHandlerOursTest
Tests run: 7, Failures: 0, Errors: 0, Skipped: 0, Time elapsed: 0.043 sec
Running org.apache.jackrabbit.oak.core.DefaultConflictHandlerTheirsTest
Tests run: 7, Failures: 0, Errors: 0, Skipped: 0, Time elapsed: 0.039 sec
Running org.apache.jackrabbit.oak.core.ImmutableRootTest
Tests run: 2, Failures: 0, Errors: 0, Skipped: 0, Time elapsed: 0.002 sec
Running org.apache.jackrabbit.oak.core.ImmutableTreeTest
Tests run: 4, Failures: 0, Errors: 0, Skipped: 0, Time elapsed: 0.011 sec
Running org.apache.jackrabbit.oak.core.RootImplTest
Tests run: 17, Failures: 0, Errors: 0, Skipped: 0, Time elapsed: 0.165 sec
Running org.apache.jackrabbit.oak.core.TreeImplTest
Tests run: 21, Failures: 0, Errors: 0, Skipped: 0, Time elapsed: 3.496 sec
Running org.apache.jackrabbit.oak.kernel.JsopDiffTest
Tests run: 2, Failures: 0, Errors: 0, Skipped: 0, Time elapsed: 0.001 sec
Running org.apache.jackrabbit.oak.kernel.KernelNodeBuilderTest
Tests run: 2, Failures: 0, Errors: 0, Skipped: 0, Time elapsed: 0 sec
Running org.apache.jackrabbit.oak.kernel.KernelNodeStateTest
Tests run: 6, Failures: 0, Errors: 0, Skipped: 0, Time elapsed: 0.002 sec
Running org.apache.jackrabbit.oak.kernel.KernelNodeStoreCacheTest
Tests run: 4, Failures: 0, Errors: 0, Skipped: 0, Time elapsed: 0.002 sec
Running org.apache.jackrabbit.oak.kernel.KernelNodeStoreTest
Tests run: 5, Failures: 0, Errors: 0, Skipped: 0, Time elapsed: 0.054 sec
Running org.apache.jackrabbit.oak.kernel.LargeKernelNodeStateTest
Tests run: 3, Failures: 0, Errors: 0, Skipped: 0, Time elapsed: 0.07 sec
Running org.apache.jackrabbit.oak.kernel.TypeCodesTest
Tests run: 4, Failures: 0, Errors: 0, Skipped: 0, Time elapsed: 0.001 sec
Running org.apache.jackrabbit.oak.namepath.GlobalNameMapperTest
Tests run: 4, Failures: 0, Errors: 0, Skipped: 0, Time elapsed: 0 sec
Running org.apache.jackrabbit.oak.namepath.NamePathMapperImplTest
Tests run: 10, Failures: 0, Errors: 0, Skipped: 2, Time elapsed: 0.063 sec
Running org.apache.jackrabbit.oak.OakTest
Tests run: 1, Failures: 0, Errors: 0, Skipped: 0, Time elapsed: 0.001 sec
Running org.apache.jackrabbit.oak.plugins.identifier.IdentifierManagerTest
Tests run: 4, Failures: 0, Errors: 0, Skipped: 0, Time elapsed: 1.835 sec
Running org.apache.jackrabbit.oak.plugins.index.AsyncIndexUpdateTest
Tests run: 3, Failures: 0, Errors: 0, Skipped: 0, Time elapsed: 0.005 sec
Running org.apache.jackrabbit.oak.plugins.index.diffindex.DiffCollectorTest
Tests run: 3, Failures: 0, Errors: 0, Skipped: 0, Time elapsed: 0.001 sec
Running org.apache.jackrabbit.oak.plugins.index.IndexUpdateTest
Tests run: 4, Failures: 0, Errors: 0, Skipped: 0, Time elapsed: 0.757 sec
Running org.apache.jackrabbit.oak.plugins.index.nodetype.NodeTypeIndexTest
Tests run: 1, Failures: 0, Errors: 0, Skipped: 0, Time elapsed: 0.291 sec
Running 
org.apache.jackrabbit.oak.plugins.index.property.PropertyIndexQueryTest
Tests run: 6, Failures: 0, Errors: 0, Skipped: 0, Time elapsed: 4.586 sec
Running org.apache.jackrabbit.oak.plugins.index.property.PropertyIndexTest
Tests run: 8, Failures: 0, Errors: 0, Skipped: 0, Time elapsed: 0.555 sec
Running org.apache.jackrabbit.oak.plugins.index.property.RelativePathTest
Tests run: 1, Failures: 0, Errors: 0, Skipped: 0, Time elapsed: 0.262 sec
Running 
org.apache.jackrabbit.oak.plugins.index.property.strategy.ContentMirrorStoreStrategyTest
Tests run: 2, Failures: 0, Errors: 0, Skipped: 0, Time elapsed: 0 sec
Running org.apache.jackrabbit.oak.plugins.memory.MemoryNodeBuilderTest
Tests run: 26, Failures: 0, Errors: 0, Skipped: 0, Time elapsed: 0.014 sec
Running org.apache.jackrabbit.oak.plugins.memory.MemoryPropertyBuilderTest
Tests run: 12, Failures: 0, Errors: 0, Skipped: 0, Time elapsed: 0.004 sec
Running org.apache.jackrabbit.oak.plugins.memory.PropertyStatesTest
Tests run: 3, Failures: 0, Errors: 0, Skipped: 0, Time elapsed: 0.001 sec
Running org.apache.jackrabbit.oak.plugins.name.NameValidatorTest
Tests run: 10, Failures: 0, Errors: 0, Skipped: 0, Time elapsed: 0.002 sec
Running 
org.apache.jackrabbit.oak.plugins.name.ReadWriteNamespaceRegistryTest
Tests run: 1, Failures: 0, Errors: 0, Skipped: 0, Time elapsed: 0 sec
Running org.apache.jackrabbit.oak.plugins.nodetype.TypeEditorTest
Tests run: 1, Failures: 0, Errors: 0, Skipped: 0, Time elapsed: 0.181 sec
Running 
org.apache.jackrabbit.oak.plugins.segment.CompareAgainstBaseStateTest
Tests run: 8, Failures: 0, Errors: 0, Skipped: 0, Time elapsed: 0.13 sec
Running org.apache.jackrabbit.oak.plugins.segment.JournalTest
Tests run: 3, Failures: 0, Errors: 0, Skipped: 0, Time elapsed: 0.004 sec
Running org.apache.jackrabbit.oak.plugins.segment.RecordTest
Tests run: 10, Failures: 0, Errors: 0, Skipped: 0, Time elapsed: 0.679 sec
Running org.apache.jackrabbit.oak.plugins.segment.SegmentSizeTest
Tests run: 5, Failures: 0, Errors: 0, Skipped: 0, Time elapsed: 0.046 sec
Running org.apache.jackrabbit.oak.query.ast.FullTextTest
Tests run: 6, Failures: 0, Errors: 0, Skipped: 0, Time elapsed: 0.001 sec
Running org.apache.jackrabbit.oak.query.ast.LikePatternTest
Tests run: 1, Failures: 0, Errors: 0, Skipped: 0, Time elapsed: 0 sec
Running org.apache.jackrabbit.oak.query.index.FilterTest
Tests run: 3, Failures: 0, Errors: 0, Skipped: 0, Time elapsed: 1.051 sec
Running org.apache.jackrabbit.oak.query.index.TraversingIndexQueryTest
Tests run: 2, Failures: 0, Errors: 0, Skipped: 0, Time elapsed: 2.932 sec
Running org.apache.jackrabbit.oak.query.index.TraversingIndexTest
Tests run: 1, Failures: 0, Errors: 0, Skipped: 0, Time elapsed: 0.006 sec
Running org.apache.jackrabbit.oak.query.SQL2ParserTest
Tests run: 2, Failures: 0, Errors: 0, Skipped: 0, Time elapsed: 0.273 sec
Running 
org.apache.jackrabbit.oak.security.authentication.GuestDefaultLoginModuleTest
Tests run: 2, Failures: 0, Errors: 0, Skipped: 0, Time elapsed: 1.28 sec
Running 
org.apache.jackrabbit.oak.security.authentication.Jackrabbit2ConfigurationTest
Tests run: 9, Failures: 0, Errors: 0, Skipped: 0, Time elapsed: 3.593 sec
Running 
org.apache.jackrabbit.oak.security.authentication.ldap.LdapLoginStandaloneTest
Tests run: 1, Failures: 0, Errors: 0, Skipped: 1, Time elapsed: 0.001 sec
Running 
org.apache.jackrabbit.oak.security.authentication.ldap.LdapLoginWithRepoLoginTest
Tests run: 1, Failures: 0, Errors: 0, Skipped: 1, Time elapsed: 0.001 sec
Running 
org.apache.jackrabbit.oak.security.authentication.token.TokenAuthenticationTest
Tests run: 6, Failures: 0, Errors: 0, Skipped: 0, Time elapsed: 2.101 sec
Running 
org.apache.jackrabbit.oak.security.authentication.token.TokenInfoTest
Tests run: 5, Failures: 0, Errors: 0, Skipped: 0, Time elapsed: 1.393 sec
Running 
org.apache.jackrabbit.oak.security.authentication.token.TokenLoginModuleTest
Tests run: 6, Failures: 0, Errors: 0, Skipped: 0, Time elapsed: 1.825 sec
Running 
org.apache.jackrabbit.oak.security.authentication.token.TokenProviderImplTest
Tests run: 15, Failures: 0, Errors: 0, Skipped: 0, Time elapsed: 4.276 sec
Running 
org.apache.jackrabbit.oak.security.authentication.TokenDefaultLoginModuleTest
Tests run: 9, Failures: 0, Errors: 0, Skipped: 0, Time elapsed: 2.509 sec
Running 
org.apache.jackrabbit.oak.security.authentication.user.LoginModuleImplTest
Tests run: 6, Failures: 0, Errors: 0, Skipped: 0, Time elapsed: 1.649 sec
Running 
org.apache.jackrabbit.oak.security.authentication.user.UserAuthenticationTest
Tests run: 8, Failures: 0, Errors: 0, Skipped: 0, Time elapsed: 2.225 sec
Running 
org.apache.jackrabbit.oak.security.authorization.AccessControlManagerImplTest
Tests run: 90, Failures: 0, Errors: 0, Skipped: 0, Time elapsed: 32.659 sec
Running 
org.apache.jackrabbit.oak.security.authorization.AccessControlValidatorTest
Tests run: 14, Failures: 0, Errors: 0, Skipped: 0, Time elapsed: 6.56 sec
Running org.apache.jackrabbit.oak.security.authorization.ACLTest
Tests run: 42, Failures: 0, Errors: 0, Skipped: 3, Time elapsed: 17.76 sec
Running org.apache.jackrabbit.oak.security.authorization.EffectivePolicyTest
Tests run: 1, Failures: 0, Errors: 0, Skipped: 1, Time elapsed: 0.002 sec
Running 
org.apache.jackrabbit.oak.security.authorization.evaluation.ChildOrderPropertyTest
Tests run: 5, Failures: 0, Errors: 0, Skipped: 0, Time elapsed: 2.268 sec
Running 
org.apache.jackrabbit.oak.security.authorization.evaluation.HiddenTreeTest
Tests run: 4, Failures: 0, Errors: 0, Skipped: 4, Time elapsed: 0.001 sec
Running 
org.apache.jackrabbit.oak.security.authorization.evaluation.Jr2CompatibilityTest
Tests run: 1, Failures: 0, Errors: 0, Skipped: 0, Time elapsed: 0.482 sec
Running org.apache.jackrabbit.oak.security.authorization.evaluation.RootTest
Tests run: 8, Failures: 0, Errors: 0, Skipped: 0, Time elapsed: 3.544 sec
Running 
org.apache.jackrabbit.oak.security.authorization.evaluation.ShadowInvisibleContentTest
Tests run: 3, Failures: 0, Errors: 0, Skipped: 2, Time elapsed: 0.44 sec
Running org.apache.jackrabbit.oak.security.authorization.evaluation.TreeTest
Tests run: 9, Failures: 0, Errors: 0, Skipped: 0, Time elapsed: 3.992 sec
Running 
org.apache.jackrabbit.oak.security.authorization.permission.AllPermissionsTest
Tests run: 3, Failures: 0, Errors: 0, Skipped: 0, Time elapsed: 1.055 sec
Running 
org.apache.jackrabbit.oak.security.authorization.permission.CompiledPermissionImplTest
Tests run: 25, Failures: 0, Errors: 0, Skipped: 21, Time elapsed: 1.642 sec
Running 
org.apache.jackrabbit.oak.security.authorization.permission.PermissionHookTest
Tests run: 7, Failures: 0, Errors: 0, Skipped: 0, Time elapsed: 2.759 sec
Running 
org.apache.jackrabbit.oak.security.authorization.permission.ReadStatusTest
Tests run: 1, Failures: 0, Errors: 0, Skipped: 0, Time elapsed: 0.001 sec
Running org.apache.jackrabbit.oak.security.authorization.ReadPolicyTest
Tests run: 2, Failures: 0, Errors: 0, Skipped: 0, Time elapsed: 0.734 sec
Running 
org.apache.jackrabbit.oak.security.authorization.restriction.RestrictionProviderImplTest
Tests run: 5, Failures: 0, Errors: 0, Skipped: 0, Time elapsed: 2.107 sec
Running org.apache.jackrabbit.oak.security.ConfigurationParametersTest
Tests run: 6, Failures: 0, Errors: 0, Skipped: 0, Time elapsed: 0.001 sec
Running 
org.apache.jackrabbit.oak.security.principal.PrincipalProviderImplTest
Tests run: 7, Failures: 0, Errors: 0, Skipped: 0, Time elapsed: 2.886 sec
Running 
org.apache.jackrabbit.oak.security.privilege.PrivilegeBitsProviderTest
Tests run: 10, Failures: 0, Errors: 0, Skipped: 0, Time elapsed: 3.692 sec
Running org.apache.jackrabbit.oak.security.privilege.PrivilegeBitsTest
Tests run: 13, Failures: 0, Errors: 0, Skipped: 0, Time elapsed: 0.018 sec
Running 
org.apache.jackrabbit.oak.security.privilege.PrivilegeDefinitionReaderTest
Tests run: 2, Failures: 0, Errors: 0, Skipped: 0, Time elapsed: 0.001 sec
Running 
org.apache.jackrabbit.oak.security.privilege.PrivilegeDefinitionWriterTest
Tests run: 1, Failures: 0, Errors: 0, Skipped: 0, Time elapsed: 0.001 sec
Running org.apache.jackrabbit.oak.security.privilege.PrivilegeValidatorTest
Tests run: 6, Failures: 0, Errors: 0, Skipped: 0, Time elapsed: 2.256 sec
Running org.apache.jackrabbit.oak.security.user.AuthorizableImplTest
Tests run: 3, Failures: 0, Errors: 0, Skipped: 0, Time elapsed: 1.435 sec
Running org.apache.jackrabbit.oak.security.user.query.UserQueryManagerTest
Tests run: 4, Failures: 0, Errors: 0, Skipped: 0, Time elapsed: 1.735 sec
Running org.apache.jackrabbit.oak.security.user.UserInitializerTest
Tests run: 6, Failures: 0, Errors: 0, Skipped: 0, Time elapsed: 2.673 sec
Running org.apache.jackrabbit.oak.security.user.UserManagerImplTest
Tests run: 7, Failures: 0, Errors: 0, Skipped: 0, Time elapsed: 2.947 sec
Running org.apache.jackrabbit.oak.security.user.UserProviderTest
Tests run: 11, Failures: 0, Errors: 0, Skipped: 0, Time elapsed: 3.264 sec
Running org.apache.jackrabbit.oak.security.user.UserValidatorTest
Tests run: 12, Failures: 0, Errors: 0, Skipped: 0, Time elapsed: 4.608 sec
Running org.apache.jackrabbit.oak.spi.commit.SubtreeValidatorTest
Tests run: 1, Failures: 0, Errors: 0, Skipped: 0, Time elapsed: 0 sec
Running 
org.apache.jackrabbit.oak.spi.security.authentication.AbstractLoginModuleTest
Tests run: 3, Failures: 0, Errors: 0, Skipped: 0, Time elapsed: 0.001 sec
Running 
org.apache.jackrabbit.oak.spi.security.authentication.external.ExternalLoginModuleTest
Tests run: 8, Failures: 0, Errors: 0, Skipped: 0, Time elapsed: 3.668 sec
Running 
org.apache.jackrabbit.oak.spi.security.authentication.GuestLoginModuleTest
Tests run: 3, Failures: 0, Errors: 0, Skipped: 0, Time elapsed: 0.001 sec
Running org.apache.jackrabbit.oak.spi.security.authentication.PreAuthTest
Tests run: 6, Failures: 0, Errors: 0, Skipped: 0, Time elapsed: 2.448 sec
Running org.apache.jackrabbit.oak.spi.security.authorization.ACETest
Tests run: 13, Failures: 0, Errors: 0, Skipped: 0, Time elapsed: 5.328 sec
Running 
org.apache.jackrabbit.oak.spi.security.authorization.ImmutableACLTest
Tests run: 14, Failures: 0, Errors: 0, Skipped: 0, Time elapsed: 5.949 sec
Running 
org.apache.jackrabbit.oak.spi.security.authorization.restriction.RestrictionDefinitionImplTest
Tests run: 7, Failures: 0, Errors: 0, Skipped: 0, Time elapsed: 2.814 sec
Running 
org.apache.jackrabbit.oak.spi.security.authorization.restriction.RestrictionImplTest
Tests run: 7, Failures: 0, Errors: 0, Skipped: 0, Time elapsed: 3.109 sec
Running 
org.apache.jackrabbit.oak.spi.security.principal.EveryonePrincipalTest
Tests run: 7, Failures: 0, Errors: 0, Skipped: 0, Time elapsed: 0.001 sec
Running org.apache.jackrabbit.oak.spi.security.principal.PrincipalImplTest
Tests run: 3, Failures: 0, Errors: 0, Skipped: 0, Time elapsed: 0.002 sec
Running 
org.apache.jackrabbit.oak.spi.security.user.action.AccessControlActionTest
Tests run: 2, Failures: 0, Errors: 0, Skipped: 0, Time elapsed: 0.701 sec
Running 
org.apache.jackrabbit.oak.spi.security.user.action.PasswordValidationActionTest
Tests run: 4, Failures: 0, Errors: 0, Skipped: 0, Time elapsed: 2.18 sec
Running org.apache.jackrabbit.oak.spi.security.user.util.PasswordUtilityTest
Tests run: 8, Failures: 0, Errors: 0, Skipped: 0, Time elapsed: 0.523 sec
Running org.apache.jackrabbit.oak.util.JsopUtilTest
Tests run: 1, Failures: 0, Errors: 0, Skipped: 0, Time elapsed: 0.001 sec
Running org.apache.jackrabbit.oak.util.TreeLocationTest
Tests run: 5, Failures: 0, Errors: 0, Skipped: 0, Time elapsed: 0.001 sec

Results :

Tests run: 711, Failures: 0, Errors: 0, Skipped: 35

[INFO]
[INFO] --- maven-bundle-plugin:2.3.7:bundle (default-bundle) @ oak-core ---
[INFO]
[INFO] --- maven-site-plugin:3.0:attach-descriptor (attach-descriptor) @ 
oak-core ---
[INFO]
[INFO] --- maven-jar-plugin:2.3.1:test-jar (default) @ oak-core ---
[INFO] Building jar: 
C:\projects\apache\jackrabbit\jackrabbit-dev\target\jackrabbit-oak-0.7\zip\jackrabbit-oak-0.7\oak-core\target\oak-core-0.7-tests.jar
[INFO]
[INFO] --- apache-rat-plugin:0.8:check (default) @ oak-core ---
[INFO] Exclude: src/test/resources/org/apache/jackrabbit/oak/util/test.json
[INFO] 
------------------------------------------------------------------------
[INFO] Reactor Summary:
[INFO]
[INFO] Oak Parent POM .................................... SUCCESS [42.674s]
[INFO] Oak Commons ....................................... SUCCESS [37.242s]
[INFO] Oak MicroKernel API ............................... SUCCESS [15.813s]
[INFO] Oak MicroKernel ................................... SUCCESS 
[1:07.592s]
[INFO] Oak MicroKernel Remoting .......................... SUCCESS [18.077s]
[INFO] Oak Mongo MicroKernel ............................. SUCCESS [36.058s]
[INFO] Oak Integration Tests for MicroKernel implementations  SUCCESS 
[14.948s]
[INFO] Oak Core .......................................... FAILURE 
[3:30.433s]
[INFO] Oak JCR Binding ................................... SKIPPED
[INFO] Oak upgrade ....................................... SKIPPED
[INFO] Oak support for Apache Sling ...................... SKIPPED
[INFO] Oak HTTP Binding .................................. SKIPPED
[INFO] Oak Lucene ........................................ SKIPPED
[INFO] Oak Solr core ..................................... SKIPPED
[INFO] Oak Solr remote ................................... SKIPPED
[INFO] Oak Solr embedded ................................. SKIPPED
[INFO] Oak Runnable Jar .................................. SKIPPED
[INFO] Oak Integration Tests for OSGi deployments ........ SKIPPED
[INFO] Oak Integration Tests ............................. SKIPPED
[INFO] Jackrabbit Oak .................................... SKIPPED
[INFO] 
------------------------------------------------------------------------
[INFO] BUILD FAILURE
[INFO] 
------------------------------------------------------------------------
[INFO] Total time: 7:32.668s
[INFO] Finished at: Fri May 10 13:14:55 CEST 2013
[INFO] Final Memory: 90M/240M
[INFO] 
------------------------------------------------------------------------
[ERROR] Failed to execute goal 
org.apache.rat:apache-rat-plugin:0.8:check (default) on project 
oak-core: Too many unapproved licenses: 1 -> [Help 1]
[ERROR]
[ERROR] To see the full stack trace of the errors, re-run Maven with the 
-e switch.
[ERROR] Re-run Maven using the -X switch to enable full debug logging.
[ERROR]
[ERROR] For more information about the errors and possible solutions, 
please read the following articles:
[ERROR] [Help 1] 
http://cwiki.apache.org/confluence/display/MAVEN/MojoFailureException
[ERROR]
[ERROR] After correcting the problems, you can resume the build with the 
command
[ERROR]   mvn <goals> -rf :oak-core
[ERROR]   NOT OK: mvn verify -Ppedantic

Mime
View raw message