jackrabbit-oak-dev mailing list archives

Site index · List index
Message view « Date » · « Thread »
Top « Date » · « Thread »
From Michael Dürig <mdue...@apache.org>
Subject Test failure: testSelector(org.apache.jackrabbit.test.api.query.qom.SelectorTest
Date Wed, 25 Jul 2012 08:48:47 GMT

Hi,

While running the integration tests locally I got the following failure. 
Seems to be a transient issue since it went away on the 2nd try.

Michael

-------------------------------------------------------------------------------
Test set: org.apache.jackrabbit.oak.jcr.JcrTckIT
-------------------------------------------------------------------------------
Tests run: 1906, Failures: 0, Errors: 1, Skipped: 0, Time elapsed: 
217.939 sec <<< FAILURE!
testSelector(org.apache.jackrabbit.test.api.query.qom.SelectorTest) 
Time elapsed: 30.567 sec  <<< ERROR!
org.apache.jackrabbit.mk.api.MicroKernelException: 
org.apache.jackrabbit.mk.store.NotFoundException: 000000000009d2e3
	at 
org.apache.jackrabbit.mk.core.MicroKernelImpl.getNodes(MicroKernelImpl.java:348)
	at 
org.apache.jackrabbit.oak.kernel.KernelNodeState.init(KernelNodeState.java:94)
	at 
org.apache.jackrabbit.oak.kernel.KernelNodeState.getProperty(KernelNodeState.java:138)
	at 
org.apache.jackrabbit.oak.plugins.memory.MemoryNodeStateBuilder.getProperty(MemoryNodeStateBuilder.java:244)
	at org.apache.jackrabbit.oak.core.TreeImpl.getProperty(TreeImpl.java:121)
	at 
org.apache.jackrabbit.oak.jcr.NodeDelegate.getProperty(NodeDelegate.java:140)
	at org.apache.jackrabbit.oak.jcr.NodeImpl.hasProperty(NodeImpl.java:674)
	at 
org.apache.jackrabbit.oak.jcr.NodeImpl.getPrimaryNodeType(NodeImpl.java:702)
	at org.apache.jackrabbit.oak.jcr.NodeImpl.isNodeType(NodeImpl.java:748)
	at 
org.apache.jackrabbit.test.api.query.qom.SelectorTest$1.call(SelectorTest.java:49)
	at 
org.apache.jackrabbit.test.api.query.qom.AbstractQOMTest.forQOMandSQL2(AbstractQOMTest.java:210)
	at 
org.apache.jackrabbit.test.api.query.qom.SelectorTest.testSelector(SelectorTest.java:40)
	at sun.reflect.NativeMethodAccessorImpl.invoke0(Native Method)
	at 
sun.reflect.NativeMethodAccessorImpl.invoke(NativeMethodAccessorImpl.java:39)
	at 
sun.reflect.DelegatingMethodAccessorImpl.invoke(DelegatingMethodAccessorImpl.java:25)
	at java.lang.reflect.Method.invoke(Method.java:597)
	at junit.framework.TestCase.runTest(TestCase.java:168)
	at junit.framework.TestCase.runBare(TestCase.java:134)
	at junit.framework.TestResult$1.protect(TestResult.java:110)
	at junit.framework.TestResult.runProtected(TestResult.java:128)
	at junit.framework.TestResult.run(TestResult.java:113)
	at junit.framework.TestCase.run(TestCase.java:124)
	at org.apache.jackrabbit.test.AbstractJCRTest.run(AbstractJCRTest.java:456)
	at junit.framework.TestSuite.runTest(TestSuite.java:243)
	at junit.framework.TestSuite.run(TestSuite.java:238)
	at junit.framework.TestSuite.runTest(TestSuite.java:243)
	at junit.framework.TestSuite.run(TestSuite.java:238)
	at junit.framework.TestSuite.runTest(TestSuite.java:243)
	at 
org.apache.jackrabbit.test.ConcurrentTestSuite.access$001(ConcurrentTestSuite.java:29)
	at 
org.apache.jackrabbit.test.ConcurrentTestSuite$2.run(ConcurrentTestSuite.java:67)
	at EDU.oswego.cs.dl.util.concurrent.PooledExecutor$Worker.run(Unknown 
Source)
	at java.lang.Thread.run(Thread.java:680)
Caused by: org.apache.jackrabbit.mk.store.NotFoundException: 
000000000009d2e3
	at 
org.apache.jackrabbit.mk.persistence.H2Persistence.readCommit(H2Persistence.java:174)
	at 
org.apache.jackrabbit.mk.store.DefaultRevisionStore.getCommit(DefaultRevisionStore.java:373)
	at 
org.apache.jackrabbit.mk.store.DefaultRevisionStore.getRootNode(DefaultRevisionStore.java:381)
	at 
org.apache.jackrabbit.mk.core.Repository.getNodeState(Repository.java:168)
	at 
org.apache.jackrabbit.mk.core.MicroKernelImpl.getNodes(MicroKernelImpl.java:339)
	... 31 more

Mime
View raw message