jackrabbit-oak-dev mailing list archives

Site index · List index
Message view « Date » · « Thread »
Top « Date » · « Thread »
From jenkins-no-re...@cloudbees.com
Subject Build failed in Jenkins: oak #31
Date Tue, 10 Jul 2012 10:06:16 GMT
See <https://jukka.ci.cloudbees.com/job/oak/31/changes>

Changes:

[jukka] OAK-12: Implement a test suite for the MicroKernel

Clear fields in MK integration tests to avoid extra memory use with JUnit

[jukka] OAK-176: Reduce CoreValueFactoryImpl footprint

[mduerig] JCR-3376: TCK: SQLPathTest.testChildAxisRoot expected root node not in result 
this is fixed now: remove exclusion of  org.apache.jackrabbit.test.api.query.SQLPathTest#testChildAxisRoot
again

------------------------------------------
[...truncated 329 lines...]
Tests run: 1, Failures: 0, Errors: 0, Skipped: 0, Time elapsed: 3.07 sec
Running org.apache.jackrabbit.mk.util.CommitGateIT
Tests run: 1, Failures: 0, Errors: 0, Skipped: 0, Time elapsed: 0.213 sec

Results :

Tests run: 2, Failures: 0, Errors: 0, Skipped: 0

[JENKINS] Recording test results
[INFO] [INFO] Failsafe report directory: <https://jukka.ci.cloudbees.com/job/oak/ws/oak-mk/target/failsafe-reports>

[INFO] --- maven-failsafe-plugin:2.12:verify (default) @ oak-mk ---
[INFO] [INFO] No excludes

[INFO] --- apache-rat-plugin:0.8:check (default) @ oak-mk ---
[INFO] [INFO] Installing <https://jukka.ci.cloudbees.com/job/oak/ws/oak-mk/target/oak-mk-0.4-SNAPSHOT.jar>
to /home/hudson/.m2/repository/org/apache/jackrabbit/oak-mk/0.4-SNAPSHOT/oak-mk-0.4-SNAPSHOT.jar

[INFO] --- maven-install-plugin:2.3.1:install (default-install) @ oak-mk ---
[INFO] Installing <https://jukka.ci.cloudbees.com/job/oak/ws/oak-mk/pom.xml> to /home/hudson/.m2/repository/org/apache/jackrabbit/oak-mk/0.4-SNAPSHOT/oak-mk-0.4-SNAPSHOT.pom
[INFO] 
[INFO] --- maven-bundle-plugin:2.3.7:install (default-install) @ oak-mk ---
[INFO] Installing org/apache/jackrabbit/oak-mk/0.4-SNAPSHOT/oak-mk-0.4-SNAPSHOT.jar
[INFO] Writing OBR metadata
[JENKINS] Archiving <https://jukka.ci.cloudbees.com/job/oak/ws/oak-mk/pom.xml> to /home/jukka/hudson_home/jobs/oak/modules/org.apache.jackrabbit$oak-mk/builds/2012-07-10_06-02-42/archive/org.apache.jackrabbit/oak-mk/0.4-SNAPSHOT/oak-mk-0.4-SNAPSHOT.pom
[JENKINS] Archiving <https://jukka.ci.cloudbees.com/job/oak/ws/oak-mk/target/oak-mk-0.4-SNAPSHOT.jar>
to /home/jukka/hudson_home/jobs/oak/modules/org.apache.jackrabbit$oak-mk/builds/2012-07-10_06-02-42/archive/org.apache.jackrabbit/oak-mk/0.4-SNAPSHOT/oak-mk-0.4-SNAPSHOT.jar
[INFO]                                                                         
[INFO] ------------------------------------------------------------------------
[INFO] Building Oak MicroKernel Remoting 0.4-SNAPSHOT
[INFO] ------------------------------------------------------------------------
[INFO] 
[INFO] --- maven-clean-plugin:2.4.1:clean (default-clean) @ oak-mk-remote ---
[INFO] 
[INFO] --- maven-remote-resources-plugin:1.2.1:process (default) @ oak-mk-remote ---
[INFO] [debug] execute contextualize
[INFO] Using 'UTF-8' encoding to copy filtered resources.

[INFO] --- maven-resources-plugin:2.5:resources (default-resources) @ oak-mk-remote ---
[INFO] Copying 20 resources
[INFO] Copying 3 resources
[INFO] 
[INFO] --- maven-compiler-plugin:2.3.2:compile (default-compile) @ oak-mk-remote ---
[INFO] Compiling 15 source files to <https://jukka.ci.cloudbees.com/job/oak/ws/oak-mk-remote/target/classes>
[INFO] 
[INFO] --- maven-scr-plugin:1.7.4:scr (generate-scr-scrdescriptor) @ oak-mk-remote ---
[debug] execute contextualize
[INFO] [INFO] Using 'UTF-8' encoding to copy filtered resources.
[INFO] skip non existing resourceDirectory <https://jukka.ci.cloudbees.com/job/oak/ws/oak-mk-remote/src/test/resources>
[INFO] Copying 3 resources

[INFO] --- maven-resources-plugin:2.5:testResources (default-testResources) @ oak-mk-remote
---
[INFO] 
[INFO] --- maven-compiler-plugin:2.3.2:testCompile (default-testCompile) @ oak-mk-remote ---
[INFO] Compiling 1 source file to <https://jukka.ci.cloudbees.com/job/oak/ws/oak-mk-remote/target/test-classes>
[INFO] 
[INFO] --- maven-surefire-plugin:2.9:test (default-test) @ oak-mk-remote ---
[INFO] Surefire report directory: <https://jukka.ci.cloudbees.com/job/oak/ws/oak-mk-remote/target/surefire-reports>

-------------------------------------------------------
 T E S T S
-------------------------------------------------------
Running org.apache.jackrabbit.mk.server.BoundaryInputStreamTest
Tests run: 1, Failures: 0, Errors: 0, Skipped: 0, Time elapsed: 0.101 sec

Results :

Tests run: 1, Failures: 0, Errors: 0, Skipped: 0

[JENKINS] Recording test results
[INFO] 
[INFO] --- maven-bundle-plugin:2.3.7:bundle (default-bundle) @ oak-mk-remote ---
[WARNING] Bundle org.apache.jackrabbit:oak-mk-remote:bundle:0.4-SNAPSHOT : Split package org/apache/jackrabbit/mk/server
Use directive -split-package:=(merge-first|merge-last|error|first) on Export/Private Package
instruction to get rid of this warning
Package found in   [Jar:., Jar:oak-mk]
Reference from     <https://jukka.ci.cloudbees.com/job/oak/ws/oak-mk/target/oak-mk-0.4-SNAPSHOT.jar>
Classpath          [Jar:., Jar:org.osgi.core, Jar:org.osgi.compendium, Jar:bndlib, Jar:org.apache.felix.scr.annotations,
Jar:oak-mk, Jar:oak-mk-api, Jar:oak-commons, Jar:slf4j-api, Jar:jsr305]
[INFO] 
[INFO] --- maven-site-plugin:3.0:attach-descriptor (attach-descriptor) @ oak-mk-remote ---
[INFO] 
[INFO] --- maven-failsafe-plugin:2.12:integration-test (default) @ oak-mk-remote ---
[INFO] Failsafe report directory: <https://jukka.ci.cloudbees.com/job/oak/ws/oak-mk-remote/target/failsafe-reports>

-------------------------------------------------------
 T E S T S
-------------------------------------------------------

Results :

Tests run: 0, Failures: 0, Errors: 0, Skipped: 0

[JENKINS] Recording test results
[INFO] Failsafe report directory: <https://jukka.ci.cloudbees.com/job/oak/ws/oak-mk-remote/target/failsafe-reports>
[INFO] 
[INFO] --- maven-failsafe-plugin:2.12:verify (default) @ oak-mk-remote ---
[INFO] [INFO] No excludes

[INFO] --- apache-rat-plugin:0.8:check (default) @ oak-mk-remote ---
[INFO] [INFO] Installing <https://jukka.ci.cloudbees.com/job/oak/ws/oak-mk-remote/target/oak-mk-remote-0.4-SNAPSHOT.jar>
to /home/hudson/.m2/repository/org/apache/jackrabbit/oak-mk-remote/0.4-SNAPSHOT/oak-mk-remote-0.4-SNAPSHOT.jar

[INFO] --- maven-install-plugin:2.3.1:install (default-install) @ oak-mk-remote ---
[INFO] Installing <https://jukka.ci.cloudbees.com/job/oak/ws/oak-mk-remote/pom.xml>
to /home/hudson/.m2/repository/org/apache/jackrabbit/oak-mk-remote/0.4-SNAPSHOT/oak-mk-remote-0.4-SNAPSHOT.pom
[INFO] 
[INFO] --- maven-bundle-plugin:2.3.7:install (default-install) @ oak-mk-remote ---
[INFO] Installing org/apache/jackrabbit/oak-mk-remote/0.4-SNAPSHOT/oak-mk-remote-0.4-SNAPSHOT.jar
[INFO] Writing OBR metadata
[JENKINS] Archiving <https://jukka.ci.cloudbees.com/job/oak/ws/oak-mk-remote/pom.xml>
to /home/jukka/hudson_home/jobs/oak/modules/org.apache.jackrabbit$oak-mk-remote/builds/2012-07-10_06-02-42/archive/org.apache.jackrabbit/oak-mk-remote/0.4-SNAPSHOT/oak-mk-remote-0.4-SNAPSHOT.pom
[JENKINS] Archiving <https://jukka.ci.cloudbees.com/job/oak/ws/oak-mk-remote/target/oak-mk-remote-0.4-SNAPSHOT.jar>
to /home/jukka/hudson_home/jobs/oak/modules/org.apache.jackrabbit$oak-mk-remote/builds/2012-07-10_06-02-42/archive/org.apache.jackrabbit/oak-mk-remote/0.4-SNAPSHOT/oak-mk-remote-0.4-SNAPSHOT.jar
[INFO]                                                                         
[INFO] ------------------------------------------------------------------------
[INFO] Building Oak Integration Tests for MicroKernel implementations 0.4-SNAPSHOT
[INFO] ------------------------------------------------------------------------
[INFO] 
[INFO] --- maven-clean-plugin:2.4.1:clean (default-clean) @ oak-it-mk ---
[INFO] 
[INFO] --- maven-remote-resources-plugin:1.2.1:process (default) @ oak-it-mk ---
[INFO] 
[INFO] --- maven-resources-plugin:2.5:resources (default-resources) @ oak-it-mk ---
[debug] execute contextualize
[INFO] Using 'UTF-8' encoding to copy filtered resources.
[INFO] skip non existing resourceDirectory <https://jukka.ci.cloudbees.com/job/oak/ws/oak-it/mk/src/main/resources>
[INFO] Copying 3 resources
[INFO] 
[INFO] --- maven-compiler-plugin:2.3.2:compile (default-compile) @ oak-it-mk ---
[INFO] Compiling 6 source files to <https://jukka.ci.cloudbees.com/job/oak/ws/oak-it/mk/target/classes>
[INFO] [debug] execute contextualize

[INFO] --- maven-resources-plugin:2.5:testResources (default-testResources) @ oak-it-mk ---
[INFO] Using 'UTF-8' encoding to copy filtered resources.
[INFO] Copying 2 resources
[INFO] Copying 3 resources
[INFO] 
[INFO] --- maven-compiler-plugin:2.3.2:testCompile (default-testCompile) @ oak-it-mk ---
[INFO] Compiling 3 source files to <https://jukka.ci.cloudbees.com/job/oak/ws/oak-it/mk/target/test-classes>
[INFO] 
[INFO] --- maven-surefire-plugin:2.9:test (default-test) @ oak-it-mk ---
[INFO] Surefire report directory: <https://jukka.ci.cloudbees.com/job/oak/ws/oak-it/mk/target/surefire-reports>

-------------------------------------------------------
 T E S T S
-------------------------------------------------------

Results :

Tests run: 0, Failures: 0, Errors: 0, Skipped: 0

[JENKINS] Recording test results
[INFO] 
[INFO] --- maven-jar-plugin:2.3.1:jar (default-jar) @ oak-it-mk ---
[INFO] Building jar: <https://jukka.ci.cloudbees.com/job/oak/ws/oak-it/mk/target/oak-it-mk-0.4-SNAPSHOT.jar>
[INFO] 
[INFO] --- maven-site-plugin:3.0:attach-descriptor (attach-descriptor) @ oak-it-mk ---
[INFO] 
[INFO] --- maven-failsafe-plugin:2.12:integration-test (default) @ oak-it-mk ---
[INFO] Failsafe report directory: <https://jukka.ci.cloudbees.com/job/oak/ws/oak-it/mk/target/failsafe-reports>

-------------------------------------------------------
 T E S T S
-------------------------------------------------------
Running org.apache.jackrabbit.mk.test.EverythingIT
Tests run: 78, Failures: 1, Errors: 0, Skipped: 0, Time elapsed: 108.587 sec <<<
FAILURE!

Results :

Failed tests:   waitForCommit[1](org.apache.jackrabbit.mk.test.MicroKernelIT)

Tests run: 78, Failures: 1, Errors: 0, Skipped: 0

[JENKINS] Recording test results
[INFO] Failsafe report directory: <https://jukka.ci.cloudbees.com/job/oak/ws/oak-it/mk/target/failsafe-reports>
[INFO] 
[INFO] --- maven-failsafe-plugin:2.12:verify (default) @ oak-it-mk ---
[JENKINS] Archiving <https://jukka.ci.cloudbees.com/job/oak/ws/oak-it/mk/pom.xml> to
/home/jukka/hudson_home/jobs/oak/modules/org.apache.jackrabbit$oak-it-mk/builds/2012-07-10_06-02-42/archive/org.apache.jackrabbit/oak-it-mk/0.4-SNAPSHOT/oak-it-mk-0.4-SNAPSHOT.pom
[JENKINS] Archiving <https://jukka.ci.cloudbees.com/job/oak/ws/oak-it/mk/target/oak-it-mk-0.4-SNAPSHOT.jar>
to /home/jukka/hudson_home/jobs/oak/modules/org.apache.jackrabbit$oak-it-mk/builds/2012-07-10_06-02-42/archive/org.apache.jackrabbit/oak-it-mk/0.4-SNAPSHOT/oak-it-mk-0.4-SNAPSHOT.jar
[INFO] ------------------------------------------------------------------------
[INFO] Reactor Summary:
[INFO] 
[INFO] Oak Parent POM .................................... SUCCESS [17.376s]
[INFO] Oak Commons ....................................... SUCCESS [10.235s]
[INFO] Oak MicroKernel API ............................... SUCCESS [4.290s]
[INFO] Oak MicroKernel ................................... SUCCESS [45.552s]
[INFO] Oak MicroKernel Remoting .......................... SUCCESS [7.536s]
[INFO] Oak Integration Tests for MicroKernel implementations  FAILURE [1:55.933s]
[INFO] Oak Core .......................................... SKIPPED
[INFO] Oak JCR Binding ................................... SKIPPED
[INFO] Oak support for Apache Sling ...................... SKIPPED
[INFO] Oak HTTP Binding .................................. SKIPPED
[INFO] Oak Runnable Jar .................................. SKIPPED
[INFO] Oak Integration Tests for OSGi deployments ........ SKIPPED
[INFO] Oak Integration Tests ............................. SKIPPED
[INFO] Oak Performance Test Parent ....................... SKIPPED
[INFO] Oak Performance Test Utilities .................... SKIPPED
[INFO] Oak Performance Test .............................. SKIPPED
[INFO] Oak Performance Benchmark ......................... SKIPPED
[INFO] Jackrabbit Oak .................................... SKIPPED
[INFO] ------------------------------------------------------------------------
[INFO] BUILD FAILURE
[INFO] ------------------------------------------------------------------------
[INFO] Total time: 3:25.782s
[INFO] Finished at: Tue Jul 10 06:06:15 EDT 2012
[INFO] Final Memory: 29M/84M
[INFO] ------------------------------------------------------------------------
mavenExecutionResult exceptions not empty
message : Failed to execute goal org.apache.maven.plugins:maven-failsafe-plugin:2.12:verify
(default) on project oak-it-mk: There are test failures.

Please refer to <https://jukka.ci.cloudbees.com/job/oak/ws/oak-it/mk/target/failsafe-reports>
for the individual test results.
cause : There are test failures.

Please refer to <https://jukka.ci.cloudbees.com/job/oak/ws/oak-it/mk/target/failsafe-reports>
for the individual test results.
Stack trace : 
org.apache.maven.lifecycle.LifecycleExecutionException: Failed to execute goal org.apache.maven.plugins:maven-failsafe-plugin:2.12:verify
(default) on project oak-it-mk: There are test failures.

Please refer to <https://jukka.ci.cloudbees.com/job/oak/ws/oak-it/mk/target/failsafe-reports>
for the individual test results.
	at org.apache.maven.lifecycle.internal.MojoExecutor.execute(MojoExecutor.java:213)
	at org.apache.maven.lifecycle.internal.MojoExecutor.execute(MojoExecutor.java:153)
	at org.apache.maven.lifecycle.internal.MojoExecutor.execute(MojoExecutor.java:145)
	at org.apache.maven.lifecycle.internal.LifecycleModuleBuilder.buildProject(LifecycleModuleBuilder.java:84)
	at org.apache.maven.lifecycle.internal.LifecycleModuleBuilder.buildProject(LifecycleModuleBuilder.java:59)
	at org.apache.maven.lifecycle.internal.LifecycleStarter.singleThreadedBuild(LifecycleStarter.java:183)
	at org.apache.maven.lifecycle.internal.LifecycleStarter.execute(LifecycleStarter.java:161)
	at org.apache.maven.DefaultMaven.doExecute(DefaultMaven.java:320)
	at org.apache.maven.DefaultMaven.execute(DefaultMaven.java:156)
	at org.jvnet.hudson.maven3.launcher.Maven3Launcher.main(Maven3Launcher.java:79)
	at sun.reflect.NativeMethodAccessorImpl.invoke0(Native Method)
	at sun.reflect.NativeMethodAccessorImpl.invoke(NativeMethodAccessorImpl.java:39)
	at sun.reflect.DelegatingMethodAccessorImpl.invoke(DelegatingMethodAccessorImpl.java:25)
	at java.lang.reflect.Method.invoke(Method.java:597)
	at org.codehaus.plexus.classworlds.launcher.Launcher.launchStandard(Launcher.java:329)
	at org.codehaus.plexus.classworlds.launcher.Launcher.launch(Launcher.java:239)
	at org.jvnet.hudson.maven3.agent.Maven3Main.launch(Maven3Main.java:158)
	at hudson.maven.Maven3Builder.call(Maven3Builder.java:104)
	at hudson.maven.Maven3Builder.call(Maven3Builder.java:70)
	at hudson.remoting.UserRequest.perform(UserRequest.java:118)
	at hudson.remoting.UserRequest.perform(UserRequest.java:48)
	at hudson.remoting.Request$2.run(Request.java:287)
	at java.util.concurrent.Executors$RunnableAdapter.call(Executors.java:441)
	at java.util.concurrent.FutureTask$Sync.innerRun(FutureTask.java:303)
	at java.util.concurrent.FutureTask.run(FutureTask.java:138)
	at java.util.concurrent.ThreadPoolExecutor$Worker.runTask(ThreadPoolExecutor.java:886)
	at java.util.concurrent.ThreadPoolExecutor$Worker.run(ThreadPoolExecutor.java:908)
	at java.lang.Thread.run(Thread.java:662)
Caused by: org.apache.maven.plugin.MojoFailureException: There are test failures.

Please refer to <https://jukka.ci.cloudbees.com/job/oak/ws/oak-it/mk/target/failsafe-reports>
for the individual test results.
	at org.apache.maven.plugin.surefire.SurefireHelper.reportExecution(SurefireHelper.java:121)
	at org.apache.maven.plugin.failsafe.VerifyMojo.execute(VerifyMojo.java:208)
	at org.apache.maven.plugin.DefaultBuildPluginManager.executeMojo(DefaultBuildPluginManager.java:101)
	at org.apache.maven.lifecycle.internal.MojoExecutor.execute(MojoExecutor.java:209)
	... 27 more
Maven failed with error.
channel stopped

Mime
View raw message