jackrabbit-oak-dev mailing list archives

Site index · List index
Message view « Date » · « Thread »
Top « Date » · « Thread »
From jenkins-no-re...@cloudbees.com
Subject Build failed in Jenkins: oak #23
Date Sun, 24 Jun 2012 23:07:50 GMT
See <https://jukka.ci.cloudbees.com/job/oak/23/changes>

Changes:

[jukka] OAK-104: HTTP bindings for Oak

Fix webdav and davex servlets at /webdav and /davex

------------------------------------------
[...truncated 502 lines...]
Downloading: https://repository-jukka.forge.cloudbees.com/snapshot/org/apache/jackrabbit/jackrabbit-parent/2.6-SNAPSHOT/maven-metadata.xml
Downloading: https://repository-jukka.forge.cloudbees.com/snapshot/org/apache/jackrabbit/jackrabbit-jcr-commons/2.6-SNAPSHOT/maven-metadata.xml
[INFO] 
[INFO] --- maven-clean-plugin:2.4.1:clean (default-clean) @ oak-core ---
[INFO] 
[INFO] --- maven-remote-resources-plugin:1.2.1:process (default) @ oak-core ---
[debug] execute contextualize
[INFO] [INFO] Using 'UTF-8' encoding to copy filtered resources.
[INFO] Copying 0 resource
[INFO] Copying 3 resources

[INFO] --- maven-resources-plugin:2.5:resources (default-resources) @ oak-core ---
[INFO] 
[INFO] --- maven-compiler-plugin:2.3.2:compile (default-compile) @ oak-core ---
[INFO] Compiling 185 source files to <https://jukka.ci.cloudbees.com/job/oak/ws/oak-core/target/classes>
[INFO] 
[INFO] --- maven-scr-plugin:1.7.4:scr (generate-scr-scrdescriptor) @ oak-core ---
[INFO] Writing abstract service descriptor <https://jukka.ci.cloudbees.com/job/oak/ws/oak-core/target/scr-plugin-generated/OSGI-INF/scr-plugin/scrinfo.xml>
with 2 entries.
[INFO] Generating 2 Service Component Descriptors to <https://jukka.ci.cloudbees.com/job/oak/ws/oak-core/target/scr-plugin-generated/OSGI-INF/serviceComponents.xml>
[INFO] [debug] execute contextualize
[INFO] Using 'UTF-8' encoding to copy filtered resources.

[INFO] --- maven-resources-plugin:2.5:testResources (default-testResources) @ oak-core ---
[INFO] Copying 5 resources
[INFO] Copying 3 resources
[INFO] 
[INFO] --- maven-compiler-plugin:2.3.2:testCompile (default-testCompile) @ oak-core ---
[INFO] Compiling 49 source files to <https://jukka.ci.cloudbees.com/job/oak/ws/oak-core/target/test-classes>
[INFO] [INFO] Surefire report directory: <https://jukka.ci.cloudbees.com/job/oak/ws/oak-core/target/surefire-reports>

-------------------------------------------------------
 T E S T S
-------------------------------------------------------

[INFO] --- maven-surefire-plugin:2.9:test (default-test) @ oak-core ---
Running org.apache.jackrabbit.oak.query.QueryTest
Tests run: 3, Failures: 0, Errors: 0, Skipped: 0, Time elapsed: 1.891 sec
Running org.apache.jackrabbit.oak.query.FullTextTest
Tests run: 6, Failures: 0, Errors: 0, Skipped: 0, Time elapsed: 0.008 sec
Running org.apache.jackrabbit.oak.query.index.FilterTest
Tests run: 3, Failures: 0, Errors: 0, Skipped: 0, Time elapsed: 0.703 sec
Running org.apache.jackrabbit.oak.query.index.TraversingCursorTest
Tests run: 2, Failures: 0, Errors: 0, Skipped: 0, Time elapsed: 0.009 sec
Running org.apache.jackrabbit.oak.query.index.LikePatternTest
Tests run: 1, Failures: 0, Errors: 0, Skipped: 0, Time elapsed: 0.002 sec
Running org.apache.jackrabbit.oak.namepath.NamePathMapperImplTest
Tests run: 7, Failures: 0, Errors: 0, Skipped: 0, Time elapsed: 0.079 sec
Running org.apache.jackrabbit.oak.util.ArrayUtilsTest
Tests run: 9, Failures: 0, Errors: 0, Skipped: 0, Time elapsed: 0.009 sec
Running org.apache.jackrabbit.oak.plugins.name.NamespaceRegistryImplTest
Tests run: 1, Failures: 0, Errors: 0, Skipped: 0, Time elapsed: 0.12 sec
Running org.apache.jackrabbit.oak.plugins.name.NameValidatorTest
Tests run: 9, Failures: 0, Errors: 0, Skipped: 0, Time elapsed: 0.009 sec
Running org.apache.jackrabbit.oak.spi.security.user.PasswordUtilityTest
Tests run: 7, Failures: 0, Errors: 0, Skipped: 0, Time elapsed: 0.462 sec
Running org.apache.jackrabbit.oak.spi.commit.SubtreeValidatorTest
Tests run: 1, Failures: 0, Errors: 0, Skipped: 0, Time elapsed: 0.096 sec
Running org.apache.jackrabbit.oak.core.DefaultConflictHandlerTest
Tests run: 14, Failures: 0, Errors: 0, Skipped: 0, Time elapsed: 0.055 sec
Running org.apache.jackrabbit.oak.core.RootImplTest
Tests run: 22, Failures: 0, Errors: 0, Skipped: 0, Time elapsed: 5.863 sec
Running org.apache.jackrabbit.oak.kernel.LargeKernelNodeStateTest
Tests run: 3, Failures: 0, Errors: 0, Skipped: 0, Time elapsed: 0.145 sec
Running org.apache.jackrabbit.oak.kernel.KernelNodeStateTest
Tests run: 6, Failures: 0, Errors: 0, Skipped: 0, Time elapsed: 0.013 sec
Running org.apache.jackrabbit.oak.kernel.KernelNodeStoreTest
Tests run: 4, Failures: 0, Errors: 0, Skipped: 0, Time elapsed: 0.114 sec
Running org.apache.jackrabbit.oak.kernel.CoreValueFactoryTest
Tests run: 4, Failures: 0, Errors: 0, Skipped: 0, Time elapsed: 0.019 sec
Running org.apache.jackrabbit.mk.json.fast.JsopObjectTest
Tests run: 8, Failures: 0, Errors: 0, Skipped: 0, Time elapsed: 0.015 sec
Running org.apache.jackrabbit.mk.simple.SimpleKernelTest
Tests run: 2, Failures: 0, Errors: 0, Skipped: 0, Time elapsed: 0.099 sec
Running org.apache.jackrabbit.mk.simple.AscendingClockTest
Tests run: 2, Failures: 0, Errors: 0, Skipped: 0, Time elapsed: 0.018 sec
Running org.apache.jackrabbit.mk.simple.NodeVersionTest
Tests run: 1, Failures: 0, Errors: 0, Skipped: 0, Time elapsed: 0.003 sec
Running org.apache.jackrabbit.mk.wrapper.IndexWrapperTest
Tests run: 4, Failures: 0, Errors: 0, Skipped: 0, Time elapsed: 0.014 sec
Running org.apache.jackrabbit.mk.wrapper.SecurityWrapperTest
Tests run: 4, Failures: 0, Errors: 0, Skipped: 0, Time elapsed: 0.014 sec
Running org.apache.jackrabbit.mk.wrapper.VirtualRepositoryWrapperTest
Tests run: 8, Failures: 0, Errors: 0, Skipped: 0, Time elapsed: 2.493 sec
Running org.apache.jackrabbit.mk.large.ManyRevisionsTest
Tests run: 8, Failures: 0, Errors: 0, Skipped: 0, Time elapsed: 53.83 sec
Running org.apache.jackrabbit.mk.large.DescendantCountTest
Tests run: 4, Failures: 0, Errors: 0, Skipped: 0, Time elapsed: 0.615 sec
Running org.apache.jackrabbit.mk.large.LargeNodeTest
Tests run: 20, Failures: 0, Errors: 0, Skipped: 0, Time elapsed: 8.204 sec
Running org.apache.jackrabbit.mk.large.CreateNodesTraverseTest
Tests run: 4, Failures: 0, Errors: 0, Skipped: 0, Time elapsed: 9.454 sec
Running org.apache.jackrabbit.mk.LargeObjectTest
Tests run: 4, Failures: 0, Errors: 0, Skipped: 0, Time elapsed: 2.732 sec
Running org.apache.jackrabbit.mk.mem.MemoryNodeTest
Tests run: 2, Failures: 0, Errors: 0, Skipped: 0, Time elapsed: 0.004 sec
Running org.apache.jackrabbit.mk.ConflictingMoveTest
Tests run: 12, Failures: 0, Errors: 0, Skipped: 0, Time elapsed: 0.767 sec
Running org.apache.jackrabbit.mk.index.PrefixIndexTest
Tests run: 1, Failures: 0, Errors: 0, Skipped: 0, Time elapsed: 0.007 sec
Running org.apache.jackrabbit.mk.index.PropertyIndexTest
Tests run: 1, Failures: 0, Errors: 0, Skipped: 0, Time elapsed: 0.004 sec
Running org.apache.jackrabbit.mk.index.IndexTest
Tests run: 9, Failures: 0, Errors: 0, Skipped: 0, Time elapsed: 0.02 sec
Running org.apache.jackrabbit.mk.hash.HashTest
Tests run: 4, Failures: 0, Errors: 0, Skipped: 0, Time elapsed: 0.172 sec

Results :

Tests run: 200, Failures: 0, Errors: 0, Skipped: 0

[JENKINS] Recording test results
[INFO] 
[INFO] --- maven-bundle-plugin:2.3.7:bundle (default-bundle) @ oak-core ---
[INFO] 
[INFO] --- maven-site-plugin:3.0:attach-descriptor (attach-descriptor) @ oak-core ---
[INFO] [INFO] Failsafe report directory: <https://jukka.ci.cloudbees.com/job/oak/ws/oak-core/target/failsafe-reports>

[INFO] --- maven-failsafe-plugin:2.12:integration-test (default) @ oak-core ---

-------------------------------------------------------
 T E S T S
-------------------------------------------------------
Running org.apache.jackrabbit.oak.core.RootImplFuzzIT
Tests run: 1, Failures: 0, Errors: 1, Skipped: 0, Time elapsed: 68.136 sec <<< FAILURE!
Running org.apache.jackrabbit.mk.simple.MoveNodeIT
Tests run: 13, Failures: 0, Errors: 0, Skipped: 0, Time elapsed: 0.313 sec
Running org.apache.jackrabbit.mk.EverythingIT
Tests run: 0, Failures: 0, Errors: 0, Skipped: 0, Time elapsed: 0.81 sec
Running org.apache.jackrabbit.mk.MoveNodeIT
Tests run: 8, Failures: 0, Errors: 0, Skipped: 0, Time elapsed: 2.114 sec
org.h2.jdbc.JdbcSQLException: Database is already closed (to disable automatic closing at
VM shutdown, add ";DB_CLOSE_ON_EXIT=FALSE" to the db URL) [90121-158]
	at org.h2.message.DbException.getJdbcSQLException(DbException.java:329)
	at org.h2.message.DbException.get(DbException.java:169)
	at org.h2.message.DbException.get(DbException.java:146)
	at org.h2.message.DbException.get(DbException.java:135)
	at org.h2.jdbc.JdbcConnection.checkClosed(JdbcConnection.java:1394)
	at org.h2.jdbcx.JdbcXAConnection$PooledJdbcConnection.checkClosed(JdbcXAConnection.java:471)
	at org.h2.jdbc.JdbcConnection.checkClosedForWrite(JdbcConnection.java:1379)
	at org.h2.jdbc.JdbcConnection.rollback(JdbcConnection.java:463)
	at org.h2.jdbcx.JdbcXAConnection$PooledJdbcConnection.close(JdbcXAConnection.java:456)
	at org.apache.jackrabbit.mk.persistence.H2Persistence.touch(H2Persistence.java:313)
	at org.apache.jackrabbit.mk.persistence.H2Persistence.markNode(H2Persistence.java:288)
	at org.apache.jackrabbit.mk.store.DefaultRevisionStore.markNode(DefaultRevisionStore.java:638)
	at org.apache.jackrabbit.mk.store.DefaultRevisionStore.markNode(DefaultRevisionStore.java:644)
	at org.apache.jackrabbit.mk.store.DefaultRevisionStore.markCommit(DefaultRevisionStore.java:628)
	at org.apache.jackrabbit.mk.store.DefaultRevisionStore.markCommits(DefaultRevisionStore.java:604)
	at org.apache.jackrabbit.mk.store.DefaultRevisionStore.gc(DefaultRevisionStore.java:498)
	at org.apache.jackrabbit.mk.store.DefaultRevisionStore$2.run(DefaultRevisionStore.java:159)
	at java.util.concurrent.Executors$RunnableAdapter.call(Executors.java:441)
	at java.util.concurrent.FutureTask$Sync.innerRunAndReset(FutureTask.java:317)
	at java.util.concurrent.FutureTask.runAndReset(FutureTask.java:150)
	at java.util.concurrent.ScheduledThreadPoolExecutor$ScheduledFutureTask.access$101(ScheduledThreadPoolExecutor.java:98)
	at java.util.concurrent.ScheduledThreadPoolExecutor$ScheduledFutureTask.runPeriodic(ScheduledThreadPoolExecutor.java:180)
	at java.util.concurrent.ScheduledThreadPoolExecutor$ScheduledFutureTask.run(ScheduledThreadPoolExecutor.java:204)
	at java.util.concurrent.ThreadPoolExecutor$Worker.runTask(ThreadPoolExecutor.java:886)
	at java.util.concurrent.ThreadPoolExecutor$Worker.run(ThreadPoolExecutor.java:908)
	at java.lang.Thread.run(Thread.java:662)

Results :

Tests in error: 
  fuzzTest(org.apache.jackrabbit.oak.core.RootImplFuzzIT): org.apache.jackrabbit.mk.store.NotFoundException:
677d171735c6ad8eeb7fe1e18b6c7dc27763bff2

Tests run: 22, Failures: 0, Errors: 1, Skipped: 0

[JENKINS] Recording test results
[INFO] Failsafe report directory: <https://jukka.ci.cloudbees.com/job/oak/ws/oak-core/target/failsafe-reports>
[INFO] 
[INFO] --- maven-failsafe-plugin:2.12:verify (default) @ oak-core ---
[JENKINS] Archiving <https://jukka.ci.cloudbees.com/job/oak/ws/oak-core/pom.xml> to
/home/jukka/hudson_home/jobs/oak/modules/org.apache.jackrabbit$oak-core/builds/2012-06-24_19-01-23/archive/org.apache.jackrabbit/oak-core/0.3-SNAPSHOT/oak-core-0.3-SNAPSHOT.pom
[JENKINS] Archiving <https://jukka.ci.cloudbees.com/job/oak/ws/oak-core/target/oak-core-0.3-SNAPSHOT.jar>
to /home/jukka/hudson_home/jobs/oak/modules/org.apache.jackrabbit$oak-core/builds/2012-06-24_19-01-23/archive/org.apache.jackrabbit/oak-core/0.3-SNAPSHOT/oak-core-0.3-SNAPSHOT.jar
[INFO] ------------------------------------------------------------------------
[INFO] Reactor Summary:
[INFO] 
[INFO] Oak Parent POM .................................... SUCCESS [16.481s]
[INFO] Oak Commons ....................................... SUCCESS [10.270s]
[INFO] Oak MicroKernel API ............................... SUCCESS [4.281s]
[INFO] Oak MicroKernel ................................... SUCCESS [47.432s]
[INFO] Oak MicroKernel Remoting .......................... SUCCESS [7.637s]
[INFO] Oak Integration Tests for MicroKernel implementations  SUCCESS [1:45.513s]
[INFO] Oak Core .......................................... FAILURE [3:01.435s]
[INFO] Oak JCR Binding ................................... SKIPPED
[INFO] Oak support for Apache Sling ...................... SKIPPED
[INFO] Oak HTTP Binding .................................. SKIPPED
[INFO] Oak Runnable Jar .................................. SKIPPED
[INFO] Oak Integration Tests for JCR ..................... SKIPPED
[INFO] Oak Integration Tests for OSGi deployments ........ SKIPPED
[INFO] Oak Integration Tests ............................. SKIPPED
[INFO] Oak Performance Test Parent ....................... SKIPPED
[INFO] Oak Performance Test Utilities .................... SKIPPED
[INFO] Oak 0.3 Performance Test .......................... SKIPPED
[INFO] Oak Performance Benchmark ......................... SKIPPED
[INFO] Jackrabbit Oak .................................... SKIPPED
[INFO] ------------------------------------------------------------------------
[INFO] BUILD FAILURE
[INFO] ------------------------------------------------------------------------
[INFO] Total time: 6:18.606s
[INFO] Finished at: Sun Jun 24 19:07:48 EDT 2012
[INFO] Final Memory: 31M/94M
[INFO] ------------------------------------------------------------------------
mavenExecutionResult exceptions not empty
message : Failed to execute goal org.apache.maven.plugins:maven-failsafe-plugin:2.12:verify
(default) on project oak-core: There are test failures.

Please refer to <https://jukka.ci.cloudbees.com/job/oak/ws/oak-core/target/failsafe-reports>
for the individual test results.
cause : There are test failures.

Please refer to <https://jukka.ci.cloudbees.com/job/oak/ws/oak-core/target/failsafe-reports>
for the individual test results.
Stack trace : 
org.apache.maven.lifecycle.LifecycleExecutionException: Failed to execute goal org.apache.maven.plugins:maven-failsafe-plugin:2.12:verify
(default) on project oak-core: There are test failures.

Please refer to <https://jukka.ci.cloudbees.com/job/oak/ws/oak-core/target/failsafe-reports>
for the individual test results.
	at org.apache.maven.lifecycle.internal.MojoExecutor.execute(MojoExecutor.java:213)
	at org.apache.maven.lifecycle.internal.MojoExecutor.execute(MojoExecutor.java:153)
	at org.apache.maven.lifecycle.internal.MojoExecutor.execute(MojoExecutor.java:145)
	at org.apache.maven.lifecycle.internal.LifecycleModuleBuilder.buildProject(LifecycleModuleBuilder.java:84)
	at org.apache.maven.lifecycle.internal.LifecycleModuleBuilder.buildProject(LifecycleModuleBuilder.java:59)
	at org.apache.maven.lifecycle.internal.LifecycleStarter.singleThreadedBuild(LifecycleStarter.java:183)
	at org.apache.maven.lifecycle.internal.LifecycleStarter.execute(LifecycleStarter.java:161)
	at org.apache.maven.DefaultMaven.doExecute(DefaultMaven.java:320)
	at org.apache.maven.DefaultMaven.execute(DefaultMaven.java:156)
	at org.jvnet.hudson.maven3.launcher.Maven3Launcher.main(Maven3Launcher.java:79)
	at sun.reflect.NativeMethodAccessorImpl.invoke0(Native Method)
	at sun.reflect.NativeMethodAccessorImpl.invoke(NativeMethodAccessorImpl.java:39)
	at sun.reflect.DelegatingMethodAccessorImpl.invoke(DelegatingMethodAccessorImpl.java:25)
	at java.lang.reflect.Method.invoke(Method.java:597)
	at org.codehaus.plexus.classworlds.launcher.Launcher.launchStandard(Launcher.java:329)
	at org.codehaus.plexus.classworlds.launcher.Launcher.launch(Launcher.java:239)
	at org.jvnet.hudson.maven3.agent.Maven3Main.launch(Maven3Main.java:158)
	at hudson.maven.Maven3Builder.call(Maven3Builder.java:104)
	at hudson.maven.Maven3Builder.call(Maven3Builder.java:70)
	at hudson.remoting.UserRequest.perform(UserRequest.java:118)
	at hudson.remoting.UserRequest.perform(UserRequest.java:48)
	at hudson.remoting.Request$2.run(Request.java:287)
	at java.util.concurrent.Executors$RunnableAdapter.call(Executors.java:441)
	at java.util.concurrent.FutureTask$Sync.innerRun(FutureTask.java:303)
	at java.util.concurrent.FutureTask.run(FutureTask.java:138)
	at java.util.concurrent.ThreadPoolExecutor$Worker.runTask(ThreadPoolExecutor.java:886)
	at java.util.concurrent.ThreadPoolExecutor$Worker.run(ThreadPoolExecutor.java:908)
	at java.lang.Thread.run(Thread.java:662)
Caused by: org.apache.maven.plugin.MojoFailureException: There are test failures.

Please refer to <https://jukka.ci.cloudbees.com/job/oak/ws/oak-core/target/failsafe-reports>
for the individual test results.
	at org.apache.maven.plugin.surefire.SurefireHelper.reportExecution(SurefireHelper.java:121)
	at org.apache.maven.plugin.failsafe.VerifyMojo.execute(VerifyMojo.java:208)
	at org.apache.maven.plugin.DefaultBuildPluginManager.executeMojo(DefaultBuildPluginManager.java:101)
	at org.apache.maven.lifecycle.internal.MojoExecutor.execute(MojoExecutor.java:209)
	... 27 more
Maven failed with error.
channel stopped

Mime
View raw message