jackrabbit-oak-dev mailing list archives

Site index · List index
Message view « Date » · « Thread »
Top « Date » · « Thread »
From jenkins-no-re...@cloudbees.com
Subject Build failed in Jenkins: oak » Oak Core #15
Date Thu, 21 Jun 2012 21:09:07 GMT
See <https://jukka.ci.cloudbees.com/job/oak/org.apache.jackrabbit$oak-core/15/>

------------------------------------------
[INFO]                                                                         
[INFO] ------------------------------------------------------------------------
[INFO] Building Oak Core 0.3-SNAPSHOT
[INFO] ------------------------------------------------------------------------
Downloading: https://repository-jukka.forge.cloudbees.com/snapshot/org/apache/jackrabbit/jackrabbit-api/2.6-SNAPSHOT/maven-metadata.xml
Downloading: https://repository-jukka.forge.cloudbees.com/snapshot/org/apache/jackrabbit/jackrabbit-parent/2.6-SNAPSHOT/maven-metadata.xml
Downloading: https://repository-jukka.forge.cloudbees.com/snapshot/org/apache/jackrabbit/jackrabbit-jcr-commons/2.6-SNAPSHOT/maven-metadata.xml
[INFO] 
[INFO] --- maven-clean-plugin:2.4.1:clean (default-clean) @ oak-core ---
[INFO] 
[INFO] --- maven-remote-resources-plugin:1.2.1:process (default) @ oak-core ---
[INFO] [debug] execute contextualize

[INFO] --- maven-resources-plugin:2.5:resources (default-resources) @ oak-core ---
[INFO] Using 'UTF-8' encoding to copy filtered resources.
[INFO] Copying 0 resource
[INFO] Copying 3 resources
[INFO] 
[INFO] --- maven-compiler-plugin:2.3.2:compile (default-compile) @ oak-core ---
[INFO] Compiling 185 source files to <https://jukka.ci.cloudbees.com/job/oak/org.apache.jackrabbit$oak-core/ws/target/classes>
[INFO] 
[INFO] --- maven-scr-plugin:1.7.4:scr (generate-scr-scrdescriptor) @ oak-core ---
[INFO] Writing abstract service descriptor <https://jukka.ci.cloudbees.com/job/oak/org.apache.jackrabbit$oak-core/ws/target/scr-plugin-generated/OSGI-INF/scr-plugin/scrinfo.xml>
with 2 entries.
[INFO] Generating 2 Service Component Descriptors to <https://jukka.ci.cloudbees.com/job/oak/org.apache.jackrabbit$oak-core/ws/target/scr-plugin-generated/OSGI-INF/serviceComponents.xml>
[INFO] [debug] execute contextualize

[INFO] [INFO] Using 'UTF-8' encoding to copy filtered resources.
--- maven-resources-plugin:2.5:testResources (default-testResources) @ oak-core ---
[INFO] Copying 5 resources
[INFO] Copying 3 resources
[INFO] 
[INFO] --- maven-compiler-plugin:2.3.2:testCompile (default-testCompile) @ oak-core ---
[INFO] Compiling 49 source files to <https://jukka.ci.cloudbees.com/job/oak/org.apache.jackrabbit$oak-core/ws/target/test-classes>
[INFO] 
[INFO] --- maven-surefire-plugin:2.9:test (default-test) @ oak-core ---
[INFO] Surefire report directory: <https://jukka.ci.cloudbees.com/job/oak/org.apache.jackrabbit$oak-core/ws/target/surefire-reports>

-------------------------------------------------------
 T E S T S
-------------------------------------------------------
Running org.apache.jackrabbit.oak.query.QueryTest
Tests run: 3, Failures: 0, Errors: 0, Skipped: 0, Time elapsed: 2.136 sec
Running org.apache.jackrabbit.oak.query.FullTextTest
Tests run: 6, Failures: 0, Errors: 0, Skipped: 0, Time elapsed: 0 sec
Running org.apache.jackrabbit.oak.query.index.FilterTest
Tests run: 3, Failures: 0, Errors: 0, Skipped: 0, Time elapsed: 0.64 sec
Running org.apache.jackrabbit.oak.query.index.TraversingCursorTest
Tests run: 2, Failures: 0, Errors: 0, Skipped: 0, Time elapsed: 0.012 sec
Running org.apache.jackrabbit.oak.query.index.LikePatternTest
Tests run: 1, Failures: 0, Errors: 0, Skipped: 0, Time elapsed: 0.003 sec
Running org.apache.jackrabbit.oak.namepath.NamePathMapperImplTest
Tests run: 7, Failures: 0, Errors: 0, Skipped: 0, Time elapsed: 0.112 sec
Running org.apache.jackrabbit.oak.util.ArrayUtilsTest
Tests run: 9, Failures: 0, Errors: 0, Skipped: 0, Time elapsed: 0.011 sec
Running org.apache.jackrabbit.oak.plugins.name.NamespaceRegistryImplTest
Tests run: 1, Failures: 0, Errors: 0, Skipped: 0, Time elapsed: 0.189 sec
Running org.apache.jackrabbit.oak.plugins.name.NameValidatorTest
Tests run: 9, Failures: 0, Errors: 0, Skipped: 0, Time elapsed: 0.008 sec
Running org.apache.jackrabbit.oak.spi.security.user.PasswordUtilityTest
Tests run: 7, Failures: 0, Errors: 0, Skipped: 0, Time elapsed: 0.488 sec
Running org.apache.jackrabbit.oak.spi.commit.SubtreeValidatorTest
Tests run: 1, Failures: 0, Errors: 0, Skipped: 0, Time elapsed: 0.006 sec
Running org.apache.jackrabbit.oak.core.DefaultConflictHandlerTest
Tests run: 14, Failures: 0, Errors: 0, Skipped: 0, Time elapsed: 0.117 sec
Running org.apache.jackrabbit.oak.core.RootImplTest
Tests run: 22, Failures: 0, Errors: 0, Skipped: 0, Time elapsed: 5.999 sec
Running org.apache.jackrabbit.oak.kernel.LargeKernelNodeStateTest
Tests run: 3, Failures: 0, Errors: 0, Skipped: 0, Time elapsed: 0.14 sec
Running org.apache.jackrabbit.oak.kernel.KernelNodeStateTest
Tests run: 6, Failures: 0, Errors: 0, Skipped: 0, Time elapsed: 0.068 sec
Running org.apache.jackrabbit.oak.kernel.KernelNodeStoreTest
Tests run: 4, Failures: 0, Errors: 0, Skipped: 0, Time elapsed: 0.018 sec
Running org.apache.jackrabbit.oak.kernel.CoreValueFactoryTest
Tests run: 4, Failures: 0, Errors: 0, Skipped: 0, Time elapsed: 0.181 sec
Running org.apache.jackrabbit.mk.json.fast.JsopObjectTest
Tests run: 8, Failures: 0, Errors: 0, Skipped: 0, Time elapsed: 0.001 sec
Running org.apache.jackrabbit.mk.simple.SimpleKernelTest
Tests run: 2, Failures: 0, Errors: 0, Skipped: 0, Time elapsed: 0.001 sec
Running org.apache.jackrabbit.mk.simple.NodeVersionTest
Tests run: 1, Failures: 0, Errors: 0, Skipped: 0, Time elapsed: 0 sec
Running org.apache.jackrabbit.mk.wrapper.IndexWrapperTest
Tests run: 4, Failures: 0, Errors: 0, Skipped: 0, Time elapsed: 0.009 sec
Running org.apache.jackrabbit.mk.wrapper.SecurityWrapperTest
Tests run: 4, Failures: 0, Errors: 0, Skipped: 0, Time elapsed: 0.075 sec
Running org.apache.jackrabbit.mk.wrapper.VirtualRepositoryWrapperTest
Tests run: 8, Failures: 0, Errors: 0, Skipped: 0, Time elapsed: 2.867 sec
Running org.apache.jackrabbit.mk.large.ManyRevisionsTest
Tests run: 8, Failures: 0, Errors: 0, Skipped: 0, Time elapsed: 74.262 sec
Running org.apache.jackrabbit.mk.large.DescendantCountTest
Tests run: 4, Failures: 0, Errors: 0, Skipped: 0, Time elapsed: 0.689 sec
Running org.apache.jackrabbit.mk.large.LargeNodeTest
Tests run: 20, Failures: 0, Errors: 0, Skipped: 0, Time elapsed: 8.614 sec
Running org.apache.jackrabbit.mk.large.CreateNodesTraverseTest
Tests run: 4, Failures: 0, Errors: 0, Skipped: 0, Time elapsed: 4.276 sec
Running org.apache.jackrabbit.mk.LargeObjectTest
Tests run: 4, Failures: 0, Errors: 0, Skipped: 0, Time elapsed: 2.763 sec
Running org.apache.jackrabbit.mk.util.AscendingClockTest
Tests run: 2, Failures: 0, Errors: 0, Skipped: 0, Time elapsed: 0.019 sec
Running org.apache.jackrabbit.mk.mem.MemoryNodeTest
Tests run: 2, Failures: 0, Errors: 0, Skipped: 0, Time elapsed: 0.003 sec
Running org.apache.jackrabbit.mk.ConflictingMoveTest
Tests run: 12, Failures: 0, Errors: 0, Skipped: 0, Time elapsed: 0.972 sec
Running org.apache.jackrabbit.mk.index.PrefixIndexTest
Tests run: 1, Failures: 0, Errors: 0, Skipped: 0, Time elapsed: 0.004 sec
Running org.apache.jackrabbit.mk.index.PropertyIndexTest
Tests run: 1, Failures: 0, Errors: 0, Skipped: 0, Time elapsed: 0.004 sec
Running org.apache.jackrabbit.mk.index.IndexTest
Tests run: 9, Failures: 0, Errors: 0, Skipped: 0, Time elapsed: 0.02 sec
Running org.apache.jackrabbit.mk.hash.HashTest
Tests run: 4, Failures: 0, Errors: 0, Skipped: 0, Time elapsed: 0.232 sec

Results :

Tests run: 200, Failures: 0, Errors: 0, Skipped: 0

[JENKINS] Recording test results
[INFO] 
[INFO] --- maven-bundle-plugin:2.3.7:bundle (default-bundle) @ oak-core ---
[INFO] 
[INFO] --- maven-site-plugin:3.0:attach-descriptor (attach-descriptor) @ oak-core ---
[INFO] [INFO] Failsafe report directory: <https://jukka.ci.cloudbees.com/job/oak/org.apache.jackrabbit$oak-core/ws/target/failsafe-reports>

-------------------------------------------------------
 T E S T S
-------------------------------------------------------

[INFO] --- maven-failsafe-plugin:2.12:integration-test (default) @ oak-core ---
Running org.apache.jackrabbit.oak.core.RootImplFuzzIT
Tests run: 1, Failures: 0, Errors: 1, Skipped: 0, Time elapsed: 66.204 sec <<< FAILURE!
Running org.apache.jackrabbit.mk.simple.MoveNodeIT
Tests run: 13, Failures: 0, Errors: 0, Skipped: 0, Time elapsed: 0.453 sec
Running org.apache.jackrabbit.mk.EverythingIT
Tests run: 0, Failures: 0, Errors: 0, Skipped: 0, Time elapsed: 0.112 sec
Running org.apache.jackrabbit.mk.MoveNodeIT
Tests run: 8, Failures: 0, Errors: 0, Skipped: 0, Time elapsed: 3.8 sec
org.h2.jdbc.JdbcSQLException: Database is already closed (to disable automatic closing at
VM shutdown, add ";DB_CLOSE_ON_EXIT=FALSE" to the db URL) [90121-158]
	at org.h2.message.DbException.getJdbcSQLException(DbException.java:329)
	at org.h2.message.DbException.get(DbException.java:169)
	at org.h2.message.DbException.get(DbException.java:146)
	at org.h2.message.DbException.get(DbException.java:135)
	at org.h2.jdbc.JdbcConnection.checkClosed(JdbcConnection.java:1394)
	at org.h2.jdbcx.JdbcXAConnection$PooledJdbcConnection.checkClosed(JdbcXAConnection.java:471)
	at org.h2.jdbc.JdbcConnection.checkClosedForWrite(JdbcConnection.java:1379)
	at org.h2.jdbc.JdbcConnection.rollback(JdbcConnection.java:463)
	at org.h2.jdbcx.JdbcXAConnection$PooledJdbcConnection.close(JdbcXAConnection.java:456)
	at org.apache.jackrabbit.mk.persistence.H2Persistence.readNode(H2Persistence.java:133)
	at org.apache.jackrabbit.mk.store.DefaultRevisionStore.getNode(DefaultRevisionStore.java:341)
	at org.apache.jackrabbit.mk.store.DefaultRevisionStore.markNode(DefaultRevisionStore.java:644)
	at org.apache.jackrabbit.mk.store.DefaultRevisionStore.markNode(DefaultRevisionStore.java:644)
	at org.apache.jackrabbit.mk.store.DefaultRevisionStore.markCommit(DefaultRevisionStore.java:628)
	at org.apache.jackrabbit.mk.store.DefaultRevisionStore.markCommits(DefaultRevisionStore.java:604)
	at org.apache.jackrabbit.mk.store.DefaultRevisionStore.gc(DefaultRevisionStore.java:498)
	at org.apache.jackrabbit.mk.store.DefaultRevisionStore$2.run(DefaultRevisionStore.java:159)
	at java.util.concurrent.Executors$RunnableAdapter.call(Executors.java:441)
	at java.util.concurrent.FutureTask$Sync.innerRunAndReset(FutureTask.java:317)
	at java.util.concurrent.FutureTask.runAndReset(FutureTask.java:150)
	at java.util.concurrent.ScheduledThreadPoolExecutor$ScheduledFutureTask.access$101(ScheduledThreadPoolExecutor.java:98)
	at java.util.concurrent.ScheduledThreadPoolExecutor$ScheduledFutureTask.runPeriodic(ScheduledThreadPoolExecutor.java:180)
	at java.util.concurrent.ScheduledThreadPoolExecutor$ScheduledFutureTask.run(ScheduledThreadPoolExecutor.java:204)
	at java.util.concurrent.ThreadPoolExecutor$Worker.runTask(ThreadPoolExecutor.java:886)
	at java.util.concurrent.ThreadPoolExecutor$Worker.run(ThreadPoolExecutor.java:908)
	at java.lang.Thread.run(Thread.java:662)

Results :

Tests in error: 
  fuzzTest(org.apache.jackrabbit.oak.core.RootImplFuzzIT): java.lang.RuntimeException: Unexpected
error

Tests run: 22, Failures: 0, Errors: 1, Skipped: 0

[JENKINS] Recording test results
[INFO] [INFO] Failsafe report directory: <https://jukka.ci.cloudbees.com/job/oak/org.apache.jackrabbit$oak-core/ws/target/failsafe-reports>

[INFO] --- maven-failsafe-plugin:2.12:verify (default) @ oak-core ---
[JENKINS] Archiving <https://jukka.ci.cloudbees.com/job/oak/org.apache.jackrabbit$oak-core/ws/pom.xml>
to /home/jukka/hudson_home/jobs/oak/modules/org.apache.jackrabbit$oak-core/builds/2012-06-21_21-02-17/archive/org.apache.jackrabbit/oak-core/0.3-SNAPSHOT/oak-core-0.3-SNAPSHOT.pom
[JENKINS] Archiving <https://jukka.ci.cloudbees.com/job/oak/org.apache.jackrabbit$oak-core/ws/target/oak-core-0.3-SNAPSHOT.jar>
to /home/jukka/hudson_home/jobs/oak/modules/org.apache.jackrabbit$oak-core/builds/2012-06-21_21-02-17/archive/org.apache.jackrabbit/oak-core/0.3-SNAPSHOT/oak-core-0.3-SNAPSHOT.jar


Mime
View raw message