jackrabbit-oak-dev mailing list archives

Site index · List index
Message view « Date » · « Thread »
Top « Date » · « Thread »
From Michael Dürig <mdue...@apache.org>
Subject Re: Cannot run integration tests
Date Wed, 11 Apr 2012 18:43:54 GMT


On 11.4.12 19:07, Jukka Zitting wrote:
> Hi,
>
> On Wed, Apr 11, 2012 at 6:07 PM, Michael Dürig<mduerig@apache.org>  wrote:
>>   mvn clean install -PPintegrationTesting
>>
>> I get (in oak-run)
>>
>> -------------------------------------------------------
>>   T E S T S
>> -------------------------------------------------------
>> org.apache.maven.surefire.util.SurefireReflectionException:
>> java.lang.ClassNotFoundException:
>
> Hmm, it works for me.
>
> Can you get more details about this, perhaps by running "mvn clean
> install -PintegrationTesting -X" and capturing the full output?
>

Sure see below.
Michael

Apache Maven 3.0.3 (r1075438; 2011-02-28 17:31:09+0000)
Maven home: /usr/share/maven
Java version: 1.6.0_20, vendor: Apple Inc.
Java home: /System/Library/Frameworks/JavaVM.framework/Versions/1.6.0/Home
Default locale: en_US, platform encoding: MacRoman
OS name: "mac os x", version: "10.6.4", arch: "x86_64", family: "mac"
[INFO] Error stacktraces are turned on.
[DEBUG] Reading global settings from /usr/share/maven/conf/settings.xml
[DEBUG] Reading user settings from /Users/mduerig/.m2/settings.xml
[DEBUG] Using local repository at /Users/mduerig/.m2/repository
[DEBUG] Using manager EnhancedLocalRepositoryManager with priority 10 
for /Users/mduerig/.m2/repository
[INFO] Scanning for projects...
[DEBUG] Extension realms for project 
org.apache.jackrabbit:oak-run:jar:0.2-SNAPSHOT: (none)
[DEBUG] Looking up lifecyle mappings for packaging jar from 
ClassRealm[plexus.core, parent: null]
[DEBUG] === REACTOR BUILD PLAN 
================================================
[DEBUG] Project: org.apache.jackrabbit:oak-run:jar:0.2-SNAPSHOT
[DEBUG] Tasks:   [clean, install]
[DEBUG] Style:   Regular
[DEBUG] 
=======================================================================
[INFO] 

[INFO] 
------------------------------------------------------------------------
[INFO] Building Oak Runnable Jar 0.2-SNAPSHOT
[INFO] 
------------------------------------------------------------------------
[DEBUG] Lifecycle default -> [validate, initialize, generate-sources, 
process-sources, generate-resources, process-resources, compile, 
process-classes, generate-test-sources, process-test-sources, 
generate-test-resources, process-test-resources, test-compile, 
process-test-classes, test, prepare-package, package, 
pre-integration-test, integration-test, post-integration-test, verify, 
install, deploy]
[DEBUG] Lifecycle clean -> [pre-clean, clean, post-clean]
[DEBUG] Lifecycle site -> [pre-site, site, post-site, site-deploy]
[DEBUG] Lifecycle default -> [validate, initialize, generate-sources, 
process-sources, generate-resources, process-resources, compile, 
process-classes, generate-test-sources, process-test-sources, 
generate-test-resources, process-test-resources, test-compile, 
process-test-classes, test, prepare-package, package, 
pre-integration-test, integration-test, post-integration-test, verify, 
install, deploy]
[DEBUG] Lifecycle clean -> [pre-clean, clean, post-clean]
[DEBUG] Lifecycle site -> [pre-site, site, post-site, site-deploy]
[DEBUG] Lifecycle default -> [validate, initialize, generate-sources, 
process-sources, generate-resources, process-resources, compile, 
process-classes, generate-test-sources, process-test-sources, 
generate-test-resources, process-test-resources, test-compile, 
process-test-classes, test, prepare-package, package, 
pre-integration-test, integration-test, post-integration-test, verify, 
install, deploy]
[DEBUG] Lifecycle clean -> [pre-clean, clean, post-clean]
[DEBUG] Lifecycle site -> [pre-site, site, post-site, site-deploy]
[DEBUG] Lifecycle default -> [validate, initialize, generate-sources, 
process-sources, generate-resources, process-resources, compile, 
process-classes, generate-test-sources, process-test-sources, 
generate-test-resources, process-test-resources, test-compile, 
process-test-classes, test, prepare-package, package, 
pre-integration-test, integration-test, post-integration-test, verify, 
install, deploy]
[DEBUG] Lifecycle clean -> [pre-clean, clean, post-clean]
[DEBUG] Lifecycle site -> [pre-site, site, post-site, site-deploy]
[DEBUG] Lifecycle default -> [validate, initialize, generate-sources, 
process-sources, generate-resources, process-resources, compile, 
process-classes, generate-test-sources, process-test-sources, 
generate-test-resources, process-test-resources, test-compile, 
process-test-classes, test, prepare-package, package, 
pre-integration-test, integration-test, post-integration-test, verify, 
install, deploy]
[DEBUG] Lifecycle clean -> [pre-clean, clean, post-clean]
[DEBUG] Lifecycle site -> [pre-site, site, post-site, site-deploy]
[DEBUG] Lifecycle default -> [validate, initialize, generate-sources, 
process-sources, generate-resources, process-resources, compile, 
process-classes, generate-test-sources, process-test-sources, 
generate-test-resources, process-test-resources, test-compile, 
process-test-classes, test, prepare-package, package, 
pre-integration-test, integration-test, post-integration-test, verify, 
install, deploy]
[DEBUG] Lifecycle clean -> [pre-clean, clean, post-clean]
[DEBUG] Lifecycle site -> [pre-site, site, post-site, site-deploy]
[DEBUG] Lifecycle default -> [validate, initialize, generate-sources, 
process-sources, generate-resources, process-resources, compile, 
process-classes, generate-test-sources, process-test-sources, 
generate-test-resources, process-test-resources, test-compile, 
process-test-classes, test, prepare-package, package, 
pre-integration-test, integration-test, post-integration-test, verify, 
install, deploy]
[DEBUG] Lifecycle clean -> [pre-clean, clean, post-clean]
[DEBUG] Lifecycle site -> [pre-site, site, post-site, site-deploy]
[DEBUG] Lifecycle default -> [validate, initialize, generate-sources, 
process-sources, generate-resources, process-resources, compile, 
process-classes, generate-test-sources, process-test-sources, 
generate-test-resources, process-test-resources, test-compile, 
process-test-classes, test, prepare-package, package, 
pre-integration-test, integration-test, post-integration-test, verify, 
install, deploy]
[DEBUG] Lifecycle clean -> [pre-clean, clean, post-clean]
[DEBUG] Lifecycle site -> [pre-site, site, post-site, site-deploy]
[DEBUG] Lifecycle default -> [validate, initialize, generate-sources, 
process-sources, generate-resources, process-resources, compile, 
process-classes, generate-test-sources, process-test-sources, 
generate-test-resources, process-test-resources, test-compile, 
process-test-classes, test, prepare-package, package, 
pre-integration-test, integration-test, post-integration-test, verify, 
install, deploy]
[DEBUG] Lifecycle clean -> [pre-clean, clean, post-clean]
[DEBUG] Lifecycle site -> [pre-site, site, post-site, site-deploy]
[DEBUG] Lifecycle default -> [validate, initialize, generate-sources, 
process-sources, generate-resources, process-resources, compile, 
process-classes, generate-test-sources, process-test-sources, 
generate-test-resources, process-test-resources, test-compile, 
process-test-classes, test, prepare-package, package, 
pre-integration-test, integration-test, post-integration-test, verify, 
install, deploy]
[DEBUG] Lifecycle clean -> [pre-clean, clean, post-clean]
[DEBUG] Lifecycle site -> [pre-site, site, post-site, site-deploy]
[DEBUG] Lifecycle default -> [validate, initialize, generate-sources, 
process-sources, generate-resources, process-resources, compile, 
process-classes, generate-test-sources, process-test-sources, 
generate-test-resources, process-test-resources, test-compile, 
process-test-classes, test, prepare-package, package, 
pre-integration-test, integration-test, post-integration-test, verify, 
install, deploy]
[DEBUG] Lifecycle clean -> [pre-clean, clean, post-clean]
[DEBUG] Lifecycle site -> [pre-site, site, post-site, site-deploy]
[DEBUG] Lifecycle default -> [validate, initialize, generate-sources, 
process-sources, generate-resources, process-resources, compile, 
process-classes, generate-test-sources, process-test-sources, 
generate-test-resources, process-test-resources, test-compile, 
process-test-classes, test, prepare-package, package, 
pre-integration-test, integration-test, post-integration-test, verify, 
install, deploy]
[DEBUG] Lifecycle clean -> [pre-clean, clean, post-clean]
[DEBUG] Lifecycle site -> [pre-site, site, post-site, site-deploy]
[DEBUG] Lifecycle default -> [validate, initialize, generate-sources, 
process-sources, generate-resources, process-resources, compile, 
process-classes, generate-test-sources, process-test-sources, 
generate-test-resources, process-test-resources, test-compile, 
process-test-classes, test, prepare-package, package, 
pre-integration-test, integration-test, post-integration-test, verify, 
install, deploy]
[DEBUG] Lifecycle clean -> [pre-clean, clean, post-clean]
[DEBUG] Lifecycle site -> [pre-site, site, post-site, site-deploy]
[DEBUG] === PROJECT BUILD PLAN 
================================================
[DEBUG] Project:       org.apache.jackrabbit:oak-run:0.2-SNAPSHOT
[DEBUG] Dependencies (collect): []
[DEBUG] Dependencies (resolve): [compile, runtime, test]
[DEBUG] Repositories (dependencies): [maven-central 
(http://repo1.maven.org/maven2, releases+snapshots), day-central 
(http://repo.dev.day.com/central, releases+snapshots), apache.snapshots 
(http://repository.apache.org/snapshots, snapshots), central 
(http://repo1.maven.org/maven2, releases)]
[DEBUG] Repositories (plugins)     : [day-central-plugin 
(http://repo.dev.day.com/central, releases+snapshots), 
maven-central-plugin (http://repo1.maven.org/maven2, 
releases+snapshots), central (http://repo1.maven.org/maven2, releases)]
[DEBUG] 
-----------------------------------------------------------------------
[DEBUG] Goal: 
org.apache.maven.plugins:maven-clean-plugin:2.4.1:clean (default-clean)
[DEBUG] Style:         Regular
[DEBUG] Configuration: <?xml version="1.0" encoding="UTF-8"?>
<configuration>
   <directory default-value="${project.build.directory}"/>
   <excludeDefaultDirectories 
default-value="false">${clean.excludeDefaultDirectories}</excludeDefaultDirectories>
   <failOnError 
default-value="true">${maven.clean.failOnError}</failOnError>
   <followSymLinks 
default-value="false">${clean.followSymLinks}</followSymLinks>
   <outputDirectory default-value="${project.build.outputDirectory}"/>
   <reportDirectory default-value="${project.reporting.outputDirectory}"/>
   <skip default-value="false">${clean.skip}</skip>
   <testOutputDirectory 
default-value="${project.build.testOutputDirectory}"/>
   <verbose>${clean.verbose}</verbose>
</configuration>
[DEBUG] 
-----------------------------------------------------------------------
[DEBUG] Goal: 
org.apache.maven.plugins:maven-remote-resources-plugin:1.2.1:process 
(default)
[DEBUG] Style:         Regular
[DEBUG] Configuration: <?xml version="1.0" encoding="UTF-8"?>
<configuration>
 
<appendedResourcesDirectory>${basedir}/src/main/appended-resources</appendedResourcesDirectory>
   <attached default-value="true"/>
   <basedir default-value="${basedir}"/>
   <encoding 
default-value="${project.build.sourceEncoding}">${encoding}</encoding>
   <excludeArtifactIds 
default-value="">${excludeArtifactIds}</excludeArtifactIds>
   <excludeGroupIds default-value="">${excludeGroupIds}</excludeGroupIds>
   <excludeScope default-value="">${excludeScope}</excludeScope>
   <excludeTransitive 
default-value="false">${excludeTransitive}</excludeTransitive>
   <includeArtifactIds 
default-value="">${includeArtifactIds}</includeArtifactIds>
   <includeGroupIds default-value="">${includeGroupIds}</includeGroupIds>
   <includeProjectProperties default-value="false"/>
   <includeScope default-value="runtime">${includeScope}</includeScope>
   <localRepository>${localRepository}</localRepository>
   <mavenSession>${session}</mavenSession>
 
<outputDirectory>${project.build.directory}/maven-shared-archive-resources</outputDirectory>
   <project>${project}</project>
 
<remoteArtifactRepositories>${project.remoteArtifactRepositories}</remoteArtifactRepositories>
   <resourceBundles>
 
<resourceBundle>org.apache:apache-jar-resource-bundle:1.4</resourceBundle>
   </resourceBundles>
   <resources>${project.resources}</resources>
   <runOnlyAtExecutionRoot default-value="false"/>
   <skip default-value="false">${remoteresources.skip}</skip>
   <useDefaultFilterDelimiters default-value="true"/>
</configuration>
[DEBUG] 
-----------------------------------------------------------------------
[DEBUG] Goal: 
org.apache.maven.plugins:maven-resources-plugin:2.5:resources 
(default-resources)
[DEBUG] Style:         Regular
[DEBUG] Configuration: <?xml version="1.0" encoding="UTF-8"?>
<configuration>
   <buildFilters default-value="${project.build.filters}"/>
   <encoding 
default-value="${project.build.sourceEncoding}">${encoding}</encoding>
   <escapeString>${maven.resources.escapeString}</escapeString>
   <escapeWindowsPaths 
default-value="true">${maven.resources.escapeWindowsPaths}</escapeWindowsPaths>
   <includeEmptyDirs 
default-value="false">${maven.resources.includeEmptyDirs}</includeEmptyDirs>
   <outputDirectory default-value="${project.build.outputDirectory}"/>
   <overwrite default-value="false">${maven.resources.overwrite}</overwrite>
   <project default-value="${project}"/>
   <resources default-value="${project.resources}"/>
   <session default-value="${session}"/>
   <supportMultiLineFiltering 
default-value="false">${maven.resources.supportMultiLineFiltering}</supportMultiLineFiltering>
   <useBuildFilters default-value="true"/>
   <useDefaultDelimiters default-value="true"/>
</configuration>
[DEBUG] 
-----------------------------------------------------------------------
[DEBUG] Goal: 
org.apache.maven.plugins:maven-compiler-plugin:2.3.2:compile 
(default-compile)
[DEBUG] Style:         Regular
[DEBUG] Configuration: <?xml version="1.0" encoding="UTF-8"?>
<configuration>
   <basedir default-value="${basedir}"/>
   <buildDirectory default-value="${project.build.directory}"/>
   <classpathElements default-value="${project.compileClasspathElements}"/>
   <compileSourceRoots default-value="${project.compileSourceRoots}"/>
   <compilerId 
default-value="javac">${maven.compiler.compilerId}</compilerId>
   <compilerVersion>${maven.compiler.compilerVersion}</compilerVersion>
   <debug default-value="true">${maven.compiler.debug}</debug>
   <debuglevel>${maven.compiler.debuglevel}</debuglevel>
   <encoding 
default-value="${project.build.sourceEncoding}">${encoding}</encoding>
   <executable>${maven.compiler.executable}</executable>
   <failOnError 
default-value="true">${maven.compiler.failOnError}</failOnError>
   <fork default-value="false">${maven.compiler.fork}</fork>
   <generatedSourcesDirectory 
default-value="${project.build.directory}/generated-sources/annotations"/>
   <maxmem>${maven.compiler.maxmem}</maxmem>
   <meminitial>${maven.compiler.meminitial}</meminitial>
   <optimize default-value="false">${maven.compiler.optimize}</optimize>
   <outputDirectory default-value="${project.build.outputDirectory}"/>
   <outputFileName>${project.build.finalName}</outputFileName>
   <projectArtifact default-value="${project.artifact}"/>
   <session default-value="${session}"/>
   <showDeprecation 
default-value="false">${maven.compiler.showDeprecation}</showDeprecation>
   <showWarnings 
default-value="false">${maven.compiler.showWarnings}</showWarnings>
   <source default-value="1.5">1.6</source>
   <staleMillis default-value="0">${lastModGranularityMs}</staleMillis>
   <target default-value="1.5">1.6</target>
   <verbose default-value="false">${maven.compiler.verbose}</verbose>
</configuration>
[DEBUG] 
-----------------------------------------------------------------------
[DEBUG] Goal: 
org.apache.maven.plugins:maven-resources-plugin:2.5:testResources 
(default-testResources)
[DEBUG] Style:         Regular
[DEBUG] Configuration: <?xml version="1.0" encoding="UTF-8"?>
<configuration>
   <buildFilters default-value="${project.build.filters}"/>
   <encoding 
default-value="${project.build.sourceEncoding}">${encoding}</encoding>
   <escapeString>${maven.resources.escapeString}</escapeString>
   <escapeWindowsPaths 
default-value="true">${maven.resources.escapeWindowsPaths}</escapeWindowsPaths>
   <includeEmptyDirs 
default-value="false">${maven.resources.includeEmptyDirs}</includeEmptyDirs>
   <outputDirectory>${project.build.testOutputDirectory}</outputDirectory>
   <overwrite default-value="false">${maven.resources.overwrite}</overwrite>
   <project default-value="${project}"/>
   <resources>${project.testResources}</resources>
   <session default-value="${session}"/>
   <supportMultiLineFiltering 
default-value="false">${maven.resources.supportMultiLineFiltering}</supportMultiLineFiltering>
   <useBuildFilters default-value="true"/>
   <useDefaultDelimiters default-value="true"/>
</configuration>
[DEBUG] 
-----------------------------------------------------------------------
[DEBUG] Goal: 
org.apache.maven.plugins:maven-compiler-plugin:2.3.2:testCompile 
(default-testCompile)
[DEBUG] Style:         Regular
[DEBUG] Configuration: <?xml version="1.0" encoding="UTF-8"?>
<configuration>
   <basedir default-value="${basedir}"/>
   <buildDirectory default-value="${project.build.directory}"/>
   <classpathElements default-value="${project.testClasspathElements}"/>
   <compileSourceRoots default-value="${project.testCompileSourceRoots}"/>
   <compilerId 
default-value="javac">${maven.compiler.compilerId}</compilerId>
   <compilerVersion>${maven.compiler.compilerVersion}</compilerVersion>
   <debug default-value="true">${maven.compiler.debug}</debug>
   <debuglevel>${maven.compiler.debuglevel}</debuglevel>
   <encoding 
default-value="${project.build.sourceEncoding}">${encoding}</encoding>
   <executable>${maven.compiler.executable}</executable>
   <failOnError 
default-value="true">${maven.compiler.failOnError}</failOnError>
   <fork default-value="false">${maven.compiler.fork}</fork>
   <generatedTestSourcesDirectory 
default-value="${project.build.directory}/generated-sources/test-annotations"/>
   <maxmem>${maven.compiler.maxmem}</maxmem>
   <meminitial>${maven.compiler.meminitial}</meminitial>
   <optimize default-value="false">${maven.compiler.optimize}</optimize>
   <outputDirectory default-value="${project.build.testOutputDirectory}"/>
   <outputFileName>${project.build.finalName}</outputFileName>
   <session default-value="${session}"/>
   <showDeprecation 
default-value="false">${maven.compiler.showDeprecation}</showDeprecation>
   <showWarnings 
default-value="false">${maven.compiler.showWarnings}</showWarnings>
   <skip>${maven.test.skip}</skip>
   <source default-value="1.5">1.6</source>
   <staleMillis default-value="0">${lastModGranularityMs}</staleMillis>
   <target default-value="1.5">1.6</target>
   <testSource>${maven.compiler.testSource}</testSource>
   <testTarget>${maven.compiler.testTarget}</testTarget>
   <verbose default-value="false">${maven.compiler.verbose}</verbose>
</configuration>
[DEBUG] 
-----------------------------------------------------------------------
[DEBUG] Goal: 
org.apache.maven.plugins:maven-surefire-plugin:2.9:test (default-test)
[DEBUG] Style:         Regular
[DEBUG] Configuration: <?xml version="1.0" encoding="UTF-8"?>
<configuration>
   <argLine>${argLine}</argLine>
   <basedir default-value="${basedir}"/>
   <childDelegation 
default-value="false">${childDelegation}</childDelegation>
   <classesDirectory default-value="${project.build.outputDirectory}"/>
   <debugForkedProcess>${maven.surefire.debug}</debugForkedProcess>
   <disableXmlReport 
default-value="false">${disableXmlReport}</disableXmlReport>
   <enableAssertions 
default-value="true">${enableAssertions}</enableAssertions>
   <excludedGroups>${excludedGroups}</excludedGroups>
   <failIfNoTests>${failIfNoTests}</failIfNoTests>
   <forkMode default-value="once">${forkMode}</forkMode>
 
<forkedProcessTimeoutInSeconds>${surefire.timeout}</forkedProcessTimeoutInSeconds>
   <groups>${groups}</groups>
   <junitArtifactName 
default-value="junit:junit">${junitArtifactName}</junitArtifactName>
   <jvm>${jvm}</jvm>
   <localRepository>${localRepository}</localRepository>
   <objectFactory>${objectFactory}</objectFactory>
   <parallel>${parallel}</parallel>
   <parallelMavenExecution default-value="${session.parallel}"/>
   <perCoreThreadCount 
default-value="true">${perCoreThreadCount}</perCoreThreadCount>
   <pluginArtifactMap>${plugin.artifactMap}</pluginArtifactMap>
   <printSummary 
default-value="true">${surefire.printSummary}</printSummary>
   <project default-value="${project}"/>
   <projectArtifactMap>${project.artifactMap}</projectArtifactMap>
   <redirectTestOutputToFile 
default-value="false">${maven.test.redirectTestOutputToFile}</redirectTestOutputToFile>
 
<remoteRepositories>${project.pluginArtifactRepositories}</remoteRepositories>
   <reportFormat 
default-value="brief">${surefire.reportFormat}</reportFormat>
   <reportsDirectory 
default-value="${project.build.directory}/surefire-reports"/>
   <runOrder default-value="filesystem"/>
   <session>${session}</session>
   <skip default-value="false">${maven.test.skip}</skip>
   <skipExec>${maven.test.skip.exec}</skipExec>
   <skipTests default-value="false">${skipTests}</skipTests>
   <test>${test}</test>
   <testClassesDirectory 
default-value="${project.build.testOutputDirectory}"/>
   <testFailureIgnore 
default-value="false">${maven.test.failure.ignore}</testFailureIgnore>
   <testNGArtifactName 
default-value="org.testng:testng">${testNGArtifactName}</testNGArtifactName>
   <testSourceDirectory 
default-value="${project.build.testSourceDirectory}"/>
   <threadCount>${threadCount}</threadCount>
   <trimStackTrace default-value="true">${trimStackTrace}</trimStackTrace>
   <useFile default-value="true">${surefire.useFile}</useFile>
   <useManifestOnlyJar 
default-value="true">${surefire.useManifestOnlyJar}</useManifestOnlyJar>
   <useSystemClassLoader 
default-value="true">${surefire.useSystemClassLoader}</useSystemClassLoader>
   <useUnlimitedThreads 
default-value="false">${useUnlimitedThreads}</useUnlimitedThreads>
   <workingDirectory>${basedir}</workingDirectory>
</configuration>
[DEBUG] 
-----------------------------------------------------------------------
[DEBUG] Goal: 
org.apache.maven.plugins:maven-jar-plugin:2.3.1:jar (default-jar)
[DEBUG] Style:         Regular
[DEBUG] Configuration: <?xml version="1.0" encoding="UTF-8"?>
<configuration>
   <archive>
     <manifest>
       <addDefaultSpecificationEntries>true</addDefaultSpecificationEntries>
 
<addDefaultImplementationEntries>true</addDefaultImplementationEntries>
     </manifest>
   </archive>
   <classesDirectory>${project.build.outputDirectory}</classesDirectory>
 
<defaultManifestFile>${project.build.outputDirectory}/META-INF/MANIFEST.MF</defaultManifestFile>
   <finalName 
default-value="${project.build.finalName}">${jar.finalName}</finalName>
   <forceCreation default-value="false">${jar.forceCreation}</forceCreation>
   <outputDirectory>${project.build.directory}</outputDirectory>
   <project>${project}</project>
   <useDefaultManifestFile 
default-value="false">${jar.useDefaultManifestFile}</useDefaultManifestFile>
</configuration>
[DEBUG] 
-----------------------------------------------------------------------
[DEBUG] Goal: 
org.apache.maven.plugins:maven-site-plugin:3.0:attach-descriptor 
(attach-descriptor)
[DEBUG] Style:         Regular
[DEBUG] Configuration: <?xml version="1.0" encoding="UTF-8"?>
<configuration>
   <basedir>${basedir}</basedir>
   <inputEncoding 
default-value="${project.build.sourceEncoding}">${encoding}</inputEncoding>
   <localRepository default-value="${localRepository}"/>
   <locales>${locales}</locales>
   <outputEncoding 
default-value="${project.reporting.outputEncoding}">${outputEncoding}</outputEncoding>
   <pomPackagingOnly default-value="true"/>
   <project default-value="${project}"/>
   <reactorProjects default-value="${reactorProjects}"/>
   <siteDirectory default-value="${basedir}/src/site"/>
</configuration>
[DEBUG] 
-----------------------------------------------------------------------
[DEBUG] Goal: 
org.apache.maven.plugins:maven-shade-plugin:1.6:shade (default)
[DEBUG] Style:         Regular
[DEBUG] Configuration: <?xml version="1.0" encoding="UTF-8"?>
<configuration>
   <artifactSet>
     <includes>
       <include>*</include>
     </includes>
   </artifactSet>
   <createDependencyReducedPom 
default-value="true">${createDependencyReducedPom}</createDependencyReducedPom>
   <createSourcesJar 
default-value="false">${createSourcesJar}</createSourcesJar>
   <filters>
     <filter>
       <artifact>*</artifact>
       <excludes>
         <exclude>META-INF/*.SF</exclude>
         <exclude>META-INF/*.DSA</exclude>
         <exclude>META-INF/*.RSA</exclude>
       </excludes>
     </filter>
   </filters>
   <finalName>${finalName}</finalName>
   <keepDependenciesWithProvidedScope 
default-value="false">${keepDependenciesWithProvidedScope}</keepDependenciesWithProvidedScope>
   <localRepository default-value="${localRepository}"/>
   <minimizeJar default-value="false"/>
   <outputDirectory default-value="${project.build.directory}"/>
   <project default-value="${project}"/>
   <promoteTransitiveDependencies 
default-value="false">${promoteTransitiveDependencies}</promoteTransitiveDependencies>
   <remoteArtifactRepositories 
default-value="${project.remoteArtifactRepositories}"/>
   <shadedArtifactAttached 
default-value="false">${shadedArtifactAttached}</shadedArtifactAttached>
   <shadedArtifactId 
default-value="${project.artifactId}">${shadedArtifactId}</shadedArtifactId>
   <shadedClassifierName 
default-value="shaded">${shadedClassifierName}</shadedClassifierName>
   <shadedGroupFilter>${shadedGroupFilter}</shadedGroupFilter>
   <transformers>
     <transformer 
implementation="org.apache.maven.plugins.shade.resource.ManifestResourceTransformer">
       <mainClass>org.apache.jackrabbit.oak.run.Main</mainClass>
     </transformer>
   </transformers>
</configuration>
[DEBUG] 
-----------------------------------------------------------------------
[DEBUG] Goal: 
org.apache.maven.plugins:maven-failsafe-plugin:2.12:integration-test 
(default)
[DEBUG] Style:         Regular
[DEBUG] Configuration: <?xml version="1.0" encoding="UTF-8"?>
<configuration>
   <argLine>${argLine}</argLine>
   <basedir default-value="${basedir}"/>
   <childDelegation 
default-value="false">${childDelegation}</childDelegation>
   <classesDirectory default-value="${project.build.outputDirectory}"/>
   <debugForkedProcess>${maven.failsafe.debug}</debugForkedProcess>
   <disableXmlReport 
default-value="false">${disableXmlReport}</disableXmlReport>
   <enableAssertions 
default-value="true">${enableAssertions}</enableAssertions>
   <encoding 
default-value="${project.reporting.outputEncoding}">${encoding}</encoding>
   <excludedGroups>${excludedGroups}</excludedGroups>
 
<failIfNoSpecifiedTests>${it.failIfNoSpecifiedTests}</failIfNoSpecifiedTests>
   <failIfNoTests>${failIfNoTests}</failIfNoTests>
   <forkMode default-value="once">${forkMode}</forkMode>
 
<forkedProcessTimeoutInSeconds>${failsafe.timeout}</forkedProcessTimeoutInSeconds>
   <groups>${groups}</groups>
   <junitArtifactName 
default-value="junit:junit">${junitArtifactName}</junitArtifactName>
   <jvm>${jvm}</jvm>
   <localRepository>${localRepository}</localRepository>
   <objectFactory>${objectFactory}</objectFactory>
   <parallel>${parallel}</parallel>
   <parallelMavenExecution default-value="${session.parallel}"/>
   <perCoreThreadCount 
default-value="true">${perCoreThreadCount}</perCoreThreadCount>
   <pluginArtifactMap>${plugin.artifactMap}</pluginArtifactMap>
   <pluginDescriptor default-value="${plugin}"/>
   <printSummary 
default-value="true">${failsafe.printSummary}</printSummary>
   <project default-value="${project}"/>
   <projectArtifactMap>${project.artifactMap}</projectArtifactMap>
   <redirectTestOutputToFile 
default-value="false">${maven.test.redirectTestOutputToFile}</redirectTestOutputToFile>
 
<remoteRepositories>${project.pluginArtifactRepositories}</remoteRepositories>
   <reportFormat 
default-value="brief">${failsafe.reportFormat}</reportFormat>
   <reportNameSuffix 
default-value="">${surefire.reportNameSuffix}</reportNameSuffix>
   <reportsDirectory 
default-value="${project.build.directory}/failsafe-reports"/>
   <runOrder default-value="filesystem"/>
   <session>${session}</session>
   <skip default-value="false">${maven.test.skip}</skip>
   <skipExec>${maven.test.skip.exec}</skipExec>
   <skipITs>${skipITs}</skipITs>
   <skipTests default-value="false">${skipTests}</skipTests>
 
<summaryFile>${project.build.directory}/failsafe-reports/failsafe-summary.xml</summaryFile>
   <systemPropertyVariables>
     <known.issues></known.issues>
   </systemPropertyVariables>
   <test>${it.test}</test>
   <testClassesDirectory 
default-value="${project.build.testOutputDirectory}"/>
   <testNGArtifactName 
default-value="org.testng:testng">${testNGArtifactName}</testNGArtifactName>
   <testSourceDirectory 
default-value="${project.build.testSourceDirectory}"/>
   <threadCount>${threadCount}</threadCount>
   <trimStackTrace default-value="true">${trimStackTrace}</trimStackTrace>
   <useFile default-value="true">${failsafe.useFile}</useFile>
   <useManifestOnlyJar 
default-value="true">${failsafe.useManifestOnlyJar}</useManifestOnlyJar>
   <useSystemClassLoader 
default-value="true">${failsafe.useSystemClassLoader}</useSystemClassLoader>
   <useUnlimitedThreads 
default-value="false">${useUnlimitedThreads}</useUnlimitedThreads>
   <workingDirectory>${basedir}</workingDirectory>
</configuration>
[DEBUG] 
-----------------------------------------------------------------------
[DEBUG] Goal: 
org.apache.maven.plugins:maven-failsafe-plugin:2.12:verify (default)
[DEBUG] Style:         Regular
[DEBUG] Configuration: <?xml version="1.0" encoding="UTF-8"?>
<configuration>
   <basedir default-value="${basedir}"/>
   <encoding 
default-value="${project.reporting.outputEncoding}">${encoding}</encoding>
   <failIfNoTests>${failIfNoTests}</failIfNoTests>
   <reportsDirectory 
default-value="${project.build.directory}/failsafe-reports"/>
   <skip default-value="false">${maven.test.skip}</skip>
   <skipExec>${maven.test.skip.exec}</skipExec>
   <skipITs>${skipITs}</skipITs>
   <skipTests>${skipTests}</skipTests>
 
<summaryFile>${project.build.directory}/failsafe-reports/failsafe-summary.xml</summaryFile>
   <testClassesDirectory 
default-value="${project.build.testOutputDirectory}"/>
   <testFailureIgnore 
default-value="false">${maven.test.failure.ignore}</testFailureIgnore>
</configuration>
[DEBUG] 
-----------------------------------------------------------------------
[DEBUG] Goal: 
org.apache.maven.plugins:maven-install-plugin:2.3.1:install 
(default-install)
[DEBUG] Style:         Regular
[DEBUG] Configuration: <?xml version="1.0" encoding="UTF-8"?>
<configuration>
   <artifact default-value="${project.artifact}"/>
   <attachedArtifacts default-value="${project.attachedArtifacts}"/>
   <createChecksum default-value="false">${createChecksum}</createChecksum>
   <localRepository>${localRepository}</localRepository>
   <packaging default-value="${project.packaging}"/>
   <pomFile default-value="${project.file}"/>
   <updateReleaseInfo 
default-value="false">${updateReleaseInfo}</updateReleaseInfo>
</configuration>
[DEBUG] 
=======================================================================
[DEBUG] Skipped remote update check for 
org.apache.jackrabbit:oak-jcr:0.2-SNAPSHOT/maven-metadata.xml, locally 
built metadata up-to-date.
[DEBUG] Skipped remote update check for 
org.apache.jackrabbit:oak-jcr:0.2-SNAPSHOT/maven-metadata.xml, locally 
built metadata up-to-date.
[DEBUG] Skipped remote update check for 
org.apache.jackrabbit:oak-jcr:0.2-SNAPSHOT/maven-metadata.xml, locally 
built metadata up-to-date.
[DEBUG] Skipped remote update check for 
org.apache.jackrabbit:oak-jcr:0.2-SNAPSHOT/maven-metadata.xml, locally 
built metadata up-to-date.
[DEBUG] Skipped remote update check for 
org.apache.jackrabbit:oak-jcr:0.2-SNAPSHOT/maven-metadata.xml, locally 
built metadata up-to-date.
[DEBUG] Skipped remote update check for 
org.apache.jackrabbit:oak-jcr:0.2-SNAPSHOT/maven-metadata.xml, locally 
built metadata up-to-date.
[DEBUG] Skipped remote update check for 
org.apache.jackrabbit:oak-parent:0.2-SNAPSHOT/maven-metadata.xml, 
locally built metadata up-to-date.
[DEBUG] Skipped remote update check for 
org.apache.jackrabbit:oak-parent:0.2-SNAPSHOT/maven-metadata.xml, 
locally built metadata up-to-date.
[DEBUG] Skipped remote update check for 
org.apache.jackrabbit:oak-parent:0.2-SNAPSHOT/maven-metadata.xml, 
locally built metadata up-to-date.
[DEBUG] Skipped remote update check for 
org.apache.jackrabbit:oak-core:0.2-SNAPSHOT/maven-metadata.xml, locally 
built metadata up-to-date.
[DEBUG] Skipped remote update check for 
org.apache.jackrabbit:oak-core:0.2-SNAPSHOT/maven-metadata.xml, locally 
built metadata up-to-date.
[DEBUG] Skipped remote update check for 
org.apache.jackrabbit:oak-core:0.2-SNAPSHOT/maven-metadata.xml, locally 
built metadata up-to-date.
[DEBUG] Skipped remote update check for 
org.apache.jackrabbit:oak-core:0.2-SNAPSHOT/maven-metadata.xml, locally 
built metadata up-to-date.
[DEBUG] Skipped remote update check for 
org.apache.jackrabbit:oak-core:0.2-SNAPSHOT/maven-metadata.xml, locally 
built metadata up-to-date.
[DEBUG] Skipped remote update check for 
org.apache.jackrabbit:oak-core:0.2-SNAPSHOT/maven-metadata.xml, locally 
built metadata up-to-date.
[DEBUG] Skipped remote update check for 
org.apache.jackrabbit:oak-mk:0.2-SNAPSHOT/maven-metadata.xml, locally 
built metadata up-to-date.
[DEBUG] Skipped remote update check for 
org.apache.jackrabbit:oak-mk:0.2-SNAPSHOT/maven-metadata.xml, locally 
built metadata up-to-date.
[DEBUG] Skipped remote update check for 
org.apache.jackrabbit:oak-mk:0.2-SNAPSHOT/maven-metadata.xml, locally 
built metadata up-to-date.
[DEBUG] Skipped remote update check for 
org.apache.jackrabbit:oak-mk:0.2-SNAPSHOT/maven-metadata.xml, locally 
built metadata up-to-date.
[DEBUG] Skipped remote update check for 
org.apache.jackrabbit:oak-mk:0.2-SNAPSHOT/maven-metadata.xml, locally 
built metadata up-to-date.
[DEBUG] Skipped remote update check for 
org.apache.jackrabbit:oak-mk:0.2-SNAPSHOT/maven-metadata.xml, locally 
built metadata up-to-date.
[DEBUG] org.apache.jackrabbit:oak-run:jar:0.2-SNAPSHOT
[DEBUG]    org.apache.jackrabbit:oak-jcr:jar:0.2-SNAPSHOT:compile
[DEBUG]       javax.jcr:jcr:jar:2.0:compile
[DEBUG]       org.apache.jackrabbit:oak-core:jar:0.2-SNAPSHOT:compile
[DEBUG]          org.apache.jackrabbit:oak-mk:jar:0.2-SNAPSHOT:compile
[DEBUG]       org.apache.jackrabbit:jackrabbit-api:jar:2.4.0:compile
[DEBUG]       org.apache.jackrabbit:jackrabbit-jcr-commons:jar:2.4.0:compile
[DEBUG]       commons-collections:commons-collections:jar:3.2.1:compile
[DEBUG]       org.slf4j:slf4j-api:jar:1.6.4:compile
[DEBUG]       org.slf4j:jcl-over-slf4j:jar:1.6.4:compile
[DEBUG]    org.apache.jackrabbit:jackrabbit-jcr-server:jar:2.4.0:compile
[DEBUG]       org.apache.jackrabbit:jackrabbit-spi-commons:jar:2.4.0:compile
[DEBUG]          org.apache.jackrabbit:jackrabbit-spi:jar:2.4.0:compile
[DEBUG]          commons-io:commons-io:jar:1.4:compile
[DEBUG]       org.apache.jackrabbit:jackrabbit-webdav:jar:2.4.0:compile
[DEBUG]          commons-httpclient:commons-httpclient:jar:3.0:compile
[DEBUG]             commons-codec:commons-codec:jar:1.2:compile
[DEBUG]       org.apache.tika:tika-core:jar:1.0:compile
[DEBUG]       commons-fileupload:commons-fileupload:jar:1.2.1:compile
[DEBUG]    org.eclipse.jetty:jetty-servlet:jar:8.1.2.v20120308:compile
[DEBUG]       org.eclipse.jetty:jetty-security:jar:8.1.2.v20120308:compile
[DEBUG]          org.eclipse.jetty:jetty-server:jar:8.1.2.v20120308:compile
[DEBUG] 
org.eclipse.jetty.orbit:javax.servlet:jar:3.0.0.v201112011016:compile
[DEBUG] 
org.eclipse.jetty:jetty-continuation:jar:8.1.2.v20120308:compile
[DEBUG]             org.eclipse.jetty:jetty-http:jar:8.1.2.v20120308:compile
[DEBUG] 
org.eclipse.jetty:jetty-io:jar:8.1.2.v20120308:compile
[DEBUG] 
org.eclipse.jetty:jetty-util:jar:8.1.2.v20120308:compile
[DEBUG]    ch.qos.logback:logback-classic:jar:1.0.1:compile
[DEBUG]       ch.qos.logback:logback-core:jar:1.0.1:compile
[INFO]
[INFO] --- maven-clean-plugin:2.4.1:clean (default-clean) @ oak-run ---
[DEBUG] Created new class realm maven.api
[DEBUG] Importing foreign packages into class realm maven.api
[DEBUG]   Imported: org.apache.maven.wagon.events < plexus.core
[DEBUG]   Imported: org.sonatype.aether.transfer < plexus.core
[DEBUG]   Imported: org.apache.maven.exception < plexus.core
[DEBUG]   Imported: org.sonatype.aether.metadata < plexus.core
[DEBUG]   Imported: org.codehaus.plexus.util.xml.Xpp3Dom < plexus.core
[DEBUG]   Imported: org.sonatype.aether.collection < plexus.core
[DEBUG]   Imported: org.sonatype.aether.version < plexus.core
[DEBUG]   Imported: org.apache.maven.monitor < plexus.core
[DEBUG]   Imported: org.apache.maven.wagon.repository < plexus.core
[DEBUG]   Imported: org.apache.maven.repository < plexus.core
[DEBUG]   Imported: org.apache.maven.wagon.resource < plexus.core
[DEBUG]   Imported: org.codehaus.plexus.logging < plexus.core
[DEBUG]   Imported: org.apache.maven.profiles < plexus.core
[DEBUG]   Imported: org.sonatype.aether.repository < plexus.core
[DEBUG]   Imported: org.apache.maven.classrealm < plexus.core
[DEBUG]   Imported: org.apache.maven.execution < plexus.core
[DEBUG]   Imported: org.sonatype.aether.artifact < plexus.core
[DEBUG]   Imported: org.sonatype.aether.spi < plexus.core
[DEBUG]   Imported: org.apache.maven.reporting < plexus.core
[DEBUG]   Imported: org.apache.maven.usability < plexus.core
[DEBUG]   Imported: org.codehaus.plexus.container < plexus.core
[DEBUG]   Imported: org.codehaus.plexus.component < plexus.core
[DEBUG]   Imported: org.codehaus.plexus.util.xml.pull.XmlSerializer < 
plexus.core
[DEBUG]   Imported: org.apache.maven.wagon.authentication < plexus.core
[DEBUG]   Imported: org.apache.maven.lifecycle < plexus.core
[DEBUG]   Imported: org.codehaus.plexus.classworlds < plexus.core
[DEBUG]   Imported: org.sonatype.aether.graph < plexus.core
[DEBUG]   Imported: org.sonatype.aether.* < plexus.core
[DEBUG]   Imported: org.apache.maven.settings < plexus.core
[DEBUG]   Imported: org.codehaus.classworlds < plexus.core
[DEBUG]   Imported: org.sonatype.aether.impl < plexus.core
[DEBUG]   Imported: org.apache.maven.wagon.* < plexus.core
[DEBUG]   Imported: org.apache.maven.toolchain < plexus.core
[DEBUG]   Imported: org.sonatype.aether.deployment < plexus.core
[DEBUG]   Imported: org.apache.maven.wagon.observers < plexus.core
[DEBUG]   Imported: 
org.codehaus.plexus.util.xml.pull.XmlPullParserException < plexus.core
[DEBUG]   Imported: org.codehaus.plexus.util.xml.pull.XmlPullParser < 
plexus.core
[DEBUG]   Imported: org.apache.maven.configuration < plexus.core
[DEBUG]   Imported: org.apache.maven.cli < plexus.core
[DEBUG]   Imported: org.sonatype.aether.installation < plexus.core
[DEBUG]   Imported: org.codehaus.plexus.context < plexus.core
[DEBUG]   Imported: org.apache.maven.wagon.authorization < plexus.core
[DEBUG]   Imported: org.apache.maven.project < plexus.core
[DEBUG]   Imported: org.apache.maven.rtinfo < plexus.core
[DEBUG]   Imported: org.codehaus.plexus.lifecycle < plexus.core
[DEBUG]   Imported: org.codehaus.plexus.configuration < plexus.core
[DEBUG]   Imported: org.apache.maven.artifact < plexus.core
[DEBUG]   Imported: org.apache.maven.model < plexus.core
[DEBUG]   Imported: org.apache.maven.* < plexus.core
[DEBUG]   Imported: org.apache.maven.wagon.proxy < plexus.core
[DEBUG]   Imported: org.sonatype.aether.resolution < plexus.core
[DEBUG]   Imported: org.apache.maven.plugin < plexus.core
[DEBUG]   Imported: org.codehaus.plexus.* < plexus.core
[DEBUG]   Imported: org.codehaus.plexus.personality < plexus.core
[DEBUG] Populating class realm maven.api
[DEBUG] org.apache.maven.plugins:maven-clean-plugin:jar:2.4.1:
[DEBUG]    org.apache.maven:maven-plugin-api:jar:2.0.6:compile
[DEBUG]    org.codehaus.plexus:plexus-utils:jar:2.0.5:compile
[DEBUG] Created new class realm 
plugin>org.apache.maven.plugins:maven-clean-plugin:2.4.1
[DEBUG] Importing foreign packages into class realm 
plugin>org.apache.maven.plugins:maven-clean-plugin:2.4.1
[DEBUG]   Imported:  < maven.api
[DEBUG] Populating class realm 
plugin>org.apache.maven.plugins:maven-clean-plugin:2.4.1
[DEBUG]   Included: org.apache.maven.plugins:maven-clean-plugin:jar:2.4.1
[DEBUG]   Included: org.codehaus.plexus:plexus-utils:jar:2.0.5
[DEBUG]   Excluded: org.apache.maven:maven-plugin-api:jar:2.0.6
[DEBUG] Configuring mojo 
org.apache.maven.plugins:maven-clean-plugin:2.4.1:clean from plugin 
realm 
ClassRealm[plugin>org.apache.maven.plugins:maven-clean-plugin:2.4.1, 
parent: sun.misc.Launcher$AppClassLoader@6d6f0472]
[DEBUG] Configuring mojo 
'org.apache.maven.plugins:maven-clean-plugin:2.4.1:clean' with basic 
configurator -->
[DEBUG]   (f) directory = 
/Users/mduerig/Checkouts/apache/jackrabbit/oak/trunk/oak-run/target
[DEBUG]   (f) excludeDefaultDirectories = false
[DEBUG]   (f) failOnError = true
[DEBUG]   (f) followSymLinks = false
[DEBUG]   (f) outputDirectory = 
/Users/mduerig/Checkouts/apache/jackrabbit/oak/trunk/oak-run/target/classes
[DEBUG]   (f) reportDirectory = 
/Users/mduerig/Checkouts/apache/jackrabbit/oak/trunk/oak-run/target/site
[DEBUG]   (f) skip = false
[DEBUG]   (f) testOutputDirectory = 
/Users/mduerig/Checkouts/apache/jackrabbit/oak/trunk/oak-run/target/test-classes
[DEBUG] -- end configuration --
[INFO] Deleting 
/Users/mduerig/Checkouts/apache/jackrabbit/oak/trunk/oak-run/target
[INFO] Deleting file 
/Users/mduerig/Checkouts/apache/jackrabbit/oak/trunk/oak-run/target/test-classes/META-INF/NOTICE
[INFO] Deleting file 
/Users/mduerig/Checkouts/apache/jackrabbit/oak/trunk/oak-run/target/test-classes/META-INF/LICENSE
[INFO] Deleting file 
/Users/mduerig/Checkouts/apache/jackrabbit/oak/trunk/oak-run/target/test-classes/META-INF/DEPENDENCIES
[INFO] Deleting directory 
/Users/mduerig/Checkouts/apache/jackrabbit/oak/trunk/oak-run/target/test-classes/META-INF
[INFO] Deleting directory 
/Users/mduerig/Checkouts/apache/jackrabbit/oak/trunk/oak-run/target/test-classes
[INFO] Deleting file 
/Users/mduerig/Checkouts/apache/jackrabbit/oak/trunk/oak-run/target/surefire/surefirebooter7208725597472040492.jar
[INFO] Deleting file 
/Users/mduerig/Checkouts/apache/jackrabbit/oak/trunk/oak-run/target/surefire/surefirebooter4694730303270681817.jar
[INFO] Deleting file 
/Users/mduerig/Checkouts/apache/jackrabbit/oak/trunk/oak-run/target/surefire/surefire_02444038679227072385tmp
[INFO] Deleting file 
/Users/mduerig/Checkouts/apache/jackrabbit/oak/trunk/oak-run/target/surefire/surefire7699598922595611582tmp
[INFO] Deleting file 
/Users/mduerig/Checkouts/apache/jackrabbit/oak/trunk/oak-run/target/surefire/surefire2688744327804679239tmp
[INFO] Deleting file 
/Users/mduerig/Checkouts/apache/jackrabbit/oak/trunk/oak-run/target/surefire/surefire1158575857329576847tmp
[INFO] Deleting directory 
/Users/mduerig/Checkouts/apache/jackrabbit/oak/trunk/oak-run/target/surefire
[INFO] Deleting file 
/Users/mduerig/Checkouts/apache/jackrabbit/oak/trunk/oak-run/target/original-oak-run-0.2-SNAPSHOT.jar
[INFO] Deleting file 
/Users/mduerig/Checkouts/apache/jackrabbit/oak/trunk/oak-run/target/oak-run-0.2-SNAPSHOT.jar
[INFO] Deleting file 
/Users/mduerig/Checkouts/apache/jackrabbit/oak/trunk/oak-run/target/maven-shared-archive-resources/META-INF/NOTICE
[INFO] Deleting file 
/Users/mduerig/Checkouts/apache/jackrabbit/oak/trunk/oak-run/target/maven-shared-archive-resources/META-INF/LICENSE
[INFO] Deleting file 
/Users/mduerig/Checkouts/apache/jackrabbit/oak/trunk/oak-run/target/maven-shared-archive-resources/META-INF/DEPENDENCIES
[INFO] Deleting directory 
/Users/mduerig/Checkouts/apache/jackrabbit/oak/trunk/oak-run/target/maven-shared-archive-resources/META-INF
[INFO] Deleting directory 
/Users/mduerig/Checkouts/apache/jackrabbit/oak/trunk/oak-run/target/maven-shared-archive-resources
[INFO] Deleting file 
/Users/mduerig/Checkouts/apache/jackrabbit/oak/trunk/oak-run/target/maven-archiver/pom.properties
[INFO] Deleting directory 
/Users/mduerig/Checkouts/apache/jackrabbit/oak/trunk/oak-run/target/maven-archiver
[INFO] Deleting directory 
/Users/mduerig/Checkouts/apache/jackrabbit/oak/trunk/oak-run/target/generated-sources/annotations
[INFO] Deleting directory 
/Users/mduerig/Checkouts/apache/jackrabbit/oak/trunk/oak-run/target/generated-sources
[INFO] Deleting file 
/Users/mduerig/Checkouts/apache/jackrabbit/oak/trunk/oak-run/target/failsafe-reports/failsafe-summary.xml
[INFO] Deleting directory 
/Users/mduerig/Checkouts/apache/jackrabbit/oak/trunk/oak-run/target/failsafe-reports
[INFO] Deleting file 
/Users/mduerig/Checkouts/apache/jackrabbit/oak/trunk/oak-run/target/dependency-reduced-pom.xml
[INFO] Deleting file 
/Users/mduerig/Checkouts/apache/jackrabbit/oak/trunk/oak-run/target/classes/org/apache/jackrabbit/oak/run/Main.class
[INFO] Deleting file 
/Users/mduerig/Checkouts/apache/jackrabbit/oak/trunk/oak-run/target/classes/org/apache/jackrabbit/oak/run/Main$1.class
[INFO] Deleting directory 
/Users/mduerig/Checkouts/apache/jackrabbit/oak/trunk/oak-run/target/classes/org/apache/jackrabbit/oak/run
[INFO] Deleting directory 
/Users/mduerig/Checkouts/apache/jackrabbit/oak/trunk/oak-run/target/classes/org/apache/jackrabbit/oak
[INFO] Deleting directory 
/Users/mduerig/Checkouts/apache/jackrabbit/oak/trunk/oak-run/target/classes/org/apache/jackrabbit
[INFO] Deleting directory 
/Users/mduerig/Checkouts/apache/jackrabbit/oak/trunk/oak-run/target/classes/org/apache
[INFO] Deleting directory 
/Users/mduerig/Checkouts/apache/jackrabbit/oak/trunk/oak-run/target/classes/org
[INFO] Deleting file 
/Users/mduerig/Checkouts/apache/jackrabbit/oak/trunk/oak-run/target/classes/META-INF/NOTICE
[INFO] Deleting file 
/Users/mduerig/Checkouts/apache/jackrabbit/oak/trunk/oak-run/target/classes/META-INF/LICENSE
[INFO] Deleting file 
/Users/mduerig/Checkouts/apache/jackrabbit/oak/trunk/oak-run/target/classes/META-INF/DEPENDENCIES
[INFO] Deleting directory 
/Users/mduerig/Checkouts/apache/jackrabbit/oak/trunk/oak-run/target/classes/META-INF
[INFO] Deleting directory 
/Users/mduerig/Checkouts/apache/jackrabbit/oak/trunk/oak-run/target/classes
[INFO] Deleting file 
/Users/mduerig/Checkouts/apache/jackrabbit/oak/trunk/oak-run/target/.plxarc
[INFO] Deleting directory 
/Users/mduerig/Checkouts/apache/jackrabbit/oak/trunk/oak-run/target
[DEBUG] Skipping non-existing directory 
/Users/mduerig/Checkouts/apache/jackrabbit/oak/trunk/oak-run/target/classes
[DEBUG] Skipping non-existing directory 
/Users/mduerig/Checkouts/apache/jackrabbit/oak/trunk/oak-run/target/test-classes
[DEBUG] Skipping non-existing directory 
/Users/mduerig/Checkouts/apache/jackrabbit/oak/trunk/oak-run/target/site
[INFO]
[INFO] --- maven-remote-resources-plugin:1.2.1:process (default) @ 
oak-run ---
[DEBUG] org.apache.maven.plugins:maven-remote-resources-plugin:jar:1.2.1:
[DEBUG]    org.apache.maven:maven-artifact:jar:2.0.6:compile
[DEBUG]    org.apache.maven:maven-core:jar:2.0.6:compile
[DEBUG] 
org.apache.maven:maven-plugin-parameter-documenter:jar:2.0.6:compile
[DEBUG] 
org.apache.maven.reporting:maven-reporting-api:jar:2.0.6:compile
[DEBUG] 
org.apache.maven.doxia:doxia-sink-api:jar:1.0-alpha-7:compile
[DEBUG]       org.apache.maven:maven-profile:jar:2.0.6:compile
[DEBUG]       org.apache.maven:maven-repository-metadata:jar:2.0.6:compile
[DEBUG]       org.apache.maven:maven-error-diagnostics:jar:2.0.6:compile
[DEBUG]       commons-cli:commons-cli:jar:1.0:compile
[DEBUG]       org.apache.maven:maven-plugin-descriptor:jar:2.0.6:compile
[DEBUG] 
org.codehaus.plexus:plexus-interactivity-api:jar:1.0-alpha-4:compile
[DEBUG]       org.apache.maven:maven-artifact-manager:jar:2.0.6:compile
[DEBUG]       classworlds:classworlds:jar:1.1:compile
[DEBUG]    org.apache.maven:maven-model:jar:2.0.6:compile
[DEBUG]    org.apache.maven:maven-monitor:jar:2.0.6:compile
[DEBUG]    org.apache.maven:maven-plugin-api:jar:2.0.6:compile
[DEBUG]    org.apache.maven:maven-project:jar:2.0.6:compile
[DEBUG]       org.apache.maven:maven-plugin-registry:jar:2.0.6:compile
[DEBUG]    org.apache.maven:maven-settings:jar:2.0.6:compile
[DEBUG]    org.apache.maven.shared:maven-artifact-resolver:jar:1.0:compile
[DEBUG] 
org.apache.maven.shared:maven-common-artifact-filters:jar:1.0:compile
[DEBUG] 
org.apache.maven.shared:maven-plugin-testing-harness:jar:1.1:compile
[DEBUG]          org.codehaus.plexus:plexus-archiver:jar:1.0-alpha-7:compile
[DEBUG]    org.apache.maven.shared:maven-downloader:jar:1.1:compile
[DEBUG]    org.apache.maven.shared:maven-filtering:jar:1.0:compile
[DEBUG]       org.sonatype.plexus:plexus-build-api:jar:0.0.4:compile
[DEBUG] 
org.codehaus.plexus:plexus-container-default:jar:1.0-alpha-9:compile
[DEBUG]       junit:junit:jar:3.8.1:compile
[DEBUG]    org.codehaus.plexus:plexus-interpolation:jar:1.12:compile
[DEBUG]    org.codehaus.plexus:plexus-resources:jar:1.0-alpha-5:compile
[DEBUG]    org.codehaus.plexus:plexus-utils:jar:1.5.12:compile
[DEBUG]    org.codehaus.plexus:plexus-velocity:jar:1.1.8:compile
[DEBUG]       commons-collections:commons-collections:jar:3.1:compile
[DEBUG]       velocity:velocity:jar:1.5:compile
[DEBUG]    org.apache.velocity:velocity:jar:1.6.4:compile
[DEBUG]       commons-lang:commons-lang:jar:2.4:compile
[DEBUG]       oro:oro:jar:2.0.8:compile
[DEBUG] Created new class realm 
plugin>org.apache.maven.plugins:maven-remote-resources-plugin:1.2.1
[DEBUG] Importing foreign packages into class realm 
plugin>org.apache.maven.plugins:maven-remote-resources-plugin:1.2.1
[DEBUG]   Imported:  < maven.api
[DEBUG] Populating class realm 
plugin>org.apache.maven.plugins:maven-remote-resources-plugin:1.2.1
[DEBUG]   Included: 
org.apache.maven.plugins:maven-remote-resources-plugin:jar:1.2.1
[DEBUG]   Included: org.apache.maven.reporting:maven-reporting-api:jar:2.0.6
[DEBUG]   Included: org.apache.maven.doxia:doxia-sink-api:jar:1.0-alpha-7
[DEBUG]   Included: commons-cli:commons-cli:jar:1.0
[DEBUG]   Included: 
org.codehaus.plexus:plexus-interactivity-api:jar:1.0-alpha-4
[DEBUG]   Included: org.apache.maven.shared:maven-artifact-resolver:jar:1.0
[DEBUG]   Included: 
org.apache.maven.shared:maven-common-artifact-filters:jar:1.0
[DEBUG]   Included: 
org.apache.maven.shared:maven-plugin-testing-harness:jar:1.1
[DEBUG]   Included: org.codehaus.plexus:plexus-archiver:jar:1.0-alpha-7
[DEBUG]   Included: org.apache.maven.shared:maven-downloader:jar:1.1
[DEBUG]   Included: org.apache.maven.shared:maven-filtering:jar:1.0
[DEBUG]   Included: org.sonatype.plexus:plexus-build-api:jar:0.0.4
[DEBUG]   Included: junit:junit:jar:3.8.1
[DEBUG]   Included: org.codehaus.plexus:plexus-interpolation:jar:1.12
[DEBUG]   Included: org.codehaus.plexus:plexus-resources:jar:1.0-alpha-5
[DEBUG]   Included: org.codehaus.plexus:plexus-utils:jar:1.5.12
[DEBUG]   Included: org.codehaus.plexus:plexus-velocity:jar:1.1.8
[DEBUG]   Included: commons-collections:commons-collections:jar:3.1
[DEBUG]   Included: velocity:velocity:jar:1.5
[DEBUG]   Included: org.apache.velocity:velocity:jar:1.6.4
[DEBUG]   Included: commons-lang:commons-lang:jar:2.4
[DEBUG]   Included: oro:oro:jar:2.0.8
[DEBUG]   Excluded: org.apache.maven:maven-artifact:jar:2.0.6
[DEBUG]   Excluded: org.apache.maven:maven-core:jar:2.0.6
[DEBUG]   Excluded: 
org.apache.maven:maven-plugin-parameter-documenter:jar:2.0.6
[DEBUG]   Excluded: org.apache.maven:maven-profile:jar:2.0.6
[DEBUG]   Excluded: org.apache.maven:maven-repository-metadata:jar:2.0.6
[DEBUG]   Excluded: org.apache.maven:maven-error-diagnostics:jar:2.0.6
[DEBUG]   Excluded: org.apache.maven:maven-plugin-descriptor:jar:2.0.6
[DEBUG]   Excluded: org.apache.maven:maven-artifact-manager:jar:2.0.6
[DEBUG]   Excluded: classworlds:classworlds:jar:1.1
[DEBUG]   Excluded: org.apache.maven:maven-model:jar:2.0.6
[DEBUG]   Excluded: org.apache.maven:maven-monitor:jar:2.0.6
[DEBUG]   Excluded: org.apache.maven:maven-plugin-api:jar:2.0.6
[DEBUG]   Excluded: org.apache.maven:maven-project:jar:2.0.6
[DEBUG]   Excluded: org.apache.maven:maven-plugin-registry:jar:2.0.6
[DEBUG]   Excluded: org.apache.maven:maven-settings:jar:2.0.6
[DEBUG]   Excluded: 
org.codehaus.plexus:plexus-container-default:jar:1.0-alpha-9
[DEBUG] Configuring mojo 
org.apache.maven.plugins:maven-remote-resources-plugin:1.2.1:process 
from plugin realm 
ClassRealm[plugin>org.apache.maven.plugins:maven-remote-resources-plugin:1.2.1, 
parent: sun.misc.Launcher$AppClassLoader@6d6f0472]
[DEBUG] Setting property: classpath.resource.loader.class => 
'org.codehaus.plexus.velocity.ContextClassLoaderResourceLoader'.
[DEBUG] Setting property: site.resource.loader.class => 
'org.codehaus.plexus.velocity.SiteResourceLoader'.
[DEBUG] Setting property: velocimacro.messages.on => 'false'.
[DEBUG] Setting property: resource.loader => 'classpath,site'.
[DEBUG] Setting property: runtime.log.invalid.references => 'false'.
[DEBUG] Setting property: resource.manager.logwhenfound => 'false'.
[DEBUG] *******************************************************************
[DEBUG] Starting Apache Velocity v1.5 (compiled: 2007-02-22 08:52:29)
[DEBUG] RuntimeInstance initializing.
[DEBUG] Default Properties File: 
org/apache/velocity/runtime/defaults/velocity.properties
[DEBUG] LogSystem has been deprecated. Please use a LogChute implementation.
[DEBUG] Default ResourceManager initializing. (class 
org.apache.velocity.runtime.resource.ResourceManagerImpl)
[DEBUG] ResourceLoader instantiated: 
org.codehaus.plexus.velocity.ContextClassLoaderResourceLoader
[DEBUG] ResourceLoader instantiated: 
org.codehaus.plexus.velocity.SiteResourceLoader
[DEBUG] ResourceCache: initialized (class 
org.apache.velocity.runtime.resource.ResourceCacheImpl)
[DEBUG] Default ResourceManager initialization complete.
[DEBUG] Loaded System Directive: 
org.apache.velocity.runtime.directive.Literal
[DEBUG] Loaded System Directive: org.apache.velocity.runtime.directive.Macro
[DEBUG] Loaded System Directive: org.apache.velocity.runtime.directive.Parse
[DEBUG] Loaded System Directive: 
org.apache.velocity.runtime.directive.Include
[DEBUG] Loaded System Directive: 
org.apache.velocity.runtime.directive.Foreach
[DEBUG] Created '20' parsers.
[DEBUG] Velocimacro : initialization starting.
[DEBUG] Velocimacro : allowInline = true : VMs can be defined inline in 
templates
[DEBUG] Velocimacro : allowInlineToOverride = false : VMs defined inline 
may NOT replace previous VM definitions
[DEBUG] Velocimacro : allowInlineLocal = false : VMs defined inline will 
be global in scope if allowed.
[DEBUG] Velocimacro : autoload off : VM system will not automatically 
reload global library macros
[DEBUG] Velocimacro : Velocimacro : initialization complete.
[DEBUG] RuntimeInstance successfully initialized.
[DEBUG] Configuring mojo 
'org.apache.maven.plugins:maven-remote-resources-plugin:1.2.1:process' 
with basic configurator -->
[DEBUG]   (f) appendedResourcesDirectory = 
/Users/mduerig/Checkouts/apache/jackrabbit/oak/trunk/oak-run/src/main/appended-resources
[DEBUG]   (f) attached = true
[DEBUG]   (f) basedir = 
/Users/mduerig/Checkouts/apache/jackrabbit/oak/trunk/oak-run
[DEBUG]   (f) encoding = UTF-8
[DEBUG]   (f) excludeTransitive = false
[DEBUG]   (f) includeProjectProperties = false
[DEBUG]   (f) includeScope = runtime
[DEBUG]   (f) localRepository =        id: local
       url: file:///Users/mduerig/.m2/repository/
    layout: none

[DEBUG]   (f) mavenSession = 
org.apache.maven.execution.MavenSession@254ba9a2
[DEBUG]   (f) outputDirectory = 
/Users/mduerig/Checkouts/apache/jackrabbit/oak/trunk/oak-run/target/maven-shared-archive-resources
[DEBUG]   (f) project = MavenProject: 
org.apache.jackrabbit:oak-run:0.2-SNAPSHOT @ 
/Users/mduerig/Checkouts/apache/jackrabbit/oak/trunk/oak-run/pom.xml
[DEBUG]   (f) remoteArtifactRepositories = [       id: maven-central
       url: http://repo1.maven.org/maven2
    layout: default
snapshots: [enabled => true, update => daily]
  releases: [enabled => true, update => daily]
,        id: day-central
       url: http://repo.dev.day.com/central
    layout: default
snapshots: [enabled => true, update => daily]
  releases: [enabled => true, update => daily]
,        id: apache.snapshots
       url: http://repository.apache.org/snapshots
    layout: default
snapshots: [enabled => true, update => daily]
  releases: [enabled => false, update => daily]
,        id: central
       url: http://repo1.maven.org/maven2
    layout: default
snapshots: [enabled => false, update => daily]
  releases: [enabled => true, update => daily]
]
[DEBUG]   (f) resourceBundles = [org.apache:apache-jar-resource-bundle:1.4]
[DEBUG]   (f) resources = [Resource {targetPath: null, filtering: false, 
FileSet {directory: 
/Users/mduerig/Checkouts/apache/jackrabbit/oak/trunk/oak-run/src/main/resources, 
PatternSet [includes: {}, excludes: {}]}}]
[DEBUG]   (f) runOnlyAtExecutionRoot = false
[DEBUG]   (f) skip = false
[DEBUG]   (f) useDefaultFilterDelimiters = true
[DEBUG] -- end configuration --
[DEBUG] Supplemental data models won't be loaded.  No models specified.
[DEBUG] org.apache.jackrabbit:oak-run:jar:0.2-SNAPSHOT (selected for null)
[DEBUG]   org.apache.jackrabbit:oak-jcr:jar:0.2-SNAPSHOT:compile 
(selected for compile)
[DEBUG]     javax.jcr:jcr:jar:2.0:compile (selected for compile)
[DEBUG]     org.apache.jackrabbit:oak-core:jar:0.2-SNAPSHOT:compile 
(selected for compile)
[DEBUG]       org.apache.jackrabbit:oak-mk:jar:0.2-SNAPSHOT:compile 
(selected for compile)
[DEBUG]       commons-collections:commons-collections:jar:3.2.1:compile 
(selected for compile)
[DEBUG]       org.slf4j:slf4j-api:jar:1.6.4:compile (selected for compile)
[DEBUG]       org.slf4j:jcl-over-slf4j:jar:1.6.4:compile (selected for 
compile)
[DEBUG]     org.apache.jackrabbit:jackrabbit-api:jar:2.4.0:compile 
(selected for compile)
[DEBUG] 
org.apache.jackrabbit:jackrabbit-jcr-commons:jar:2.4.0:compile (selected 
for compile)
[DEBUG]     commons-collections:commons-collections:jar:3.2.1:compile 
(selected for compile)
[DEBUG]     org.slf4j:slf4j-api:jar:1.6.4:compile (selected for compile)
[DEBUG]     org.slf4j:jcl-over-slf4j:jar:1.6.4:compile (selected for 
compile)
[DEBUG]   org.apache.jackrabbit:jackrabbit-jcr-server:jar:2.4.0:compile 
(selected for compile)
[DEBUG] 
org.apache.jackrabbit:jackrabbit-spi-commons:jar:2.4.0:compile (selected 
for compile)
[DEBUG]       org.apache.jackrabbit:jackrabbit-spi:jar:2.4.0:compile 
(selected for compile)
[DEBUG]       commons-io:commons-io:jar:1.4:compile (selected for compile)
[DEBUG]     org.apache.jackrabbit:jackrabbit-webdav:jar:2.4.0:compile 
(selected for compile)
[DEBUG]       commons-httpclient:commons-httpclient:jar:3.0:compile 
(selected for compile)
[DEBUG]         commons-codec:commons-codec:jar:1.2:compile (selected 
for compile)
[DEBUG]     org.apache.tika:tika-core:jar:1.0:compile (selected for compile)
[DEBUG]     commons-fileupload:commons-fileupload:jar:1.2.1:compile 
(selected for compile)
[DEBUG]   org.eclipse.jetty:jetty-servlet:jar:8.1.2.v20120308:compile 
(selected for compile)
[DEBUG]     org.eclipse.jetty:jetty-security:jar:8.1.2.v20120308:compile 
(selected for compile)
[DEBUG]       org.eclipse.jetty:jetty-server:jar:8.1.2.v20120308:compile 
(selected for compile)
[DEBUG] 
org.eclipse.jetty.orbit:javax.servlet:jar:3.0.0.v201112011016:compile 
(selected for compile)
[DEBUG] 
org.eclipse.jetty:jetty-continuation:jar:8.1.2.v20120308:compile 
(selected for compile)
[DEBUG]         org.eclipse.jetty:jetty-http:jar:8.1.2.v20120308:compile 
(selected for compile)
[DEBUG]           org.eclipse.jetty:jetty-io:jar:8.1.2.v20120308:compile 
(selected for compile)
[DEBUG] 
org.eclipse.jetty:jetty-util:jar:8.1.2.v20120308:compile (selected for 
compile)
[DEBUG]   ch.qos.logback:logback-classic:jar:1.0.1:compile (selected for 
compile)
[DEBUG]     ch.qos.logback:logback-core:jar:1.0.1:compile (selected for 
compile)
[DEBUG] Building project for commons-io:commons-io:jar:1.4:compile
[DEBUG] Adding project with groupId [commons-io]
[DEBUG] Building project for 
org.apache.jackrabbit:jackrabbit-api:jar:2.4.0:compile
[DEBUG] Adding project with groupId [org.apache.jackrabbit]
[DEBUG] Building project for 
org.apache.jackrabbit:oak-mk:jar:0.2-SNAPSHOT:compile
[DEBUG] Adding project with groupId [org.apache.jackrabbit]
[DEBUG] Building project for 
commons-httpclient:commons-httpclient:jar:3.0:compile
[DEBUG] Adding project with groupId [commons-httpclient]
[DEBUG] Building project for 
org.eclipse.jetty:jetty-http:jar:8.1.2.v20120308:compile
[DEBUG] Adding project with groupId [org.eclipse.jetty]
[DEBUG] Building project for org.slf4j:slf4j-api:jar:1.6.4:compile
[DEBUG] Adding project with groupId [org.slf4j]
[DEBUG] Building project for 
org.apache.jackrabbit:oak-jcr:jar:0.2-SNAPSHOT:compile
[DEBUG] Adding project with groupId [org.apache.jackrabbit]
[DEBUG] Building project for 
org.apache.jackrabbit:oak-core:jar:0.2-SNAPSHOT:compile
[DEBUG] Adding project with groupId [org.apache.jackrabbit]
[DEBUG] Building project for 
org.eclipse.jetty:jetty-server:jar:8.1.2.v20120308:compile
[DEBUG] Adding project with groupId [org.eclipse.jetty]
[DEBUG] Building project for org.slf4j:jcl-over-slf4j:jar:1.6.4:compile
[DEBUG] Adding project with groupId [org.slf4j]
[DEBUG] Building project for 
commons-collections:commons-collections:jar:3.2.1:compile
[DEBUG] Adding project with groupId [commons-collections]
[DEBUG] Building project for 
org.apache.jackrabbit:jackrabbit-webdav:jar:2.4.0:compile
[DEBUG] Adding project with groupId [org.apache.jackrabbit]
[DEBUG] Building project for 
commons-fileupload:commons-fileupload:jar:1.2.1:compile
[DEBUG] Adding project with groupId [commons-fileupload]
[DEBUG] Building project for commons-codec:commons-codec:jar:1.2:compile
[DEBUG] Adding project with groupId [commons-codec]
[DEBUG] Building project for 
org.eclipse.jetty:jetty-io:jar:8.1.2.v20120308:compile
[DEBUG] Adding project with groupId [org.eclipse.jetty]
[DEBUG] Building project for javax.jcr:jcr:jar:2.0:compile
[DEBUG] Adding project with groupId [javax.jcr]
[DEBUG] Building project for 
ch.qos.logback:logback-classic:jar:1.0.1:compile
[DEBUG] Adding project with groupId [ch.qos.logback]
[DEBUG] Building project for 
org.eclipse.jetty:jetty-servlet:jar:8.1.2.v20120308:compile
[DEBUG] Adding project with groupId [org.eclipse.jetty]
[DEBUG] Building project for ch.qos.logback:logback-core:jar:1.0.1:compile
[DEBUG] Adding project with groupId [ch.qos.logback]
[DEBUG] Building project for 
org.apache.jackrabbit:jackrabbit-spi-commons:jar:2.4.0:compile
[DEBUG] Adding project with groupId [org.apache.jackrabbit]
[DEBUG] Building project for 
org.eclipse.jetty:jetty-util:jar:8.1.2.v20120308:compile
[DEBUG] Adding project with groupId [org.eclipse.jetty]
[DEBUG] Building project for 
org.eclipse.jetty:jetty-continuation:jar:8.1.2.v20120308:compile
[DEBUG] Adding project with groupId [org.eclipse.jetty]
[DEBUG] Building project for 
org.apache.jackrabbit:jackrabbit-jcr-commons:jar:2.4.0:compile
[DEBUG] Adding project with groupId [org.apache.jackrabbit]
[DEBUG] Building project for 
org.apache.jackrabbit:jackrabbit-spi:jar:2.4.0:compile
[DEBUG] Adding project with groupId [org.apache.jackrabbit]
[DEBUG] Building project for org.apache.tika:tika-core:jar:1.0:compile
[DEBUG] Adding project with groupId [org.apache.tika]
[DEBUG] Building project for 
org.apache.jackrabbit:jackrabbit-jcr-server:jar:2.4.0:compile
[DEBUG] Adding project with groupId [org.apache.jackrabbit]
[DEBUG] Building project for 
org.eclipse.jetty.orbit:javax.servlet:jar:3.0.0.v201112011016:compile
[DEBUG] Adding project with groupId [org.eclipse.jetty.orbit]
[DEBUG] Building project for 
org.eclipse.jetty:jetty-security:jar:8.1.2.v20120308:compile
[DEBUG] Adding project with groupId [org.eclipse.jetty]
[INFO]
[INFO] --- maven-resources-plugin:2.5:resources (default-resources) @ 
oak-run ---
[DEBUG] org.apache.maven.plugins:maven-resources-plugin:jar:2.5:
[DEBUG]    org.apache.maven:maven-plugin-api:jar:2.0.6:compile
[DEBUG]    org.apache.maven:maven-project:jar:2.0.6:compile
[DEBUG]       org.apache.maven:maven-profile:jar:2.0.6:compile
[DEBUG]       org.apache.maven:maven-artifact-manager:jar:2.0.6:compile
[DEBUG]       org.apache.maven:maven-plugin-registry:jar:2.0.6:compile
[DEBUG]    org.apache.maven:maven-core:jar:2.0.6:compile
[DEBUG] 
org.apache.maven:maven-plugin-parameter-documenter:jar:2.0.6:compile
[DEBUG] 
org.apache.maven.reporting:maven-reporting-api:jar:2.0.6:compile
[DEBUG] 
org.apache.maven.doxia:doxia-sink-api:jar:1.0-alpha-7:compile
[DEBUG]       org.apache.maven:maven-repository-metadata:jar:2.0.6:compile
[DEBUG]       org.apache.maven:maven-error-diagnostics:jar:2.0.6:compile
[DEBUG]       commons-cli:commons-cli:jar:1.0:compile
[DEBUG]       org.apache.maven:maven-plugin-descriptor:jar:2.0.6:compile
[DEBUG] 
org.codehaus.plexus:plexus-interactivity-api:jar:1.0-alpha-4:compile
[DEBUG]       classworlds:classworlds:jar:1.1:compile
[DEBUG]    org.apache.maven:maven-artifact:jar:2.0.6:compile
[DEBUG]    org.apache.maven:maven-settings:jar:2.0.6:compile
[DEBUG]    org.apache.maven:maven-model:jar:2.0.6:compile
[DEBUG]    org.apache.maven:maven-monitor:jar:2.0.6:compile
[DEBUG] 
org.codehaus.plexus:plexus-container-default:jar:1.0-alpha-9-stable-1:compile
[DEBUG]       junit:junit:jar:3.8.1:compile
[DEBUG]    org.codehaus.plexus:plexus-utils:jar:2.0.5:compile
[DEBUG]    org.apache.maven.shared:maven-filtering:jar:1.0:compile
[DEBUG]       org.sonatype.plexus:plexus-build-api:jar:0.0.4:compile
[DEBUG]    org.codehaus.plexus:plexus-interpolation:jar:1.13:compile
[DEBUG] Created new class realm 
plugin>org.apache.maven.plugins:maven-resources-plugin:2.5
[DEBUG] Importing foreign packages into class realm 
plugin>org.apache.maven.plugins:maven-resources-plugin:2.5
[DEBUG]   Imported:  < maven.api
[DEBUG] Populating class realm 
plugin>org.apache.maven.plugins:maven-resources-plugin:2.5
[DEBUG]   Included: org.apache.maven.plugins:maven-resources-plugin:jar:2.5
[DEBUG]   Included: org.apache.maven.reporting:maven-reporting-api:jar:2.0.6
[DEBUG]   Included: org.apache.maven.doxia:doxia-sink-api:jar:1.0-alpha-7
[DEBUG]   Included: commons-cli:commons-cli:jar:1.0
[DEBUG]   Included: 
org.codehaus.plexus:plexus-interactivity-api:jar:1.0-alpha-4
[DEBUG]   Included: junit:junit:jar:3.8.1
[DEBUG]   Included: org.codehaus.plexus:plexus-utils:jar:2.0.5
[DEBUG]   Included: org.apache.maven.shared:maven-filtering:jar:1.0
[DEBUG]   Included: org.sonatype.plexus:plexus-build-api:jar:0.0.4
[DEBUG]   Included: org.codehaus.plexus:plexus-interpolation:jar:1.13
[DEBUG]   Excluded: org.apache.maven:maven-plugin-api:jar:2.0.6
[DEBUG]   Excluded: org.apache.maven:maven-project:jar:2.0.6
[DEBUG]   Excluded: org.apache.maven:maven-profile:jar:2.0.6
[DEBUG]   Excluded: org.apache.maven:maven-artifact-manager:jar:2.0.6
[DEBUG]   Excluded: org.apache.maven:maven-plugin-registry:jar:2.0.6
[DEBUG]   Excluded: org.apache.maven:maven-core:jar:2.0.6
[DEBUG]   Excluded: 
org.apache.maven:maven-plugin-parameter-documenter:jar:2.0.6
[DEBUG]   Excluded: org.apache.maven:maven-repository-metadata:jar:2.0.6
[DEBUG]   Excluded: org.apache.maven:maven-error-diagnostics:jar:2.0.6
[DEBUG]   Excluded: org.apache.maven:maven-plugin-descriptor:jar:2.0.6
[DEBUG]   Excluded: classworlds:classworlds:jar:1.1
[DEBUG]   Excluded: org.apache.maven:maven-artifact:jar:2.0.6
[DEBUG]   Excluded: org.apache.maven:maven-settings:jar:2.0.6
[DEBUG]   Excluded: org.apache.maven:maven-model:jar:2.0.6
[DEBUG]   Excluded: org.apache.maven:maven-monitor:jar:2.0.6
[DEBUG]   Excluded: 
org.codehaus.plexus:plexus-container-default:jar:1.0-alpha-9-stable-1
[DEBUG] Configuring mojo 
org.apache.maven.plugins:maven-resources-plugin:2.5:resources from 
plugin realm 
ClassRealm[plugin>org.apache.maven.plugins:maven-resources-plugin:2.5, 
parent: sun.misc.Launcher$AppClassLoader@6d6f0472]
[debug] execute contextualize
[DEBUG] Configuring mojo 
'org.apache.maven.plugins:maven-resources-plugin:2.5:resources' with 
basic configurator -->
[DEBUG]   (f) buildFilters = []
[DEBUG]   (f) encoding = UTF-8
[DEBUG]   (f) escapeWindowsPaths = true
[DEBUG]   (s) includeEmptyDirs = false
[DEBUG]   (s) outputDirectory = 
/Users/mduerig/Checkouts/apache/jackrabbit/oak/trunk/oak-run/target/classes
[DEBUG]   (s) overwrite = false
[DEBUG]   (f) project = MavenProject: 
org.apache.jackrabbit:oak-run:0.2-SNAPSHOT @ 
/Users/mduerig/Checkouts/apache/jackrabbit/oak/trunk/oak-run/pom.xml
[DEBUG]   (s) resources = [Resource {targetPath: null, filtering: false, 
FileSet {directory: 
/Users/mduerig/Checkouts/apache/jackrabbit/oak/trunk/oak-run/src/main/resources, 
PatternSet [includes: {}, excludes: {}]}}, Resource {targetPath: null, 
filtering: false, FileSet {directory: 
/Users/mduerig/Checkouts/apache/jackrabbit/oak/trunk/oak-run/target/maven-shared-archive-resources, 
PatternSet [includes: {}, excludes: {}]}}]
[DEBUG]   (f) session = org.apache.maven.execution.MavenSession@254ba9a2
[DEBUG]   (f) supportMultiLineFiltering = false
[DEBUG]   (f) useBuildFilters = true
[DEBUG]   (s) useDefaultDelimiters = true
[DEBUG] -- end configuration --
[DEBUG] properties used {java.vendor=Apple Inc., 
sun.java.launcher=SUN_STANDARD, sun.management.compiler=HotSpot 64-Bit 
Server Compiler, os.name=Mac OS X, 
sun.boot.class.path=/System/Library/Frameworks/JavaVM.framework/Versions/1.6.0/Classes/jsfd.jar:/System/Library/Frameworks/JavaVM.framework/Versions/1.6.0/Classes/classes.jar:/System/Library/Frameworks/JavaVM.framework/Frameworks/JavaRuntimeSupport.framework/Resources/Java/JavaRuntimeSupport.jar:/System/Library/Frameworks/JavaVM.framework/Versions/1.6.0/Classes/ui.jar:/System/Library/Frameworks/JavaVM.framework/Versions/1.6.0/Classes/laf.jar:/System/Library/Frameworks/JavaVM.framework/Versions/1.6.0/Classes/sunrsasign.jar:/System/Library/Frameworks/JavaVM.framework/Versions/1.6.0/Classes/jsse.jar:/System/Library/Frameworks/JavaVM.framework/Versions/1.6.0/Classes/jce.jar:/System/Library/Frameworks/JavaVM.framework/Versions/1.6.0/Classes/charsets.jar, 
env.TMPDIR=/var/folders/oC/oCkNey1sHcGaNn4ZtfEx4E+++TI/-Tmp-/, 
env.PWD=/Users/mduerig/Checkouts/apache/jackrabbit/oak/trunk/oak-run, 
skip.deployment=true, java.vm.specification.vendor=Sun Microsystems 
Inc., java.runtime.version=1.6.0_20-b02-279-10M3065, 
env.Apple_PubSub_Socket_Render=/tmp/launch-ZA395m/Render, 
project.build.sourceEncoding=UTF-8, 
env.DISPLAY=/tmp/launch-jHsPpx/org.macosforge.xquartz:0, 
user.name=mduerig, env.USER=mduerig, env.SHELL=/bin/bash, 
sourceReleaseAssemblyDescriptor=source-release, 
env.__CF_USER_TEXT_ENCODING=0x1F5:0:0, awt.nativeDoubleBuffering=true, 
env.PATH=/opt/local/bin:/opt/local/sbin:/usr/bin:/bin:/usr/sbin:/sbin:/usr/local/bin:/opt/X11/bin:/usr/local/git/bin:/usr/X11/bin, 
user.language=en, 
sun.boot.library.path=/System/Library/Frameworks/JavaVM.framework/Versions/1.6.0/Libraries, 
classworlds.conf=/usr/share/maven/bin/m2.conf, env.LC_CTYPE=UTF-8, 
java.version=1.6.0_20, user.timezone=Europe/London, 
organization.logo=http://www.apache.org/images/asf_logo_wide.gif, 
sun.arch.data.model=64, 
java.endorsed.dirs=/System/Library/Frameworks/JavaVM.framework/Versions/1.6.0/Home/lib/endorsed, 
sun.cpu.isalist=, sun.jnu.encoding=MacRoman, file.encoding.pkg=sun.io, 
env.SHLVL=1, file.separator=/, java.specification.name=Java Platform API 
Specification, java.class.version=50.0, user.country=US, 
java.home=/System/Library/Frameworks/JavaVM.framework/Versions/1.6.0/Home, 
java.vm.info=mixed mode, env.LOGNAME=mduerig, 
env.JAVA_MAIN_CLASS_18333=org.codehaus.plexus.classworlds.launcher.Launcher, 
os.version=10.6.4, env.TERM_PROGRAM_VERSION=272, path.separator=:, 
java.vm.version=16.3-b01-279, gpg.useagent=true, 
env.JAVA_HOME=/System/Library/Frameworks/JavaVM.framework/Versions/1.6.0/Home, 
java.awt.printerjob=apple.awt.CPrinterJob, env.TERM=xterm-color, 
sun.io.unicode.encoding=UnicodeLittle, awt.toolkit=apple.awt.CToolkit, 
user.home=/Users/mduerig, 
env.OLDPWD=/Users/mduerig/Checkouts/apache/jackrabbit/oak/trunk/oak-run, 
java.specification.vendor=Sun Microsystems Inc., 
env.TERM_PROGRAM=Apple_Terminal, 
java.library.path=.:/Library/Java/Extensions:/System/Library/Java/Extensions:/usr/lib/java, 
java.vendor.url=http://www.apple.com/, distMgmtSnapshotsName=Apache 
Development Snapshot Repository, java.vm.vendor=Apple Inc., 
gopherProxySet=false, maven.home=/usr/share/maven, 
java.runtime.name=Java(TM) SE Runtime Environment, 
java.class.path=/usr/share/maven/boot/plexus-classworlds-2.4.jar, 
jetty.version=8.1.2.v20120308, java.vm.specification.name=Java Virtual 
Machine Specification, known.issues=, java.vm.specification.version=1.0, 
sun.cpu.endian=little, sun.os.patch.level=unknown, 
env.HOME=/Users/mduerig, 
java.io.tmpdir=/var/folders/oC/oCkNey1sHcGaNn4ZtfEx4E+++TI/-Tmp-/, 
java.vendor.url.bug=http://bugreport.apple.com/, 
distMgmtSnapshotsUrl=https://repository.apache.org/content/repositories/snapshots, 
env.MAVEN_OPTS=-Xmx512M -XX:MaxPermSize=256M, 
env.SSH_AUTH_SOCK=/tmp/launch-jW96ov/Listeners, 
env.COMMAND_MODE=unix2003, mrj.build=10M3065, os.arch=x86_64, 
java.awt.graphicsenv=apple.awt.CGraphicsEnvironment, 
java.ext.dirs=/Library/Java/Extensions:/System/Library/Java/Extensions:/System/Library/Frameworks/JavaVM.framework/Versions/1.6.0/Home/lib/ext, 
mrj.version=1060.1.6.0_20-279, 
user.dir=/Users/mduerig/Checkouts/apache/jackrabbit/oak/trunk/oak-run, 
line.separator=
, java.vm.name=Java HotSpot(TM) 64-Bit Server VM, 
file.encoding=MacRoman, 
env.GPG_AGENT_INFO=/Users/mduerig/.gnupg/S.gpg-agent:94:1, 
java.specification.version=1.6, jackrabbit.version=2.4.0}
[INFO] Using 'UTF-8' encoding to copy filtered resources.
[DEBUG] resource with targetPath null
directory 
/Users/mduerig/Checkouts/apache/jackrabbit/oak/trunk/oak-run/src/main/resources
excludes []
includes []
[INFO] skip non existing resourceDirectory 
/Users/mduerig/Checkouts/apache/jackrabbit/oak/trunk/oak-run/src/main/resources
[DEBUG] resource with targetPath null
directory 
/Users/mduerig/Checkouts/apache/jackrabbit/oak/trunk/oak-run/target/maven-shared-archive-resources
excludes []
includes []
[DEBUG] ignoreDelta true
[INFO] Copying 3 resources
[DEBUG] file DEPENDENCIES has a filtered file extension
[DEBUG] copy 
/Users/mduerig/Checkouts/apache/jackrabbit/oak/trunk/oak-run/target/maven-shared-archive-resources/META-INF/DEPENDENCIES 
to 
/Users/mduerig/Checkouts/apache/jackrabbit/oak/trunk/oak-run/target/classes/META-INF/DEPENDENCIES
[DEBUG] file LICENSE has a filtered file extension
[DEBUG] copy 
/Users/mduerig/Checkouts/apache/jackrabbit/oak/trunk/oak-run/target/maven-shared-archive-resources/META-INF/LICENSE 
to 
/Users/mduerig/Checkouts/apache/jackrabbit/oak/trunk/oak-run/target/classes/META-INF/LICENSE
[DEBUG] file NOTICE has a filtered file extension
[DEBUG] copy 
/Users/mduerig/Checkouts/apache/jackrabbit/oak/trunk/oak-run/target/maven-shared-archive-resources/META-INF/NOTICE 
to 
/Users/mduerig/Checkouts/apache/jackrabbit/oak/trunk/oak-run/target/classes/META-INF/NOTICE
[DEBUG] no use filter components
[INFO]
[INFO] --- maven-compiler-plugin:2.3.2:compile (default-compile) @ 
oak-run ---
[DEBUG] org.apache.maven.plugins:maven-compiler-plugin:jar:2.3.2:
[DEBUG]    org.apache.maven:maven-plugin-api:jar:2.0.6:compile
[DEBUG]    org.apache.maven:maven-artifact:jar:2.0.6:compile
[DEBUG]    org.apache.maven:maven-core:jar:2.0.6:compile
[DEBUG]       org.apache.maven:maven-settings:jar:2.0.6:compile
[DEBUG] 
org.apache.maven:maven-plugin-parameter-documenter:jar:2.0.6:compile
[DEBUG]       org.apache.maven:maven-profile:jar:2.0.6:compile
[DEBUG]       org.apache.maven:maven-model:jar:2.0.6:compile
[DEBUG]       org.apache.maven:maven-repository-metadata:jar:2.0.6:compile
[DEBUG]       org.apache.maven:maven-error-diagnostics:jar:2.0.6:compile
[DEBUG]       org.apache.maven:maven-project:jar:2.0.6:compile
[DEBUG]          org.apache.maven:maven-plugin-registry:jar:2.0.6:compile
[DEBUG]       org.apache.maven:maven-plugin-descriptor:jar:2.0.6:compile
[DEBUG]       org.apache.maven:maven-artifact-manager:jar:2.0.6:compile
[DEBUG]       org.apache.maven:maven-monitor:jar:2.0.6:compile
[DEBUG]    org.apache.maven:maven-toolchain:jar:1.0:compile
[DEBUG]    org.codehaus.plexus:plexus-utils:jar:2.0.5:compile
[DEBUG]    org.codehaus.plexus:plexus-compiler-api:jar:1.8.1:compile
[DEBUG]    org.codehaus.plexus:plexus-compiler-manager:jar:1.8.1:compile
[DEBUG]    org.codehaus.plexus:plexus-compiler-javac:jar:1.8.1:runtime
[DEBUG] Created new class realm 
plugin>org.apache.maven.plugins:maven-compiler-plugin:2.3.2
[DEBUG] Importing foreign packages into class realm 
plugin>org.apache.maven.plugins:maven-compiler-plugin:2.3.2
[DEBUG]   Imported:  < maven.api
[DEBUG] Populating class realm 
plugin>org.apache.maven.plugins:maven-compiler-plugin:2.3.2
[DEBUG]   Included: org.apache.maven.plugins:maven-compiler-plugin:jar:2.3.2
[DEBUG]   Included: org.codehaus.plexus:plexus-utils:jar:2.0.5
[DEBUG]   Included: org.codehaus.plexus:plexus-compiler-api:jar:1.8.1
[DEBUG]   Included: org.codehaus.plexus:plexus-compiler-manager:jar:1.8.1
[DEBUG]   Included: org.codehaus.plexus:plexus-compiler-javac:jar:1.8.1
[DEBUG]   Excluded: org.apache.maven:maven-plugin-api:jar:2.0.6
[DEBUG]   Excluded: org.apache.maven:maven-artifact:jar:2.0.6
[DEBUG]   Excluded: org.apache.maven:maven-core:jar:2.0.6
[DEBUG]   Excluded: org.apache.maven:maven-settings:jar:2.0.6
[DEBUG]   Excluded: 
org.apache.maven:maven-plugin-parameter-documenter:jar:2.0.6
[DEBUG]   Excluded: org.apache.maven:maven-profile:jar:2.0.6
[DEBUG]   Excluded: org.apache.maven:maven-model:jar:2.0.6
[DEBUG]   Excluded: org.apache.maven:maven-repository-metadata:jar:2.0.6
[DEBUG]   Excluded: org.apache.maven:maven-error-diagnostics:jar:2.0.6
[DEBUG]   Excluded: org.apache.maven:maven-project:jar:2.0.6
[DEBUG]   Excluded: org.apache.maven:maven-plugin-registry:jar:2.0.6
[DEBUG]   Excluded: org.apache.maven:maven-plugin-descriptor:jar:2.0.6
[DEBUG]   Excluded: org.apache.maven:maven-artifact-manager:jar:2.0.6
[DEBUG]   Excluded: org.apache.maven:maven-monitor:jar:2.0.6
[DEBUG]   Excluded: org.apache.maven:maven-toolchain:jar:1.0
[DEBUG] Configuring mojo 
org.apache.maven.plugins:maven-compiler-plugin:2.3.2:compile from plugin 
realm 
ClassRealm[plugin>org.apache.maven.plugins:maven-compiler-plugin:2.3.2, 
parent: sun.misc.Launcher$AppClassLoader@6d6f0472]
[DEBUG] Configuring mojo 
'org.apache.maven.plugins:maven-compiler-plugin:2.3.2:compile' with 
basic configurator -->
[DEBUG]   (f) basedir = 
/Users/mduerig/Checkouts/apache/jackrabbit/oak/trunk/oak-run
[DEBUG]   (f) buildDirectory = 
/Users/mduerig/Checkouts/apache/jackrabbit/oak/trunk/oak-run/target
[DEBUG]   (f) classpathElements = 
[/Users/mduerig/Checkouts/apache/jackrabbit/oak/trunk/oak-run/target/classes, 
/Users/mduerig/.m2/repository/org/apache/jackrabbit/oak-jcr/0.2-SNAPSHOT/oak-jcr-0.2-SNAPSHOT.jar, 
/Users/mduerig/.m2/repository/javax/jcr/jcr/2.0/jcr-2.0.jar, 
/Users/mduerig/.m2/repository/org/apache/jackrabbit/oak-core/0.2-SNAPSHOT/oak-core-0.2-SNAPSHOT.jar, 
/Users/mduerig/.m2/repository/org/apache/jackrabbit/oak-mk/0.2-SNAPSHOT/oak-mk-0.2-SNAPSHOT.jar, 
/Users/mduerig/.m2/repository/org/apache/jackrabbit/jackrabbit-api/2.4.0/jackrabbit-api-2.4.0.jar, 
/Users/mduerig/.m2/repository/org/apache/jackrabbit/jackrabbit-jcr-commons/2.4.0/jackrabbit-jcr-commons-2.4.0.jar, 
/Users/mduerig/.m2/repository/commons-collections/commons-collections/3.2.1/commons-collections-3.2.1.jar, 
/Users/mduerig/.m2/repository/org/slf4j/slf4j-api/1.6.4/slf4j-api-1.6.4.jar, 
/Users/mduerig/.m2/repository/org/slf4j/jcl-over-slf4j/1.6.4/jcl-over-slf4j-1.6.4.jar, 
/Users/mduerig/.m2/repository/org/apache/jackrabbit/jackrabbit-jcr-server/2.4.0/jackrabbit-jcr-server-2.4.0.jar, 
/Users/mduerig/.m2/repository/org/apache/jackrabbit/jackrabbit-spi-commons/2.4.0/jackrabbit-spi-commons-2.4.0.jar, 
/Users/mduerig/.m2/repository/org/apache/jackrabbit/jackrabbit-spi/2.4.0/jackrabbit-spi-2.4.0.jar, 
/Users/mduerig/.m2/repository/commons-io/commons-io/1.4/commons-io-1.4.jar, 
/Users/mduerig/.m2/repository/org/apache/jackrabbit/jackrabbit-webdav/2.4.0/jackrabbit-webdav-2.4.0.jar, 
/Users/mduerig/.m2/repository/commons-httpclient/commons-httpclient/3.0/commons-httpclient-3.0.jar, 
/Users/mduerig/.m2/repository/commons-codec/commons-codec/1.2/commons-codec-1.2.jar, 
/Users/mduerig/.m2/repository/org/apache/tika/tika-core/1.0/tika-core-1.0.jar, 
/Users/mduerig/.m2/repository/commons-fileupload/commons-fileupload/1.2.1/commons-fileupload-1.2.1.jar, 
/Users/mduerig/.m2/repository/org/eclipse/jetty/jetty-servlet/8.1.2.v20120308/jetty-servlet-8.1.2.v20120308.jar, 
/Users/mduerig/.m2/repository/org/eclipse/jetty/jetty-security/8.1.2.v20120308/jetty-security-8.1.2.v20120308.jar, 
/Users/mduerig/.m2/repository/org/eclipse/jetty/jetty-server/8.1.2.v20120308/jetty-server-8.1.2.v20120308.jar, 
/Users/mduerig/.m2/repository/org/eclipse/jetty/orbit/javax.servlet/3.0.0.v201112011016/javax.servlet-3.0.0.v201112011016.jar, 
/Users/mduerig/.m2/repository/org/eclipse/jetty/jetty-continuation/8.1.2.v20120308/jetty-continuation-8.1.2.v20120308.jar, 
/Users/mduerig/.m2/repository/org/eclipse/jetty/jetty-http/8.1.2.v20120308/jetty-http-8.1.2.v20120308.jar, 
/Users/mduerig/.m2/repository/org/eclipse/jetty/jetty-io/8.1.2.v20120308/jetty-io-8.1.2.v20120308.jar, 
/Users/mduerig/.m2/repository/org/eclipse/jetty/jetty-util/8.1.2.v20120308/jetty-util-8.1.2.v20120308.jar, 
/Users/mduerig/.m2/repository/ch/qos/logback/logback-classic/1.0.1/logback-classic-1.0.1.jar, 
/Users/mduerig/.m2/repository/ch/qos/logback/logback-core/1.0.1/logback-core-1.0.1.jar]
[DEBUG]   (f) compileSourceRoots = 
[/Users/mduerig/Checkouts/apache/jackrabbit/oak/trunk/oak-run/src/main/java]
[DEBUG]   (f) compilerId = javac
[DEBUG]   (f) debug = true
[DEBUG]   (f) encoding = UTF-8
[DEBUG]   (f) failOnError = true
[DEBUG]   (f) fork = false
[DEBUG]   (f) generatedSourcesDirectory = 
/Users/mduerig/Checkouts/apache/jackrabbit/oak/trunk/oak-run/target/generated-sources/annotations
[DEBUG]   (f) optimize = false
[DEBUG]   (f) outputDirectory = 
/Users/mduerig/Checkouts/apache/jackrabbit/oak/trunk/oak-run/target/classes
[DEBUG]   (f) outputFileName = oak-run-0.2-SNAPSHOT
[DEBUG]   (f) projectArtifact = 
org.apache.jackrabbit:oak-run:jar:0.2-SNAPSHOT
[DEBUG]   (f) session = org.apache.maven.execution.MavenSession@254ba9a2
[DEBUG]   (f) showDeprecation = false
[DEBUG]   (f) showWarnings = false
[DEBUG]   (f) source = 1.6
[DEBUG]   (f) staleMillis = 0
[DEBUG]   (f) target = 1.6
[DEBUG]   (f) verbose = false
[DEBUG] -- end configuration --
[DEBUG] Using compiler 'javac'.
[DEBUG] Source directories: 
[/Users/mduerig/Checkouts/apache/jackrabbit/oak/trunk/oak-run/src/main/java]
[DEBUG] Classpath: 
[/Users/mduerig/Checkouts/apache/jackrabbit/oak/trunk/oak-run/target/classes
 
/Users/mduerig/.m2/repository/org/apache/jackrabbit/oak-jcr/0.2-SNAPSHOT/oak-jcr-0.2-SNAPSHOT.jar
  /Users/mduerig/.m2/repository/javax/jcr/jcr/2.0/jcr-2.0.jar
 
/Users/mduerig/.m2/repository/org/apache/jackrabbit/oak-core/0.2-SNAPSHOT/oak-core-0.2-SNAPSHOT.jar
 
/Users/mduerig/.m2/repository/org/apache/jackrabbit/oak-mk/0.2-SNAPSHOT/oak-mk-0.2-SNAPSHOT.jar
 
/Users/mduerig/.m2/repository/org/apache/jackrabbit/jackrabbit-api/2.4.0/jackrabbit-api-2.4.0.jar
 
/Users/mduerig/.m2/repository/org/apache/jackrabbit/jackrabbit-jcr-commons/2.4.0/jackrabbit-jcr-commons-2.4.0.jar
 
/Users/mduerig/.m2/repository/commons-collections/commons-collections/3.2.1/commons-collections-3.2.1.jar
 
/Users/mduerig/.m2/repository/org/slf4j/slf4j-api/1.6.4/slf4j-api-1.6.4.jar
 
/Users/mduerig/.m2/repository/org/slf4j/jcl-over-slf4j/1.6.4/jcl-over-slf4j-1.6.4.jar
 
/Users/mduerig/.m2/repository/org/apache/jackrabbit/jackrabbit-jcr-server/2.4.0/jackrabbit-jcr-server-2.4.0.jar
 
/Users/mduerig/.m2/repository/org/apache/jackrabbit/jackrabbit-spi-commons/2.4.0/jackrabbit-spi-commons-2.4.0.jar
 
/Users/mduerig/.m2/repository/org/apache/jackrabbit/jackrabbit-spi/2.4.0/jackrabbit-spi-2.4.0.jar
  /Users/mduerig/.m2/repository/commons-io/commons-io/1.4/commons-io-1.4.jar
 
/Users/mduerig/.m2/repository/org/apache/jackrabbit/jackrabbit-webdav/2.4.0/jackrabbit-webdav-2.4.0.jar
 
/Users/mduerig/.m2/repository/commons-httpclient/commons-httpclient/3.0/commons-httpclient-3.0.jar
 
/Users/mduerig/.m2/repository/commons-codec/commons-codec/1.2/commons-codec-1.2.jar
 
/Users/mduerig/.m2/repository/org/apache/tika/tika-core/1.0/tika-core-1.0.jar
 
/Users/mduerig/.m2/repository/commons-fileupload/commons-fileupload/1.2.1/commons-fileupload-1.2.1.jar
 
/Users/mduerig/.m2/repository/org/eclipse/jetty/jetty-servlet/8.1.2.v20120308/jetty-servlet-8.1.2.v20120308.jar
 
/Users/mduerig/.m2/repository/org/eclipse/jetty/jetty-security/8.1.2.v20120308/jetty-security-8.1.2.v20120308.jar
 
/Users/mduerig/.m2/repository/org/eclipse/jetty/jetty-server/8.1.2.v20120308/jetty-server-8.1.2.v20120308.jar
 
/Users/mduerig/.m2/repository/org/eclipse/jetty/orbit/javax.servlet/3.0.0.v201112011016/javax.servlet-3.0.0.v201112011016.jar
 
/Users/mduerig/.m2/repository/org/eclipse/jetty/jetty-continuation/8.1.2.v20120308/jetty-continuation-8.1.2.v20120308.jar
 
/Users/mduerig/.m2/repository/org/eclipse/jetty/jetty-http/8.1.2.v20120308/jetty-http-8.1.2.v20120308.jar
 
/Users/mduerig/.m2/repository/org/eclipse/jetty/jetty-io/8.1.2.v20120308/jetty-io-8.1.2.v20120308.jar
 
/Users/mduerig/.m2/repository/org/eclipse/jetty/jetty-util/8.1.2.v20120308/jetty-util-8.1.2.v20120308.jar
 
/Users/mduerig/.m2/repository/ch/qos/logback/logback-classic/1.0.1/logback-classic-1.0.1.jar
 
/Users/mduerig/.m2/repository/ch/qos/logback/logback-core/1.0.1/logback-core-1.0.1.jar]
[DEBUG] Output directory: 
/Users/mduerig/Checkouts/apache/jackrabbit/oak/trunk/oak-run/target/classes
[DEBUG] Classpath:
[DEBUG] 
/Users/mduerig/Checkouts/apache/jackrabbit/oak/trunk/oak-run/target/classes
[DEBUG] 
/Users/mduerig/.m2/repository/org/apache/jackrabbit/oak-jcr/0.2-SNAPSHOT/oak-jcr-0.2-SNAPSHOT.jar
[DEBUG]  /Users/mduerig/.m2/repository/javax/jcr/jcr/2.0/jcr-2.0.jar
[DEBUG] 
/Users/mduerig/.m2/repository/org/apache/jackrabbit/oak-core/0.2-SNAPSHOT/oak-core-0.2-SNAPSHOT.jar
[DEBUG] 
/Users/mduerig/.m2/repository/org/apache/jackrabbit/oak-mk/0.2-SNAPSHOT/oak-mk-0.2-SNAPSHOT.jar
[DEBUG] 
/Users/mduerig/.m2/repository/org/apache/jackrabbit/jackrabbit-api/2.4.0/jackrabbit-api-2.4.0.jar
[DEBUG] 
/Users/mduerig/.m2/repository/org/apache/jackrabbit/jackrabbit-jcr-commons/2.4.0/jackrabbit-jcr-commons-2.4.0.jar
[DEBUG] 
/Users/mduerig/.m2/repository/commons-collections/commons-collections/3.2.1/commons-collections-3.2.1.jar
[DEBUG] 
/Users/mduerig/.m2/repository/org/slf4j/slf4j-api/1.6.4/slf4j-api-1.6.4.jar
[DEBUG] 
/Users/mduerig/.m2/repository/org/slf4j/jcl-over-slf4j/1.6.4/jcl-over-slf4j-1.6.4.jar
[DEBUG] 
/Users/mduerig/.m2/repository/org/apache/jackrabbit/jackrabbit-jcr-server/2.4.0/jackrabbit-jcr-server-2.4.0.jar
[DEBUG] 
/Users/mduerig/.m2/repository/org/apache/jackrabbit/jackrabbit-spi-commons/2.4.0/jackrabbit-spi-commons-2.4.0.jar
[DEBUG] 
/Users/mduerig/.m2/repository/org/apache/jackrabbit/jackrabbit-spi/2.4.0/jackrabbit-spi-2.4.0.jar
[DEBUG] 
/Users/mduerig/.m2/repository/commons-io/commons-io/1.4/commons-io-1.4.jar
[DEBUG] 
/Users/mduerig/.m2/repository/org/apache/jackrabbit/jackrabbit-webdav/2.4.0/jackrabbit-webdav-2.4.0.jar
[DEBUG] 
/Users/mduerig/.m2/repository/commons-httpclient/commons-httpclient/3.0/commons-httpclient-3.0.jar
[DEBUG] 
/Users/mduerig/.m2/repository/commons-codec/commons-codec/1.2/commons-codec-1.2.jar
[DEBUG] 
/Users/mduerig/.m2/repository/org/apache/tika/tika-core/1.0/tika-core-1.0.jar
[DEBUG] 
/Users/mduerig/.m2/repository/commons-fileupload/commons-fileupload/1.2.1/commons-fileupload-1.2.1.jar
[DEBUG] 
/Users/mduerig/.m2/repository/org/eclipse/jetty/jetty-servlet/8.1.2.v20120308/jetty-servlet-8.1.2.v20120308.jar
[DEBUG] 
/Users/mduerig/.m2/repository/org/eclipse/jetty/jetty-security/8.1.2.v20120308/jetty-security-8.1.2.v20120308.jar
[DEBUG] 
/Users/mduerig/.m2/repository/org/eclipse/jetty/jetty-server/8.1.2.v20120308/jetty-server-8.1.2.v20120308.jar
[DEBUG] 
/Users/mduerig/.m2/repository/org/eclipse/jetty/orbit/javax.servlet/3.0.0.v201112011016/javax.servlet-3.0.0.v201112011016.jar
[DEBUG] 
/Users/mduerig/.m2/repository/org/eclipse/jetty/jetty-continuation/8.1.2.v20120308/jetty-continuation-8.1.2.v20120308.jar
[DEBUG] 
/Users/mduerig/.m2/repository/org/eclipse/jetty/jetty-http/8.1.2.v20120308/jetty-http-8.1.2.v20120308.jar
[DEBUG] 
/Users/mduerig/.m2/repository/org/eclipse/jetty/jetty-io/8.1.2.v20120308/jetty-io-8.1.2.v20120308.jar
[DEBUG] 
/Users/mduerig/.m2/repository/org/eclipse/jetty/jetty-util/8.1.2.v20120308/jetty-util-8.1.2.v20120308.jar
[DEBUG] 
/Users/mduerig/.m2/repository/ch/qos/logback/logback-classic/1.0.1/logback-classic-1.0.1.jar
[DEBUG] 
/Users/mduerig/.m2/repository/ch/qos/logback/logback-core/1.0.1/logback-core-1.0.1.jar
[DEBUG] Source roots:
[DEBUG] 
/Users/mduerig/Checkouts/apache/jackrabbit/oak/trunk/oak-run/src/main/java
[DEBUG] Command line options:
[DEBUG] -d 
/Users/mduerig/Checkouts/apache/jackrabbit/oak/trunk/oak-run/target/classes 
-classpath 
/Users/mduerig/Checkouts/apache/jackrabbit/oak/trunk/oak-run/target/classes:/Users/mduerig/.m2/repository/org/apache/jackrabbit/oak-jcr/0.2-SNAPSHOT/oak-jcr-0.2-SNAPSHOT.jar:/Users/mduerig/.m2/repository/javax/jcr/jcr/2.0/jcr-2.0.jar:/Users/mduerig/.m2/repository/org/apache/jackrabbit/oak-core/0.2-SNAPSHOT/oak-core-0.2-SNAPSHOT.jar:/Users/mduerig/.m2/repository/org/apache/jackrabbit/oak-mk/0.2-SNAPSHOT/oak-mk-0.2-SNAPSHOT.jar:/Users/mduerig/.m2/repository/org/apache/jackrabbit/jackrabbit-api/2.4.0/jackrabbit-api-2.4.0.jar:/Users/mduerig/.m2/repository/org/apache/jackrabbit/jackrabbit-jcr-commons/2.4.0/jackrabbit-jcr-commons-2.4.0.jar:/Users/mduerig/.m2/repository/commons-collections/commons-collections/3.2.1/commons-collections-3.2.1.jar:/Users/mduerig/.m2/repository/org/slf4j/slf4j-api/1.6.4/slf4j-api-1.6.4.jar:/Users/mduerig/.m2/repository/org/slf4j/jcl-over-slf4j/1.6.4/jcl-over-slf4j-1.6.4.jar:/Users/mduerig/.m2/repository/org/apache/jackrabbit/jackrabbit-jcr-server/2.4.0/jackrabbi
t-jcr-server-2.4.0.jar:/Users/mduerig/.m2/repository/org/apache/jackrabbit/jackrabbit-spi-commons/2.4.0/jackrabbit-spi-commons-2.4.0.jar:/Users/mduerig/.m2/repository/org/apache/jackrabbit/jackrabbit-spi/2.4.0/jackrabbit-spi-2.4.0.jar:/Users/mduerig/.m2/repository/commons-io/commons-io/1.4/commons-io-1.4.jar:/Users/mduerig/.m2/repository/org/apache/jackrabbit/jackrabbit-webdav/2.4.0/jackrabbit-webdav-2.4.0.jar:/Users/mduerig/.m2/repository/commons-httpclient/commons-httpclient/3.0/commons-httpclient-3.0.jar:/Users/mduerig/.m2/repository/commons-codec/commons-codec/1.2/commons-codec-1.2.jar:/Users/mduerig/.m2/repository/org/apache/tika/tika-core/1.0/tika-core-1.0.jar:/Users/mduerig/.m2/repository/commons-fileupload/commons-fileupload/1.2.1/commons-fileupload-1.2.1.jar:/Users/mduerig/.m2/repository/org/eclipse/jetty/jetty-servlet/8.1.2.v20120308/jetty-servlet-8.1.2.v20120308.jar:/Users/mduerig/.m2/repository/org/eclipse/jetty/jetty-security/8.1.2.v20120308/jetty-security-8.1.2.v20120308
.jar:/Users/mduerig/.m2/repository/org/eclipse/jetty/jetty-server/8.1.2.v20120308/jetty-server-8.1.2.v20120308.jar:/Users/mduerig/.m2/repository/org/eclipse/jetty/orbit/javax.servlet/3.0.0.v201112011016/javax.servlet-3.0.0.v201112011016.jar:/Users/mduerig/.m2/repository/org/eclipse/jetty/jetty-continuation/8.1.2.v20120308/jetty-continuation-8.1.2.v20120308.jar:/Users/mduerig/.m2/repository/org/eclipse/jetty/jetty-http/8.1.2.v20120308/jetty-http-8.1.2.v20120308.jar:/Users/mduerig/.m2/repository/org/eclipse/jetty/jetty-io/8.1.2.v20120308/jetty-io-8.1.2.v20120308.jar:/Users/mduerig/.m2/repository/org/eclipse/jetty/jetty-util/8.1.2.v20120308/jetty-util-8.1.2.v20120308.jar:/Users/mduerig/.m2/repository/ch/qos/logback/logback-classic/1.0.1/logback-classic-1.0.1.jar:/Users/mduerig/.m2/repository/ch/qos/logback/logback-core/1.0.1/logback-core-1.0.1.jar: 
-sourcepath 
/Users/mduerig/Checkouts/apache/jackrabbit/oak/trunk/oak-run/src/main/java: 
/Users/mduerig/Checkouts/apache/jackrabbit/oak/trunk/oak-run/src/main/java/org/apache/jackrabbit/oak/run/Main.java 
-s 
/Users/mduerig/Checkouts/apache/jackrabbit/oak/trunk/oak-run/target/generated-sources/annotations 
-g -nowarn -target 1.6 -source 1.6 -encoding UTF-8
[INFO] Compiling 1 source file to 
/Users/mduerig/Checkouts/apache/jackrabbit/oak/trunk/oak-run/target/classes
[INFO]
[INFO] --- maven-resources-plugin:2.5:testResources 
(default-testResources) @ oak-run ---
[DEBUG] Configuring mojo 
org.apache.maven.plugins:maven-resources-plugin:2.5:testResources from 
plugin realm 
ClassRealm[plugin>org.apache.maven.plugins:maven-resources-plugin:2.5, 
parent: sun.misc.Launcher$AppClassLoader@6d6f0472]
[debug] execute contextualize
[DEBUG] Configuring mojo 
'org.apache.maven.plugins:maven-resources-plugin:2.5:testResources' with 
basic configurator -->
[DEBUG]   (f) buildFilters = []
[DEBUG]   (f) encoding = UTF-8
[DEBUG]   (f) escapeWindowsPaths = true
[DEBUG]   (s) includeEmptyDirs = false
[DEBUG]   (s) outputDirectory = 
/Users/mduerig/Checkouts/apache/jackrabbit/oak/trunk/oak-run/target/test-classes
[DEBUG]   (s) overwrite = false
[DEBUG]   (f) project = MavenProject: 
org.apache.jackrabbit:oak-run:0.2-SNAPSHOT @ 
/Users/mduerig/Checkouts/apache/jackrabbit/oak/trunk/oak-run/pom.xml
[DEBUG]   (s) resources = [Resource {targetPath: null, filtering: false, 
FileSet {directory: 
/Users/mduerig/Checkouts/apache/jackrabbit/oak/trunk/oak-run/src/test/resources, 
PatternSet [includes: {}, excludes: {}]}}, Resource {targetPath: null, 
filtering: false, FileSet {directory: 
/Users/mduerig/Checkouts/apache/jackrabbit/oak/trunk/oak-run/target/maven-shared-archive-resources, 
PatternSet [includes: {}, excludes: {}]}}]
[DEBUG]   (f) session = org.apache.maven.execution.MavenSession@254ba9a2
[DEBUG]   (f) supportMultiLineFiltering = false
[DEBUG]   (f) useBuildFilters = true
[DEBUG]   (s) useDefaultDelimiters = true
[DEBUG] -- end configuration --
[DEBUG] properties used {java.vendor=Apple Inc., 
sun.java.launcher=SUN_STANDARD, sun.management.compiler=HotSpot 64-Bit 
Server Compiler, os.name=Mac OS X, 
sun.boot.class.path=/System/Library/Frameworks/JavaVM.framework/Versions/1.6.0/Classes/jsfd.jar:/System/Library/Frameworks/JavaVM.framework/Versions/1.6.0/Classes/classes.jar:/System/Library/Frameworks/JavaVM.framework/Frameworks/JavaRuntimeSupport.framework/Resources/Java/JavaRuntimeSupport.jar:/System/Library/Frameworks/JavaVM.framework/Versions/1.6.0/Classes/ui.jar:/System/Library/Frameworks/JavaVM.framework/Versions/1.6.0/Classes/laf.jar:/System/Library/Frameworks/JavaVM.framework/Versions/1.6.0/Classes/sunrsasign.jar:/System/Library/Frameworks/JavaVM.framework/Versions/1.6.0/Classes/jsse.jar:/System/Library/Frameworks/JavaVM.framework/Versions/1.6.0/Classes/jce.jar:/System/Library/Frameworks/JavaVM.framework/Versions/1.6.0/Classes/charsets.jar, 
env.TMPDIR=/var/folders/oC/oCkNey1sHcGaNn4ZtfEx4E+++TI/-Tmp-/, 
env.PWD=/Users/mduerig/Checkouts/apache/jackrabbit/oak/trunk/oak-run, 
skip.deployment=true, java.vm.specification.vendor=Sun Microsystems 
Inc., java.runtime.version=1.6.0_20-b02-279-10M3065, 
env.Apple_PubSub_Socket_Render=/tmp/launch-ZA395m/Render, 
project.build.sourceEncoding=UTF-8, 
env.DISPLAY=/tmp/launch-jHsPpx/org.macosforge.xquartz:0, 
user.name=mduerig, env.USER=mduerig, env.SHELL=/bin/bash, 
sourceReleaseAssemblyDescriptor=source-release, 
env.__CF_USER_TEXT_ENCODING=0x1F5:0:0, awt.nativeDoubleBuffering=true, 
env.PATH=/opt/local/bin:/opt/local/sbin:/usr/bin:/bin:/usr/sbin:/sbin:/usr/local/bin:/opt/X11/bin:/usr/local/git/bin:/usr/X11/bin, 
user.language=en, 
sun.boot.library.path=/System/Library/Frameworks/JavaVM.framework/Versions/1.6.0/Libraries, 
classworlds.conf=/usr/share/maven/bin/m2.conf, env.LC_CTYPE=UTF-8, 
java.version=1.6.0_20, user.timezone=Europe/London, 
organization.logo=http://www.apache.org/images/asf_logo_wide.gif, 
sun.arch.data.model=64, 
java.endorsed.dirs=/System/Library/Frameworks/JavaVM.framework/Versions/1.6.0/Home/lib/endorsed, 
sun.cpu.isalist=, sun.jnu.encoding=MacRoman, file.encoding.pkg=sun.io, 
env.SHLVL=1, file.separator=/, java.specification.name=Java Platform API 
Specification, java.class.version=50.0, user.country=US, 
java.home=/System/Library/Frameworks/JavaVM.framework/Versions/1.6.0/Home, 
java.vm.info=mixed mode, env.LOGNAME=mduerig, 
env.JAVA_MAIN_CLASS_18333=org.codehaus.plexus.classworlds.launcher.Launcher, 
os.version=10.6.4, env.TERM_PROGRAM_VERSION=272, path.separator=:, 
java.vm.version=16.3-b01-279, gpg.useagent=true, 
env.JAVA_HOME=/System/Library/Frameworks/JavaVM.framework/Versions/1.6.0/Home, 
java.awt.printerjob=apple.awt.CPrinterJob, env.TERM=xterm-color, 
sun.io.unicode.encoding=UnicodeLittle, awt.toolkit=apple.awt.CToolkit, 
user.home=/Users/mduerig, 
env.OLDPWD=/Users/mduerig/Checkouts/apache/jackrabbit/oak/trunk/oak-run, 
java.specification.vendor=Sun Microsystems Inc., 
env.TERM_PROGRAM=Apple_Terminal, 
java.library.path=.:/Library/Java/Extensions:/System/Library/Java/Extensions:/usr/lib/java, 
java.vendor.url=http://www.apple.com/, distMgmtSnapshotsName=Apache 
Development Snapshot Repository, java.vm.vendor=Apple Inc., 
gopherProxySet=false, maven.home=/usr/share/maven, 
java.runtime.name=Java(TM) SE Runtime Environment, 
java.class.path=/usr/share/maven/boot/plexus-classworlds-2.4.jar, 
jetty.version=8.1.2.v20120308, java.vm.specification.name=Java Virtual 
Machine Specification, known.issues=, java.vm.specification.version=1.0, 
sun.cpu.endian=little, sun.os.patch.level=unknown, 
env.HOME=/Users/mduerig, 
java.io.tmpdir=/var/folders/oC/oCkNey1sHcGaNn4ZtfEx4E+++TI/-Tmp-/, 
java.vendor.url.bug=http://bugreport.apple.com/, 
distMgmtSnapshotsUrl=https://repository.apache.org/content/repositories/snapshots, 
env.MAVEN_OPTS=-Xmx512M -XX:MaxPermSize=256M, 
env.SSH_AUTH_SOCK=/tmp/launch-jW96ov/Listeners, 
env.COMMAND_MODE=unix2003, mrj.build=10M3065, os.arch=x86_64, 
java.awt.graphicsenv=apple.awt.CGraphicsEnvironment, 
java.ext.dirs=/Library/Java/Extensions:/System/Library/Java/Extensions:/System/Library/Frameworks/JavaVM.framework/Versions/1.6.0/Home/lib/ext, 
mrj.version=1060.1.6.0_20-279, 
user.dir=/Users/mduerig/Checkouts/apache/jackrabbit/oak/trunk/oak-run, 
line.separator=
, java.vm.name=Java HotSpot(TM) 64-Bit Server VM, 
file.encoding=MacRoman, 
env.GPG_AGENT_INFO=/Users/mduerig/.gnupg/S.gpg-agent:94:1, 
java.specification.version=1.6, jackrabbit.version=2.4.0}
[INFO] Using 'UTF-8' encoding to copy filtered resources.
[DEBUG] resource with targetPath null
directory 
/Users/mduerig/Checkouts/apache/jackrabbit/oak/trunk/oak-run/src/test/resources
excludes []
includes []
[INFO] skip non existing resourceDirectory 
/Users/mduerig/Checkouts/apache/jackrabbit/oak/trunk/oak-run/src/test/resources
[DEBUG] resource with targetPath null
directory 
/Users/mduerig/Checkouts/apache/jackrabbit/oak/trunk/oak-run/target/maven-shared-archive-resources
excludes []
includes []
[DEBUG] ignoreDelta true
[INFO] Copying 3 resources
[DEBUG] file DEPENDENCIES has a filtered file extension
[DEBUG] copy 
/Users/mduerig/Checkouts/apache/jackrabbit/oak/trunk/oak-run/target/maven-shared-archive-resources/META-INF/DEPENDENCIES 
to 
/Users/mduerig/Checkouts/apache/jackrabbit/oak/trunk/oak-run/target/test-classes/META-INF/DEPENDENCIES
[DEBUG] file LICENSE has a filtered file extension
[DEBUG] copy 
/Users/mduerig/Checkouts/apache/jackrabbit/oak/trunk/oak-run/target/maven-shared-archive-resources/META-INF/LICENSE 
to 
/Users/mduerig/Checkouts/apache/jackrabbit/oak/trunk/oak-run/target/test-classes/META-INF/LICENSE
[DEBUG] file NOTICE has a filtered file extension
[DEBUG] copy 
/Users/mduerig/Checkouts/apache/jackrabbit/oak/trunk/oak-run/target/maven-shared-archive-resources/META-INF/NOTICE 
to 
/Users/mduerig/Checkouts/apache/jackrabbit/oak/trunk/oak-run/target/test-classes/META-INF/NOTICE
[DEBUG] no use filter components
[INFO]
[INFO] --- maven-compiler-plugin:2.3.2:testCompile (default-testCompile) 
@ oak-run ---
[DEBUG] Configuring mojo 
org.apache.maven.plugins:maven-compiler-plugin:2.3.2:testCompile from 
plugin realm 
ClassRealm[plugin>org.apache.maven.plugins:maven-compiler-plugin:2.3.2, 
parent: sun.misc.Launcher$AppClassLoader@6d6f0472]
[DEBUG] Configuring mojo 
'org.apache.maven.plugins:maven-compiler-plugin:2.3.2:testCompile' with 
basic configurator -->
[DEBUG]   (f) basedir = 
/Users/mduerig/Checkouts/apache/jackrabbit/oak/trunk/oak-run
[DEBUG]   (f) buildDirectory = 
/Users/mduerig/Checkouts/apache/jackrabbit/oak/trunk/oak-run/target
[DEBUG]   (f) classpathElements = 
[/Users/mduerig/Checkouts/apache/jackrabbit/oak/trunk/oak-run/target/test-classes, 
/Users/mduerig/Checkouts/apache/jackrabbit/oak/trunk/oak-run/target/classes, 
/Users/mduerig/.m2/repository/org/apache/jackrabbit/oak-jcr/0.2-SNAPSHOT/oak-jcr-0.2-SNAPSHOT.jar, 
/Users/mduerig/.m2/repository/javax/jcr/jcr/2.0/jcr-2.0.jar, 
/Users/mduerig/.m2/repository/org/apache/jackrabbit/oak-core/0.2-SNAPSHOT/oak-core-0.2-SNAPSHOT.jar, 
/Users/mduerig/.m2/repository/org/apache/jackrabbit/oak-mk/0.2-SNAPSHOT/oak-mk-0.2-SNAPSHOT.jar, 
/Users/mduerig/.m2/repository/org/apache/jackrabbit/jackrabbit-api/2.4.0/jackrabbit-api-2.4.0.jar, 
/Users/mduerig/.m2/repository/org/apache/jackrabbit/jackrabbit-jcr-commons/2.4.0/jackrabbit-jcr-commons-2.4.0.jar, 
/Users/mduerig/.m2/repository/commons-collections/commons-collections/3.2.1/commons-collections-3.2.1.jar, 
/Users/mduerig/.m2/repository/org/slf4j/slf4j-api/1.6.4/slf4j-api-1.6.4.jar, 
/Users/mduerig/.m2/repository/org/slf4j/jcl-over-slf4j/1.6.4/jcl-over-slf4j-1.6.4.jar, 
/Users/mduerig/.m2/repository/org/apache/jackrabbit/jackrabbit-jcr-server/2.4.0/jackrabbit-jcr-server-2.4.0.jar, 
/Users/mduerig/.m2/repository/org/apache/jackrabbit/jackrabbit-spi-commons/2.4.0/jackrabbit-spi-commons-2.4.0.jar, 
/Users/mduerig/.m2/repository/org/apache/jackrabbit/jackrabbit-spi/2.4.0/jackrabbit-spi-2.4.0.jar, 
/Users/mduerig/.m2/repository/commons-io/commons-io/1.4/commons-io-1.4.jar, 
/Users/mduerig/.m2/repository/org/apache/jackrabbit/jackrabbit-webdav/2.4.0/jackrabbit-webdav-2.4.0.jar, 
/Users/mduerig/.m2/repository/commons-httpclient/commons-httpclient/3.0/commons-httpclient-3.0.jar, 
/Users/mduerig/.m2/repository/commons-codec/commons-codec/1.2/commons-codec-1.2.jar, 
/Users/mduerig/.m2/repository/org/apache/tika/tika-core/1.0/tika-core-1.0.jar, 
/Users/mduerig/.m2/repository/commons-fileupload/commons-fileupload/1.2.1/commons-fileupload-1.2.1.jar, 
/Users/mduerig/.m2/repository/org/eclipse/jetty/jetty-servlet/8.1.2.v20120308/jetty-servlet-8.1.2.v20120308.jar, 
/Users/mduerig/.m2/repository/org/eclipse/jetty/jetty-security/8.1.2.v20120308/jetty-security-8.1.2.v20120308.jar, 
/Users/mduerig/.m2/repository/org/eclipse/jetty/jetty-server/8.1.2.v20120308/jetty-server-8.1.2.v20120308.jar, 
/Users/mduerig/.m2/repository/org/eclipse/jetty/orbit/javax.servlet/3.0.0.v201112011016/javax.servlet-3.0.0.v201112011016.jar, 
/Users/mduerig/.m2/repository/org/eclipse/jetty/jetty-continuation/8.1.2.v20120308/jetty-continuation-8.1.2.v20120308.jar, 
/Users/mduerig/.m2/repository/org/eclipse/jetty/jetty-http/8.1.2.v20120308/jetty-http-8.1.2.v20120308.jar, 
/Users/mduerig/.m2/repository/org/eclipse/jetty/jetty-io/8.1.2.v20120308/jetty-io-8.1.2.v20120308.jar, 
/Users/mduerig/.m2/repository/org/eclipse/jetty/jetty-util/8.1.2.v20120308/jetty-util-8.1.2.v20120308.jar, 
/Users/mduerig/.m2/repository/ch/qos/logback/logback-classic/1.0.1/logback-classic-1.0.1.jar, 
/Users/mduerig/.m2/repository/ch/qos/logback/logback-core/1.0.1/logback-core-1.0.1.jar]
[DEBUG]   (f) compileSourceRoots = 
[/Users/mduerig/Checkouts/apache/jackrabbit/oak/trunk/oak-run/src/test/java]
[DEBUG]   (f) compilerId = javac
[DEBUG]   (f) debug = true
[DEBUG]   (f) encoding = UTF-8
[DEBUG]   (f) failOnError = true
[DEBUG]   (f) fork = false
[DEBUG]   (f) generatedTestSourcesDirectory = 
/Users/mduerig/Checkouts/apache/jackrabbit/oak/trunk/oak-run/target/generated-sources/test-annotations
[DEBUG]   (f) optimize = false
[DEBUG]   (f) outputDirectory = 
/Users/mduerig/Checkouts/apache/jackrabbit/oak/trunk/oak-run/target/test-classes
[DEBUG]   (f) outputFileName = oak-run-0.2-SNAPSHOT
[DEBUG]   (f) session = org.apache.maven.execution.MavenSession@254ba9a2
[DEBUG]   (f) showDeprecation = false
[DEBUG]   (f) showWarnings = false
[DEBUG]   (f) source = 1.6
[DEBUG]   (f) staleMillis = 0
[DEBUG]   (f) target = 1.6
[DEBUG]   (f) verbose = false
[DEBUG] -- end configuration --
[DEBUG] Using compiler 'javac'.
[INFO] No sources to compile
[INFO]
[INFO] --- maven-surefire-plugin:2.9:test (default-test) @ oak-run ---
[DEBUG] org.apache.maven.plugins:maven-surefire-plugin:jar:2.9:
[DEBUG]    org.apache.maven:maven-plugin-api:jar:2.0.9:compile
[DEBUG]    org.apache.maven.surefire:surefire-booter:jar:2.9:compile
[DEBUG]       org.apache.maven.surefire:surefire-api:jar:2.9:compile
[DEBUG]    org.apache.maven.surefire:maven-surefire-common:jar:2.9:compile
[DEBUG] 
org.apache.maven.shared:maven-common-artifact-filters:jar:1.3:compile
[DEBUG]    org.codehaus.plexus:plexus-utils:jar:2.1:compile
[DEBUG]    org.apache.maven:maven-artifact:jar:2.0.9:compile
[DEBUG]    org.apache.maven:maven-project:jar:2.0.9:compile
[DEBUG]       org.apache.maven:maven-settings:jar:2.0.9:compile
[DEBUG]       org.apache.maven:maven-profile:jar:2.0.9:compile
[DEBUG]       org.apache.maven:maven-model:jar:2.0.9:compile
[DEBUG]       org.apache.maven:maven-artifact-manager:jar:2.0.9:compile
[DEBUG]       org.apache.maven:maven-plugin-registry:jar:2.0.9:compile
[DEBUG] 
org.codehaus.plexus:plexus-container-default:jar:1.0-alpha-9-stable-1:compile
[DEBUG]          junit:junit:jar:3.8.1:test (scope managed from compile)
[DEBUG]    org.apache.maven:maven-core:jar:2.0.9:compile
[DEBUG] 
org.apache.maven:maven-plugin-parameter-documenter:jar:2.0.9:compile
[DEBUG] 
org.apache.maven.reporting:maven-reporting-api:jar:2.0.9:compile
[DEBUG]       org.apache.maven:maven-repository-metadata:jar:2.0.9:compile
[DEBUG]       org.apache.maven:maven-error-diagnostics:jar:2.0.9:compile
[DEBUG]       org.apache.maven:maven-plugin-descriptor:jar:2.0.9:compile
[DEBUG]       org.apache.maven:maven-monitor:jar:2.0.9:compile
[DEBUG]       classworlds:classworlds:jar:1.1:compile
[DEBUG]    org.apache.maven:maven-toolchain:jar:2.0.9:compile
[DEBUG] Created new class realm 
plugin>org.apache.maven.plugins:maven-surefire-plugin:2.9
[DEBUG] Importing foreign packages into class realm 
plugin>org.apache.maven.plugins:maven-surefire-plugin:2.9
[DEBUG]   Imported:  < maven.api
[DEBUG] Populating class realm 
plugin>org.apache.maven.plugins:maven-surefire-plugin:2.9
[DEBUG]   Included: org.apache.maven.plugins:maven-surefire-plugin:jar:2.9
[DEBUG]   Included: org.apache.maven.surefire:surefire-booter:jar:2.9
[DEBUG]   Included: org.apache.maven.surefire:surefire-api:jar:2.9
[DEBUG]   Included: org.apache.maven.surefire:maven-surefire-common:jar:2.9
[DEBUG]   Included: 
org.apache.maven.shared:maven-common-artifact-filters:jar:1.3
[DEBUG]   Included: org.codehaus.plexus:plexus-utils:jar:2.1
[DEBUG]   Included: org.apache.maven.reporting:maven-reporting-api:jar:2.0.9
[DEBUG]   Excluded: org.apache.maven:maven-plugin-api:jar:2.0.9
[DEBUG]   Excluded: org.apache.maven:maven-artifact:jar:2.0.9
[DEBUG]   Excluded: org.apache.maven:maven-project:jar:2.0.9
[DEBUG]   Excluded: org.apache.maven:maven-settings:jar:2.0.9
[DEBUG]   Excluded: org.apache.maven:maven-profile:jar:2.0.9
[DEBUG]   Excluded: org.apache.maven:maven-model:jar:2.0.9
[DEBUG]   Excluded: org.apache.maven:maven-artifact-manager:jar:2.0.9
[DEBUG]   Excluded: org.apache.maven:maven-plugin-registry:jar:2.0.9
[DEBUG]   Excluded: 
org.codehaus.plexus:plexus-container-default:jar:1.0-alpha-9-stable-1
[DEBUG]   Excluded: junit:junit:jar:3.8.1
[DEBUG]   Excluded: org.apache.maven:maven-core:jar:2.0.9
[DEBUG]   Excluded: 
org.apache.maven:maven-plugin-parameter-documenter:jar:2.0.9
[DEBUG]   Excluded: org.apache.maven:maven-repository-metadata:jar:2.0.9
[DEBUG]   Excluded: org.apache.maven:maven-error-diagnostics:jar:2.0.9
[DEBUG]   Excluded: org.apache.maven:maven-plugin-descriptor:jar:2.0.9
[DEBUG]   Excluded: org.apache.maven:maven-monitor:jar:2.0.9
[DEBUG]   Excluded: classworlds:classworlds:jar:1.1
[DEBUG]   Excluded: org.apache.maven:maven-toolchain:jar:2.0.9
[DEBUG] Configuring mojo 
org.apache.maven.plugins:maven-surefire-plugin:2.9:test from plugin 
realm 
ClassRealm[plugin>org.apache.maven.plugins:maven-surefire-plugin:2.9, 
parent: sun.misc.Launcher$AppClassLoader@6d6f0472]
[DEBUG] Configuring mojo 
'org.apache.maven.plugins:maven-surefire-plugin:2.9:test' with basic 
configurator -->
[DEBUG]   (s) basedir = 
/Users/mduerig/Checkouts/apache/jackrabbit/oak/trunk/oak-run
[DEBUG]   (s) childDelegation = false
[DEBUG]   (s) classesDirectory = 
/Users/mduerig/Checkouts/apache/jackrabbit/oak/trunk/oak-run/target/classes
[DEBUG]   (s) disableXmlReport = false
[DEBUG]   (s) enableAssertions = true
[DEBUG]   (s) forkMode = once
[DEBUG]   (s) junitArtifactName = junit:junit
[DEBUG]   (s) localRepository =        id: local
       url: file:///Users/mduerig/.m2/repository/
    layout: none

[DEBUG]   (f) parallelMavenExecution = false
[DEBUG]   (s) perCoreThreadCount = true
[DEBUG]   (s) pluginArtifactMap = 
{org.apache.maven.plugins:maven-surefire-plugin=org.apache.maven.plugins:maven-surefire-plugin:maven-plugin:2.9:, 
org.apache.maven.surefire:surefire-booter=org.apache.maven.surefire:surefire-booter:jar:2.9:compile, 
org.apache.maven.surefire:surefire-api=org.apache.maven.surefire:surefire-api:jar:2.9:compile, 
org.apache.maven.surefire:maven-surefire-common=org.apache.maven.surefire:maven-surefire-common:jar:2.9:compile, 
org.apache.maven.shared:maven-common-artifact-filters=org.apache.maven.shared:maven-common-artifact-filters:jar:1.3:compile, 
org.codehaus.plexus:plexus-utils=org.codehaus.plexus:plexus-utils:jar:2.1:compile, 
org.apache.maven.reporting:maven-reporting-api=org.apache.maven.reporting:maven-reporting-api:jar:2.0.9:compile}
[DEBUG]   (s) printSummary = true
[DEBUG]   (s) project = MavenProject: 
org.apache.jackrabbit:oak-run:0.2-SNAPSHOT @ 
/Users/mduerig/Checkouts/apache/jackrabbit/oak/trunk/oak-run/pom.xml
[DEBUG]   (s) projectArtifactMap = 
{org.apache.jackrabbit:oak-jcr=org.apache.jackrabbit:oak-jcr:jar:0.2-SNAPSHOT:compile, 
javax.jcr:jcr=javax.jcr:jcr:jar:2.0:compile, 
org.apache.jackrabbit:oak-core=org.apache.jackrabbit:oak-core:jar:0.2-SNAPSHOT:compile, 
org.apache.jackrabbit:oak-mk=org.apache.jackrabbit:oak-mk:jar:0.2-SNAPSHOT:compile, 
org.apache.jackrabbit:jackrabbit-api=org.apache.jackrabbit:jackrabbit-api:jar:2.4.0:compile, 
org.apache.jackrabbit:jackrabbit-jcr-commons=org.apache.jackrabbit:jackrabbit-jcr-commons:jar:2.4.0:compile, 
commons-collections:commons-collections=commons-collections:commons-collections:jar:3.2.1:compile, 
org.slf4j:slf4j-api=org.slf4j:slf4j-api:jar:1.6.4:compile, 
org.slf4j:jcl-over-slf4j=org.slf4j:jcl-over-slf4j:jar:1.6.4:compile, 
org.apache.jackrabbit:jackrabbit-jcr-server=org.apache.jackrabbit:jackrabbit-jcr-server:jar:2.4.0:compile, 
org.apache.jackrabbit:jackrabbit-spi-commons=org.apache.jackrabbit:jackrabbit-spi-commons:jar:2.4.0:compile, 
org.apache.jackrabbit:jackrabbit-spi=org.apache.jackrabbit:jackrabbit-spi:jar:2.4.0:compile, 
commons-io:commons-io=commons-io:commons-io:jar:1.4:compile, 
org.apache.jackrabbit:jackrabbit-webdav=org.apache.jackrabbit:jackrabbit-webdav:jar:2.4.0:compile, 
commons-httpclient:commons-httpclient=commons-httpclient:commons-httpclient:jar:3.0:compile, 
commons-codec:commons-codec=commons-codec:commons-codec:jar:1.2:compile, 
org.apache.tika:tika-core=org.apache.tika:tika-core:jar:1.0:compile, 
commons-fileupload:commons-fileupload=commons-fileupload:commons-fileupload:jar:1.2.1:compile, 
org.eclipse.jetty:jetty-servlet=org.eclipse.jetty:jetty-servlet:jar:8.1.2.v20120308:compile, 
org.eclipse.jetty:jetty-security=org.eclipse.jetty:jetty-security:jar:8.1.2.v20120308:compile, 
org.eclipse.jetty:jetty-server=org.eclipse.jetty:jetty-server:jar:8.1.2.v20120308:compile, 
org.eclipse.jetty.orbit:javax.servlet=org.eclipse.jetty.orbit:javax.servlet:jar:3.0.0.v201112011016:compile, 
org.eclipse.jetty:jetty-continuation=org.eclipse.jetty:jetty-continuation:jar:8.1.2.v20120308:compile, 
org.eclipse.jetty:jetty-http=org.eclipse.jetty:jetty-http:jar:8.1.2.v20120308:compile, 
org.eclipse.jetty:jetty-io=org.eclipse.jetty:jetty-io:jar:8.1.2.v20120308:compile, 
org.eclipse.jetty:jetty-util=org.eclipse.jetty:jetty-util:jar:8.1.2.v20120308:compile, 
ch.qos.logback:logback-classic=ch.qos.logback:logback-classic:jar:1.0.1:compile, 
ch.qos.logback:logback-core=ch.qos.logback:logback-core:jar:1.0.1:compile}
[DEBUG]   (s) redirectTestOutputToFile = false
[DEBUG]   (s) remoteRepositories = [       id: day-central-plugin
       url: http://repo.dev.day.com/central
    layout: default
snapshots: [enabled => true, update => daily]
  releases: [enabled => true, update => daily]
,        id: maven-central-plugin
       url: http://repo1.maven.org/maven2
    layout: default
snapshots: [enabled => true, update => daily]
  releases: [enabled => true, update => daily]
,        id: central
       url: http://repo1.maven.org/maven2
    layout: default
snapshots: [enabled => false, update => daily]
  releases: [enabled => true, update => never]
]
[DEBUG]   (s) reportFormat = brief
[DEBUG]   (s) reportsDirectory = 
/Users/mduerig/Checkouts/apache/jackrabbit/oak/trunk/oak-run/target/surefire-reports
[DEBUG]   (s) runOrder = filesystem
[DEBUG]   (s) session = org.apache.maven.execution.MavenSession@254ba9a2
[DEBUG]   (s) skip = false
[DEBUG]   (s) skipTests = false
[DEBUG]   (s) testClassesDirectory = 
/Users/mduerig/Checkouts/apache/jackrabbit/oak/trunk/oak-run/target/test-classes
[DEBUG]   (s) testFailureIgnore = false
[DEBUG]   (s) testNGArtifactName = org.testng:testng
[DEBUG]   (s) testSourceDirectory = 
/Users/mduerig/Checkouts/apache/jackrabbit/oak/trunk/oak-run/src/test/java
[DEBUG]   (s) trimStackTrace = true
[DEBUG]   (s) useFile = true
[DEBUG]   (s) useManifestOnlyJar = true
[DEBUG]   (s) useSystemClassLoader = true
[DEBUG]   (s) useUnlimitedThreads = false
[DEBUG]   (s) workingDirectory = 
/Users/mduerig/Checkouts/apache/jackrabbit/oak/trunk/oak-run
[DEBUG] -- end configuration --
[INFO] Surefire report directory: 
/Users/mduerig/Checkouts/apache/jackrabbit/oak/trunk/oak-run/target/surefire-reports
[DEBUG] dummy:dummy:jar:1.0 (selected for null)
[DEBUG]   org.apache.maven.surefire:surefire-booter:jar:2.9:compile 
(selected for compile)
[DEBUG]     org.apache.maven.surefire:surefire-api:jar:2.9:compile 
(selected for compile)
[DEBUG] Adding to surefire booter test classpath: 
/Users/mduerig/.m2/repository/org/apache/maven/surefire/surefire-booter/2.9/surefire-booter-2.9.jar 
Scope: compile
[DEBUG] Adding to surefire booter test classpath: 
/Users/mduerig/.m2/repository/org/apache/maven/surefire/surefire-api/2.9/surefire-api-2.9.jar 
Scope: compile
[DEBUG] Setting system property 
[user.dir]=[/Users/mduerig/Checkouts/apache/jackrabbit/oak/trunk/oak-run]
[DEBUG] Setting system property 
[localRepository]=[/Users/mduerig/.m2/repository]
[DEBUG] Setting system property 
[basedir]=[/Users/mduerig/Checkouts/apache/jackrabbit/oak/trunk/oak-run]
[DEBUG] Using JVM: 
/System/Library/Frameworks/JavaVM.framework/Versions/1.6.0/Home/bin/java
[DEBUG] dummy:dummy:jar:1.0 (selected for null)
[DEBUG]   org.apache.maven.surefire:surefire-junit3:jar:2.9:test 
(selected for test)
[DEBUG]     org.apache.maven.surefire:surefire-api:jar:2.9:test 
(selected for test)
[DEBUG] Adding to surefire test classpath: 
/Users/mduerig/.m2/repository/org/apache/maven/surefire/surefire-junit3/2.9/surefire-junit3-2.9.jar 
Scope: test
[DEBUG] Adding to surefire test classpath: 
/Users/mduerig/.m2/repository/org/apache/maven/surefire/surefire-api/2.9/surefire-api-2.9.jar 
Scope: test
[DEBUG] test classpath classpath:
[DEBUG] 
/Users/mduerig/Checkouts/apache/jackrabbit/oak/trunk/oak-run/target/test-classes
[DEBUG] 
/Users/mduerig/Checkouts/apache/jackrabbit/oak/trunk/oak-run/target/classes
[DEBUG] 
/Users/mduerig/.m2/repository/org/apache/jackrabbit/oak-jcr/0.2-SNAPSHOT/oak-jcr-0.2-SNAPSHOT.jar
[DEBUG]   /Users/mduerig/.m2/repository/javax/jcr/jcr/2.0/jcr-2.0.jar
[DEBUG] 
/Users/mduerig/.m2/repository/org/apache/jackrabbit/oak-core/0.2-SNAPSHOT/oak-core-0.2-SNAPSHOT.jar
[DEBUG] 
/Users/mduerig/.m2/repository/org/apache/jackrabbit/oak-mk/0.2-SNAPSHOT/oak-mk-0.2-SNAPSHOT.jar
[DEBUG] 
/Users/mduerig/.m2/repository/org/apache/jackrabbit/jackrabbit-api/2.4.0/jackrabbit-api-2.4.0.jar
[DEBUG] 
/Users/mduerig/.m2/repository/org/apache/jackrabbit/jackrabbit-jcr-commons/2.4.0/jackrabbit-jcr-commons-2.4.0.jar
[DEBUG] 
/Users/mduerig/.m2/repository/commons-collections/commons-collections/3.2.1/commons-collections-3.2.1.jar
[DEBUG] 
/Users/mduerig/.m2/repository/org/slf4j/slf4j-api/1.6.4/slf4j-api-1.6.4.jar
[DEBUG] 
/Users/mduerig/.m2/repository/org/slf4j/jcl-over-slf4j/1.6.4/jcl-over-slf4j-1.6.4.jar
[DEBUG] 
/Users/mduerig/.m2/repository/org/apache/jackrabbit/jackrabbit-jcr-server/2.4.0/jackrabbit-jcr-server-2.4.0.jar
[DEBUG] 
/Users/mduerig/.m2/repository/org/apache/jackrabbit/jackrabbit-spi-commons/2.4.0/jackrabbit-spi-commons-2.4.0.jar
[DEBUG] 
/Users/mduerig/.m2/repository/org/apache/jackrabbit/jackrabbit-spi/2.4.0/jackrabbit-spi-2.4.0.jar
[DEBUG] 
/Users/mduerig/.m2/repository/commons-io/commons-io/1.4/commons-io-1.4.jar
[DEBUG] 
/Users/mduerig/.m2/repository/org/apache/jackrabbit/jackrabbit-webdav/2.4.0/jackrabbit-webdav-2.4.0.jar
[DEBUG] 
/Users/mduerig/.m2/repository/commons-httpclient/commons-httpclient/3.0/commons-httpclient-3.0.jar
[DEBUG] 
/Users/mduerig/.m2/repository/commons-codec/commons-codec/1.2/commons-codec-1.2.jar
[DEBUG] 
/Users/mduerig/.m2/repository/org/apache/tika/tika-core/1.0/tika-core-1.0.jar
[DEBUG] 
/Users/mduerig/.m2/repository/commons-fileupload/commons-fileupload/1.2.1/commons-fileupload-1.2.1.jar
[DEBUG] 
/Users/mduerig/.m2/repository/org/eclipse/jetty/jetty-servlet/8.1.2.v20120308/jetty-servlet-8.1.2.v20120308.jar
[DEBUG] 
/Users/mduerig/.m2/repository/org/eclipse/jetty/jetty-security/8.1.2.v20120308/jetty-security-8.1.2.v20120308.jar
[DEBUG] 
/Users/mduerig/.m2/repository/org/eclipse/jetty/jetty-server/8.1.2.v20120308/jetty-server-8.1.2.v20120308.jar
[DEBUG] 
/Users/mduerig/.m2/repository/org/eclipse/jetty/orbit/javax.servlet/3.0.0.v201112011016/javax.servlet-3.0.0.v201112011016.jar
[DEBUG] 
/Users/mduerig/.m2/repository/org/eclipse/jetty/jetty-continuation/8.1.2.v20120308/jetty-continuation-8.1.2.v20120308.jar
[DEBUG] 
/Users/mduerig/.m2/repository/org/eclipse/jetty/jetty-http/8.1.2.v20120308/jetty-http-8.1.2.v20120308.jar
[DEBUG] 
/Users/mduerig/.m2/repository/org/eclipse/jetty/jetty-io/8.1.2.v20120308/jetty-io-8.1.2.v20120308.jar
[DEBUG] 
/Users/mduerig/.m2/repository/org/eclipse/jetty/jetty-util/8.1.2.v20120308/jetty-util-8.1.2.v20120308.jar
[DEBUG] 
/Users/mduerig/.m2/repository/ch/qos/logback/logback-classic/1.0.1/logback-classic-1.0.1.jar
[DEBUG] 
/Users/mduerig/.m2/repository/ch/qos/logback/logback-core/1.0.1/logback-core-1.0.1.jar
[DEBUG] provider classpath classpath:
[DEBUG] 
/Users/mduerig/.m2/repository/org/apache/maven/surefire/surefire-junit3/2.9/surefire-junit3-2.9.jar
[DEBUG] 
/Users/mduerig/.m2/repository/org/apache/maven/surefire/surefire-api/2.9/surefire-api-2.9.jar

-------------------------------------------------------
  T E S T S
-------------------------------------------------------
Forking command line: /bin/sh -c cd 
/Users/mduerig/Checkouts/apache/jackrabbit/oak/trunk/oak-run && 
/System/Library/Frameworks/JavaVM.framework/Versions/1.6.0/Home/bin/java 
-jar 
/Users/mduerig/Checkouts/apache/jackrabbit/oak/trunk/oak-run/target/surefire/surefirebooter995285700337999447.jar 
/Users/mduerig/Checkouts/apache/jackrabbit/oak/trunk/oak-run/target/surefire/surefire8010193413709301410tmp 
/Users/mduerig/Checkouts/apache/jackrabbit/oak/trunk/oak-run/target/surefire/surefire7200624455342361329tmp

Results :

Tests run: 0, Failures: 0, Errors: 0, Skipped: 0

[INFO]
[INFO] --- maven-jar-plugin:2.3.1:jar (default-jar) @ oak-run ---
[DEBUG] org.apache.maven.plugins:maven-jar-plugin:jar:2.3.1:
[DEBUG]    org.apache.maven:maven-plugin-api:jar:2.0.6:compile
[DEBUG]    org.apache.maven:maven-project:jar:2.0.6:compile
[DEBUG]       org.apache.maven:maven-settings:jar:2.0.6:compile
[DEBUG]       org.apache.maven:maven-profile:jar:2.0.6:compile
[DEBUG]       org.apache.maven:maven-artifact-manager:jar:2.0.6:compile
[DEBUG] 
org.apache.maven:maven-repository-metadata:jar:2.0.6:compile
[DEBUG]       org.apache.maven:maven-plugin-registry:jar:2.0.6:compile
[DEBUG] 
org.codehaus.plexus:plexus-container-default:jar:1.0-alpha-9-stable-1:compile
[DEBUG]          junit:junit:jar:3.8.1:compile
[DEBUG]          classworlds:classworlds:jar:1.1-alpha-2:compile
[DEBUG]    org.apache.maven:maven-model:jar:2.0.6:runtime
[DEBUG]    org.apache.maven:maven-artifact:jar:2.0.6:compile
[DEBUG]    org.apache.maven:maven-archiver:jar:2.4.1:compile
[DEBUG]       org.codehaus.plexus:plexus-interpolation:jar:1.13:compile
[DEBUG]    org.codehaus.plexus:plexus-archiver:jar:1.0:compile
[DEBUG]       org.codehaus.plexus:plexus-io:jar:1.0:compile
[DEBUG]    commons-lang:commons-lang:jar:2.1:compile
[DEBUG]    org.codehaus.plexus:plexus-utils:jar:2.0.5:compile
[DEBUG] Created new class realm 
plugin>org.apache.maven.plugins:maven-jar-plugin:2.3.1
[DEBUG] Importing foreign packages into class realm 
plugin>org.apache.maven.plugins:maven-jar-plugin:2.3.1
[DEBUG]   Imported:  < maven.api
[DEBUG] Populating class realm 
plugin>org.apache.maven.plugins:maven-jar-plugin:2.3.1
[DEBUG]   Included: org.apache.maven.plugins:maven-jar-plugin:jar:2.3.1
[DEBUG]   Included: junit:junit:jar:3.8.1
[DEBUG]   Included: org.apache.maven:maven-archiver:jar:2.4.1
[DEBUG]   Included: org.codehaus.plexus:plexus-interpolation:jar:1.13
[DEBUG]   Included: org.codehaus.plexus:plexus-archiver:jar:1.0
[DEBUG]   Included: org.codehaus.plexus:plexus-io:jar:1.0
[DEBUG]   Included: commons-lang:commons-lang:jar:2.1
[DEBUG]   Included: org.codehaus.plexus:plexus-utils:jar:2.0.5
[DEBUG]   Excluded: org.apache.maven:maven-plugin-api:jar:2.0.6
[DEBUG]   Excluded: org.apache.maven:maven-project:jar:2.0.6
[DEBUG]   Excluded: org.apache.maven:maven-settings:jar:2.0.6
[DEBUG]   Excluded: org.apache.maven:maven-profile:jar:2.0.6
[DEBUG]   Excluded: org.apache.maven:maven-artifact-manager:jar:2.0.6
[DEBUG]   Excluded: org.apache.maven:maven-repository-metadata:jar:2.0.6
[DEBUG]   Excluded: org.apache.maven:maven-plugin-registry:jar:2.0.6
[DEBUG]   Excluded: 
org.codehaus.plexus:plexus-container-default:jar:1.0-alpha-9-stable-1
[DEBUG]   Excluded: classworlds:classworlds:jar:1.1-alpha-2
[DEBUG]   Excluded: org.apache.maven:maven-model:jar:2.0.6
[DEBUG]   Excluded: org.apache.maven:maven-artifact:jar:2.0.6
[DEBUG] Configuring mojo 
org.apache.maven.plugins:maven-jar-plugin:2.3.1:jar from plugin realm 
ClassRealm[plugin>org.apache.maven.plugins:maven-jar-plugin:2.3.1, 
parent: sun.misc.Launcher$AppClassLoader@6d6f0472]
[DEBUG] Configuring mojo 
'org.apache.maven.plugins:maven-jar-plugin:2.3.1:jar' with basic 
configurator -->
[DEBUG]   (s) addDefaultSpecificationEntries = true
[DEBUG]   (s) addDefaultImplementationEntries = true
[DEBUG]   (s) manifest = 
org.apache.maven.archiver.ManifestConfiguration@5d283826
[DEBUG]   (f) archive = 
org.apache.maven.archiver.MavenArchiveConfiguration@7b7e7691
[DEBUG]   (f) classesDirectory = 
/Users/mduerig/Checkouts/apache/jackrabbit/oak/trunk/oak-run/target/classes
[DEBUG]   (f) defaultManifestFile = 
/Users/mduerig/Checkouts/apache/jackrabbit/oak/trunk/oak-run/target/classes/META-INF/MANIFEST.MF
[DEBUG]   (f) finalName = oak-run-0.2-SNAPSHOT
[DEBUG]   (f) forceCreation = false
[DEBUG]   (f) outputDirectory = 
/Users/mduerig/Checkouts/apache/jackrabbit/oak/trunk/oak-run/target
[DEBUG]   (f) project = MavenProject: 
org.apache.jackrabbit:oak-run:0.2-SNAPSHOT @ 
/Users/mduerig/Checkouts/apache/jackrabbit/oak/trunk/oak-run/pom.xml
[DEBUG]   (f) useDefaultManifestFile = false
[DEBUG] -- end configuration --
[DEBUG] isUp2date: false (Destination 
/Users/mduerig/Checkouts/apache/jackrabbit/oak/trunk/oak-run/target/oak-run-0.2-SNAPSHOT.jar 
not found.)
[INFO] Building jar: 
/Users/mduerig/Checkouts/apache/jackrabbit/oak/trunk/oak-run/target/oak-run-0.2-SNAPSHOT.jar
[DEBUG] adding directory META-INF/
[DEBUG] adding entry META-INF/MANIFEST.MF
[DEBUG] adding directory org/
[DEBUG] adding directory org/apache/
[DEBUG] adding directory org/apache/jackrabbit/
[DEBUG] adding directory org/apache/jackrabbit/oak/
[DEBUG] adding directory org/apache/jackrabbit/oak/run/
[DEBUG] adding entry META-INF/DEPENDENCIES
[DEBUG] adding entry META-INF/LICENSE
[DEBUG] adding entry META-INF/NOTICE
[DEBUG] adding entry org/apache/jackrabbit/oak/run/Main$1.class
[DEBUG] adding entry org/apache/jackrabbit/oak/run/Main.class
[DEBUG] adding directory META-INF/maven/
[DEBUG] adding directory META-INF/maven/org.apache.jackrabbit/
[DEBUG] adding directory META-INF/maven/org.apache.jackrabbit/oak-run/
[DEBUG] adding entry META-INF/maven/org.apache.jackrabbit/oak-run/pom.xml
[DEBUG] adding entry 
META-INF/maven/org.apache.jackrabbit/oak-run/pom.properties
[INFO]
[INFO] --- maven-site-plugin:3.0:attach-descriptor (attach-descriptor) @ 
oak-run ---
[DEBUG] org.apache.maven.plugins:maven-site-plugin:jar:3.0:
[DEBUG]    org.apache.maven.wagon:wagon-ssh:jar:1.0:runtime
[DEBUG]       com.jcraft:jsch:jar:0.1.44-1:runtime
[DEBUG]       org.apache.maven.wagon:wagon-ssh-common:jar:1.0:runtime
[DEBUG] 
org.codehaus.plexus:plexus-interactivity-api:jar:1.0-alpha-6:runtime
[DEBUG]    org.apache.maven.reporting:maven-reporting-exec:jar:1.0.1:compile
[DEBUG]       org.apache.maven.reporting:maven-reporting-api:jar:3.0:compile
[DEBUG]       org.apache.maven:maven-artifact:jar:3.0:compile
[DEBUG]       org.apache.velocity:velocity:jar:1.5:compile
[DEBUG]          oro:oro:jar:2.0.8:compile
[DEBUG]       velocity:velocity:jar:1.5:compile
[DEBUG]    org.apache.maven:maven-core:jar:3.0:compile
[DEBUG]       org.apache.maven:maven-repository-metadata:jar:3.0:compile
[DEBUG]       org.apache.maven:maven-model-builder:jar:3.0:compile
[DEBUG]       org.apache.maven:maven-aether-provider:jar:3.0:runtime
[DEBUG]       org.sonatype.aether:aether-impl:jar:1.7:compile
[DEBUG]          org.sonatype.aether:aether-spi:jar:1.7:compile
[DEBUG]       org.sonatype.aether:aether-api:jar:1.7:compile
[DEBUG]       org.sonatype.aether:aether-util:jar:1.7:compile
[DEBUG]       org.sonatype.sisu:sisu-inject-plexus:jar:1.4.2:compile
[DEBUG]          org.sonatype.sisu:sisu-inject-bean:jar:1.4.2:compile
[DEBUG]             org.sonatype.sisu:sisu-guice:jar:noaop:2.1.7:compile
[DEBUG]       org.codehaus.plexus:plexus-interpolation:jar:1.14:compile
[DEBUG]       org.codehaus.plexus:plexus-classworlds:jar:2.2.3:compile
[DEBUG] 
org.codehaus.plexus:plexus-component-annotations:jar:1.5.5:compile
[DEBUG]       org.sonatype.plexus:plexus-sec-dispatcher:jar:1.3:compile
[DEBUG]          org.sonatype.plexus:plexus-cipher:jar:1.4:compile
[DEBUG]    org.apache.maven:maven-model:jar:3.0:compile
[DEBUG]    org.apache.maven:maven-plugin-api:jar:3.0:compile
[DEBUG]    org.apache.maven:maven-settings:jar:3.0:compile
[DEBUG]    org.apache.maven:maven-settings-builder:jar:3.0:compile
[DEBUG]    org.apache.maven.doxia:doxia-sink-api:jar:1.2:compile
[DEBUG]    org.apache.maven.doxia:doxia-logging-api:jar:1.2:compile
[DEBUG] 
org.codehaus.plexus:plexus-container-default:jar:1.0-alpha-30:compile
[DEBUG]          junit:junit:jar:3.8.1:compile
[DEBUG]    org.apache.maven.doxia:doxia-core:jar:1.2:compile
[DEBUG]       xerces:xercesImpl:jar:2.9.1:compile
[DEBUG]          xml-apis:xml-apis:jar:1.3.04:compile
[DEBUG]       org.apache.httpcomponents:httpclient:jar:4.0.2:compile
[DEBUG]          org.apache.httpcomponents:httpcore:jar:4.0.1:compile
[DEBUG]          commons-codec:commons-codec:jar:1.3:compile
[DEBUG]    org.apache.maven.doxia:doxia-module-xhtml:jar:1.2:compile
[DEBUG]    org.apache.maven.doxia:doxia-module-apt:jar:1.2:runtime
[DEBUG]    org.apache.maven.doxia:doxia-module-xdoc:jar:1.2:compile
[DEBUG]    org.apache.maven.doxia:doxia-module-fml:jar:1.2:runtime
[DEBUG]    javax.servlet:servlet-api:jar:2.5:compile
[DEBUG]    org.apache.maven.doxia:doxia-decoration-model:jar:1.2:compile
[DEBUG]    org.apache.maven.doxia:doxia-site-renderer:jar:1.2:compile
[DEBUG]       commons-collections:commons-collections:jar:3.2.1:compile
[DEBUG]    org.apache.maven.shared:maven-doxia-tools:jar:1.4:compile
[DEBUG]    org.apache.maven.wagon:wagon-provider-api:jar:1.0:compile
[DEBUG]    org.codehaus.plexus:plexus-archiver:jar:1.0:compile
[DEBUG]       org.codehaus.plexus:plexus-io:jar:1.0:compile
[DEBUG]    org.codehaus.plexus:plexus-i18n:jar:1.0-beta-7:compile
[DEBUG]    org.codehaus.plexus:plexus-velocity:jar:1.1.8:compile
[DEBUG]    org.codehaus.plexus:plexus-utils:jar:1.5.10:compile
[DEBUG]    org.mortbay.jetty:jetty:jar:6.1.25:compile
[DEBUG]       org.mortbay.jetty:servlet-api:jar:2.5-20081211:compile
[DEBUG]    org.mortbay.jetty:jetty-util:jar:6.1.25:compile
[DEBUG]    commons-lang:commons-lang:jar:2.5:compile
[DEBUG]    commons-io:commons-io:jar:1.4:compile
[DEBUG] Created new class realm 
plugin>org.apache.maven.plugins:maven-site-plugin:3.0
[DEBUG] Importing foreign packages into class realm 
plugin>org.apache.maven.plugins:maven-site-plugin:3.0
[DEBUG]   Imported:  < maven.api
[DEBUG] Populating class realm 
plugin>org.apache.maven.plugins:maven-site-plugin:3.0
[DEBUG]   Included: org.apache.maven.plugins:maven-site-plugin:jar:3.0
[DEBUG]   Included: org.apache.maven.wagon:wagon-ssh:jar:1.0
[DEBUG]   Included: com.jcraft:jsch:jar:0.1.44-1
[DEBUG]   Included: org.apache.maven.wagon:wagon-ssh-common:jar:1.0
[DEBUG]   Included: 
org.codehaus.plexus:plexus-interactivity-api:jar:1.0-alpha-6
[DEBUG]   Included: 
org.apache.maven.reporting:maven-reporting-exec:jar:1.0.1
[DEBUG]   Included: org.apache.maven.reporting:maven-reporting-api:jar:3.0
[DEBUG]   Included: org.apache.velocity:velocity:jar:1.5
[DEBUG]   Included: oro:oro:jar:2.0.8
[DEBUG]   Included: velocity:velocity:jar:1.5
[DEBUG]   Included: org.sonatype.aether:aether-util:jar:1.7
[DEBUG]   Included: org.sonatype.sisu:sisu-inject-bean:jar:1.4.2
[DEBUG]   Included: org.sonatype.sisu:sisu-guice:jar:noaop:2.1.7
[DEBUG]   Included: org.codehaus.plexus:plexus-interpolation:jar:1.14
[DEBUG]   Included: 
org.codehaus.plexus:plexus-component-annotations:jar:1.5.5
[DEBUG]   Included: org.sonatype.plexus:plexus-sec-dispatcher:jar:1.3
[DEBUG]   Included: org.sonatype.plexus:plexus-cipher:jar:1.4
[DEBUG]   Included: org.apache.maven.doxia:doxia-sink-api:jar:1.2
[DEBUG]   Included: org.apache.maven.doxia:doxia-logging-api:jar:1.2
[DEBUG]   Included: junit:junit:jar:3.8.1
[DEBUG]   Included: org.apache.maven.doxia:doxia-core:jar:1.2
[DEBUG]   Included: xerces:xercesImpl:jar:2.9.1
[DEBUG]   Included: xml-apis:xml-apis:jar:1.3.04
[DEBUG]   Included: org.apache.httpcomponents:httpclient:jar:4.0.2
[DEBUG]   Included: org.apache.httpcomponents:httpcore:jar:4.0.1
[DEBUG]   Included: commons-codec:commons-codec:jar:1.3
[DEBUG]   Included: org.apache.maven.doxia:doxia-module-xhtml:jar:1.2
[DEBUG]   Included: org.apache.maven.doxia:doxia-module-apt:jar:1.2
[DEBUG]   Included: org.apache.maven.doxia:doxia-module-xdoc:jar:1.2
[DEBUG]   Included: org.apache.maven.doxia:doxia-module-fml:jar:1.2
[DEBUG]   Included: javax.servlet:servlet-api:jar:2.5
[DEBUG]   Included: org.apache.maven.doxia:doxia-decoration-model:jar:1.2
[DEBUG]   Included: org.apache.maven.doxia:doxia-site-renderer:jar:1.2
[DEBUG]   Included: commons-collections:commons-collections:jar:3.2.1
[DEBUG]   Included: org.apache.maven.shared:maven-doxia-tools:jar:1.4
[DEBUG]   Included: org.codehaus.plexus:plexus-archiver:jar:1.0
[DEBUG]   Included: org.codehaus.plexus:plexus-io:jar:1.0
[DEBUG]   Included: org.codehaus.plexus:plexus-i18n:jar:1.0-beta-7
[DEBUG]   Included: org.codehaus.plexus:plexus-velocity:jar:1.1.8
[DEBUG]   Included: org.codehaus.plexus:plexus-utils:jar:1.5.10
[DEBUG]   Included: org.mortbay.jetty:jetty:jar:6.1.25
[DEBUG]   Included: org.mortbay.jetty:servlet-api:jar:2.5-20081211
[DEBUG]   Included: org.mortbay.jetty:jetty-util:jar:6.1.25
[DEBUG]   Included: commons-lang:commons-lang:jar:2.5
[DEBUG]   Included: commons-io:commons-io:jar:1.4
[DEBUG]   Excluded: org.apache.maven:maven-artifact:jar:3.0
[DEBUG]   Excluded: org.apache.maven:maven-core:jar:3.0
[DEBUG]   Excluded: org.apache.maven:maven-repository-metadata:jar:3.0
[DEBUG]   Excluded: org.apache.maven:maven-model-builder:jar:3.0
[DEBUG]   Excluded: org.apache.maven:maven-aether-provider:jar:3.0
[DEBUG]   Excluded: org.sonatype.aether:aether-impl:jar:1.7
[DEBUG]   Excluded: org.sonatype.aether:aether-spi:jar:1.7
[DEBUG]   Excluded: org.sonatype.aether:aether-api:jar:1.7
[DEBUG]   Excluded: org.sonatype.sisu:sisu-inject-plexus:jar:1.4.2
[DEBUG]   Excluded: org.codehaus.plexus:plexus-classworlds:jar:2.2.3
[DEBUG]   Excluded: org.apache.maven:maven-model:jar:3.0
[DEBUG]   Excluded: org.apache.maven:maven-plugin-api:jar:3.0
[DEBUG]   Excluded: org.apache.maven:maven-settings:jar:3.0
[DEBUG]   Excluded: org.apache.maven:maven-settings-builder:jar:3.0
[DEBUG]   Excluded: 
org.codehaus.plexus:plexus-container-default:jar:1.0-alpha-30
[DEBUG]   Excluded: org.apache.maven.wagon:wagon-provider-api:jar:1.0
[DEBUG] Configuring mojo 
org.apache.maven.plugins:maven-site-plugin:3.0:attach-descriptor from 
plugin realm 
ClassRealm[plugin>org.apache.maven.plugins:maven-site-plugin:3.0, 
parent: sun.misc.Launcher$AppClassLoader@6d6f0472]
[DEBUG] Configuring mojo 
'org.apache.maven.plugins:maven-site-plugin:3.0:attach-descriptor' with 
basic configurator -->
[DEBUG]   (f) basedir = 
/Users/mduerig/Checkouts/apache/jackrabbit/oak/trunk/oak-run
[DEBUG]   (f) inputEncoding = UTF-8
[DEBUG]   (f) localRepository =        id: local
       url: file:///Users/mduerig/.m2/repository/
    layout: none

[DEBUG]   (f) pomPackagingOnly = true
[DEBUG]   (f) project = MavenProject: 
org.apache.jackrabbit:oak-run:0.2-SNAPSHOT @ 
/Users/mduerig/Checkouts/apache/jackrabbit/oak/trunk/oak-run/pom.xml
[DEBUG]   (f) reactorProjects = [MavenProject: 
org.apache.jackrabbit:oak-run:0.2-SNAPSHOT @ 
/Users/mduerig/Checkouts/apache/jackrabbit/oak/trunk/oak-run/pom.xml]
[DEBUG]   (f) siteDirectory = 
/Users/mduerig/Checkouts/apache/jackrabbit/oak/trunk/oak-run/src/site
[DEBUG] -- end configuration --
[INFO]
[INFO] --- maven-shade-plugin:1.6:shade (default) @ oak-run ---
[DEBUG] org.apache.maven.plugins:maven-shade-plugin:jar:1.6:
[DEBUG]    org.apache.maven:maven-plugin-api:jar:2.0.6:compile
[DEBUG]    org.apache.maven:maven-model:jar:2.0.6:compile
[DEBUG]    org.apache.maven:maven-project:jar:2.0.6:compile
[DEBUG]       org.apache.maven:maven-settings:jar:2.0.6:compile
[DEBUG]       org.apache.maven:maven-profile:jar:2.0.6:compile
[DEBUG]       org.apache.maven:maven-artifact-manager:jar:2.0.6:compile
[DEBUG] 
org.apache.maven:maven-repository-metadata:jar:2.0.6:compile
[DEBUG]       org.apache.maven:maven-plugin-registry:jar:2.0.6:compile
[DEBUG]    org.apache.maven:maven-artifact:jar:2.0.6:compile
[DEBUG] 
org.codehaus.plexus:plexus-container-default:jar:1.0-alpha-9-stable-1:compile
[DEBUG]       junit:junit:jar:3.8.1:compile
[DEBUG]       classworlds:classworlds:jar:1.1-alpha-2:compile
[DEBUG]    org.codehaus.plexus:plexus-utils:jar:1.5.5:compile
[DEBUG]    asm:asm:jar:3.3.1:compile
[DEBUG]    asm:asm-commons:jar:3.3.1:compile
[DEBUG]       asm:asm-tree:jar:3.3.1:compile
[DEBUG]    org.jdom:jdom:jar:1.1:compile
[DEBUG]    org.apache.maven.shared:maven-dependency-tree:jar:1.1:compile
[DEBUG]    org.vafer:jdependency:jar:0.7:compile
[DEBUG]       commons-io:commons-io:jar:1.3.2:compile
[DEBUG]       asm:asm-analysis:jar:3.2:compile
[DEBUG]       asm:asm-util:jar:3.2:compile
[DEBUG] 
org.codehaus.plexus:plexus-component-annotations:jar:1.5.5:compile
[DEBUG] Created new class realm 
plugin>org.apache.maven.plugins:maven-shade-plugin:1.6
[DEBUG] Importing foreign packages into class realm 
plugin>org.apache.maven.plugins:maven-shade-plugin:1.6
[DEBUG]   Imported:  < maven.api
[DEBUG] Populating class realm 
plugin>org.apache.maven.plugins:maven-shade-plugin:1.6
[DEBUG]   Included: org.apache.maven.plugins:maven-shade-plugin:jar:1.6
[DEBUG]   Included: junit:junit:jar:3.8.1
[DEBUG]   Included: org.codehaus.plexus:plexus-utils:jar:1.5.5
[DEBUG]   Included: asm:asm:jar:3.3.1
[DEBUG]   Included: asm:asm-commons:jar:3.3.1
[DEBUG]   Included: asm:asm-tree:jar:3.3.1
[DEBUG]   Included: org.jdom:jdom:jar:1.1
[DEBUG]   Included: org.apache.maven.shared:maven-dependency-tree:jar:1.1
[DEBUG]   Included: org.vafer:jdependency:jar:0.7
[DEBUG]   Included: commons-io:commons-io:jar:1.3.2
[DEBUG]   Included: asm:asm-analysis:jar:3.2
[DEBUG]   Included: asm:asm-util:jar:3.2
[DEBUG]   Included: 
org.codehaus.plexus:plexus-component-annotations:jar:1.5.5
[DEBUG]   Excluded: org.apache.maven:maven-plugin-api:jar:2.0.6
[DEBUG]   Excluded: org.apache.maven:maven-model:jar:2.0.6
[DEBUG]   Excluded: org.apache.maven:maven-project:jar:2.0.6
[DEBUG]   Excluded: org.apache.maven:maven-settings:jar:2.0.6
[DEBUG]   Excluded: org.apache.maven:maven-profile:jar:2.0.6
[DEBUG]   Excluded: org.apache.maven:maven-artifact-manager:jar:2.0.6
[DEBUG]   Excluded: org.apache.maven:maven-repository-metadata:jar:2.0.6
[DEBUG]   Excluded: org.apache.maven:maven-plugin-registry:jar:2.0.6
[DEBUG]   Excluded: org.apache.maven:maven-artifact:jar:2.0.6
[DEBUG]   Excluded: 
org.codehaus.plexus:plexus-container-default:jar:1.0-alpha-9-stable-1
[DEBUG]   Excluded: classworlds:classworlds:jar:1.1-alpha-2
[DEBUG] Configuring mojo 
org.apache.maven.plugins:maven-shade-plugin:1.6:shade from plugin realm 
ClassRealm[plugin>org.apache.maven.plugins:maven-shade-plugin:1.6, 
parent: sun.misc.Launcher$AppClassLoader@6d6f0472]
[DEBUG] Configuring mojo 
'org.apache.maven.plugins:maven-shade-plugin:1.6:shade' with basic 
configurator -->
[DEBUG]   (f) includes = [*]
[DEBUG]   (f) artifactSet = 
org.apache.maven.plugins.shade.mojo.ArtifactSet@ece88d2
[DEBUG]   (f) createDependencyReducedPom = true
[DEBUG]   (f) createSourcesJar = false
[DEBUG]   (f) artifact = *
[DEBUG]   (f) excludes = [META-INF/*.DSA, META-INF/*.SF, META-INF/*.RSA]
[DEBUG]   (f) filters = 
[org.apache.maven.plugins.shade.mojo.ArchiveFilter@28c5119e]
[DEBUG]   (f) keepDependenciesWithProvidedScope = false
[DEBUG]   (f) localRepository =        id: local
       url: file:///Users/mduerig/.m2/repository/
    layout: none

[DEBUG]   (f) minimizeJar = false
[DEBUG]   (f) outputDirectory = 
/Users/mduerig/Checkouts/apache/jackrabbit/oak/trunk/oak-run/target
[DEBUG]   (f) project = MavenProject: 
org.apache.jackrabbit:oak-run:0.2-SNAPSHOT @ 
/Users/mduerig/Checkouts/apache/jackrabbit/oak/trunk/oak-run/pom.xml
[DEBUG]   (f) promoteTransitiveDependencies = false
[DEBUG]   (f) remoteArtifactRepositories = [       id: maven-central
       url: http://repo1.maven.org/maven2
    layout: default
snapshots: [enabled => true, update => daily]
  releases: [enabled => true, update => daily]
,        id: day-central
       url: http://repo.dev.day.com/central
    layout: default
snapshots: [enabled => true, update => daily]
  releases: [enabled => true, update => daily]
,        id: apache.snapshots
       url: http://repository.apache.org/snapshots
    layout: default
snapshots: [enabled => true, update => daily]
  releases: [enabled => false, update => daily]
,        id: central
       url: http://repo1.maven.org/maven2
    layout: default
snapshots: [enabled => false, update => daily]
  releases: [enabled => true, update => daily]
]
[DEBUG]   (f) shadedArtifactAttached = false
[DEBUG]   (f) shadedArtifactId = oak-run
[DEBUG]   (f) shadedClassifierName = shaded
[DEBUG]   (f) mainClass = org.apache.jackrabbit.oak.run.Main
[DEBUG]   (f) transformers = 
[org.apache.maven.plugins.shade.resource.ManifestResourceTransformer@40914272]
[DEBUG] -- end configuration --
[INFO] Including org.apache.jackrabbit:oak-jcr:jar:0.2-SNAPSHOT in the 
shaded jar.
[INFO] Including javax.jcr:jcr:jar:2.0 in the shaded jar.
[INFO] Including org.apache.jackrabbit:oak-core:jar:0.2-SNAPSHOT in the 
shaded jar.
[INFO] Including org.apache.jackrabbit:oak-mk:jar:0.2-SNAPSHOT in the 
shaded jar.
[INFO] Including org.apache.jackrabbit:jackrabbit-api:jar:2.4.0 in the 
shaded jar.
[INFO] Including org.apache.jackrabbit:jackrabbit-jcr-commons:jar:2.4.0 
in the shaded jar.
[INFO] Including commons-collections:commons-collections:jar:3.2.1 in 
the shaded jar.
[INFO] Including org.slf4j:slf4j-api:jar:1.6.4 in the shaded jar.
[INFO] Including org.slf4j:jcl-over-slf4j:jar:1.6.4 in the shaded jar.
[INFO] Including org.apache.jackrabbit:jackrabbit-jcr-server:jar:2.4.0 
in the shaded jar.
[INFO] Including org.apache.jackrabbit:jackrabbit-spi-commons:jar:2.4.0 
in the shaded jar.
[INFO] Including org.apache.jackrabbit:jackrabbit-spi:jar:2.4.0 in the 
shaded jar.
[INFO] Including commons-io:commons-io:jar:1.4 in the shaded jar.
[INFO] Including org.apache.jackrabbit:jackrabbit-webdav:jar:2.4.0 in 
the shaded jar.
[INFO] Including commons-httpclient:commons-httpclient:jar:3.0 in the 
shaded jar.
[INFO] Including commons-codec:commons-codec:jar:1.2 in the shaded jar.
[INFO] Including org.apache.tika:tika-core:jar:1.0 in the shaded jar.
[INFO] Including commons-fileupload:commons-fileupload:jar:1.2.1 in the 
shaded jar.
[INFO] Including org.eclipse.jetty:jetty-servlet:jar:8.1.2.v20120308 in 
the shaded jar.
[INFO] Including org.eclipse.jetty:jetty-security:jar:8.1.2.v20120308 in 
the shaded jar.
[INFO] Including org.eclipse.jetty:jetty-server:jar:8.1.2.v20120308 in 
the shaded jar.
[INFO] Including 
org.eclipse.jetty.orbit:javax.servlet:jar:3.0.0.v201112011016 in the 
shaded jar.
[INFO] Including 
org.eclipse.jetty:jetty-continuation:jar:8.1.2.v20120308 in the shaded jar.
[INFO] Including org.eclipse.jetty:jetty-http:jar:8.1.2.v20120308 in the 
shaded jar.
[INFO] Including org.eclipse.jetty:jetty-io:jar:8.1.2.v20120308 in the 
shaded jar.
[INFO] Including org.eclipse.jetty:jetty-util:jar:8.1.2.v20120308 in the 
shaded jar.
[INFO] Including ch.qos.logback:logback-classic:jar:1.0.1 in the shaded jar.
[INFO] Including ch.qos.logback:logback-core:jar:1.0.1 in the shaded jar.
[DEBUG] Processing JAR 
/Users/mduerig/Checkouts/apache/jackrabbit/oak/trunk/oak-run/target/oak-run-0.2-SNAPSHOT.jar
[DEBUG] Processing JAR 
/Users/mduerig/.m2/repository/org/apache/jackrabbit/oak-jcr/0.2-SNAPSHOT/oak-jcr-0.2-SNAPSHOT.jar
[DEBUG] Processing JAR 
/Users/mduerig/.m2/repository/javax/jcr/jcr/2.0/jcr-2.0.jar
[DEBUG] Processing JAR 
/Users/mduerig/.m2/repository/org/apache/jackrabbit/oak-core/0.2-SNAPSHOT/oak-core-0.2-SNAPSHOT.jar
[DEBUG] Processing JAR 
/Users/mduerig/.m2/repository/org/apache/jackrabbit/oak-mk/0.2-SNAPSHOT/oak-mk-0.2-SNAPSHOT.jar
[DEBUG] Processing JAR 
/Users/mduerig/.m2/repository/org/apache/jackrabbit/jackrabbit-api/2.4.0/jackrabbit-api-2.4.0.jar
[DEBUG] Processing JAR 
/Users/mduerig/.m2/repository/org/apache/jackrabbit/jackrabbit-jcr-commons/2.4.0/jackrabbit-jcr-commons-2.4.0.jar
[DEBUG] Processing JAR 
/Users/mduerig/.m2/repository/commons-collections/commons-collections/3.2.1/commons-collections-3.2.1.jar
[DEBUG] Processing JAR 
/Users/mduerig/.m2/repository/org/slf4j/slf4j-api/1.6.4/slf4j-api-1.6.4.jar
[DEBUG] Processing JAR 
/Users/mduerig/.m2/repository/org/slf4j/jcl-over-slf4j/1.6.4/jcl-over-slf4j-1.6.4.jar
[DEBUG] Processing JAR 
/Users/mduerig/.m2/repository/org/apache/jackrabbit/jackrabbit-jcr-server/2.4.0/jackrabbit-jcr-server-2.4.0.jar
[DEBUG] Processing JAR 
/Users/mduerig/.m2/repository/org/apache/jackrabbit/jackrabbit-spi-commons/2.4.0/jackrabbit-spi-commons-2.4.0.jar
[DEBUG] Processing JAR 
/Users/mduerig/.m2/repository/org/apache/jackrabbit/jackrabbit-spi/2.4.0/jackrabbit-spi-2.4.0.jar
[DEBUG] Processing JAR 
/Users/mduerig/.m2/repository/commons-io/commons-io/1.4/commons-io-1.4.jar
[DEBUG] Processing JAR 
/Users/mduerig/.m2/repository/org/apache/jackrabbit/jackrabbit-webdav/2.4.0/jackrabbit-webdav-2.4.0.jar
[DEBUG] Processing JAR 
/Users/mduerig/.m2/repository/commons-httpclient/commons-httpclient/3.0/commons-httpclient-3.0.jar
[DEBUG] Processing JAR 
/Users/mduerig/.m2/repository/commons-codec/commons-codec/1.2/commons-codec-1.2.jar
[DEBUG] Processing JAR 
/Users/mduerig/.m2/repository/org/apache/tika/tika-core/1.0/tika-core-1.0.jar
[DEBUG] Processing JAR 
/Users/mduerig/.m2/repository/commons-fileupload/commons-fileupload/1.2.1/commons-fileupload-1.2.1.jar
[DEBUG] Processing JAR 
/Users/mduerig/.m2/repository/org/eclipse/jetty/jetty-servlet/8.1.2.v20120308/jetty-servlet-8.1.2.v20120308.jar
[DEBUG] Processing JAR 
/Users/mduerig/.m2/repository/org/eclipse/jetty/jetty-security/8.1.2.v20120308/jetty-security-8.1.2.v20120308.jar
[DEBUG] Processing JAR 
/Users/mduerig/.m2/repository/org/eclipse/jetty/jetty-server/8.1.2.v20120308/jetty-server-8.1.2.v20120308.jar
[DEBUG] Processing JAR 
/Users/mduerig/.m2/repository/org/eclipse/jetty/orbit/javax.servlet/3.0.0.v201112011016/javax.servlet-3.0.0.v201112011016.jar
[DEBUG] Processing JAR 
/Users/mduerig/.m2/repository/org/eclipse/jetty/jetty-continuation/8.1.2.v20120308/jetty-continuation-8.1.2.v20120308.jar
[DEBUG] Processing JAR 
/Users/mduerig/.m2/repository/org/eclipse/jetty/jetty-http/8.1.2.v20120308/jetty-http-8.1.2.v20120308.jar
[DEBUG] Processing JAR 
/Users/mduerig/.m2/repository/org/eclipse/jetty/jetty-io/8.1.2.v20120308/jetty-io-8.1.2.v20120308.jar
[DEBUG] Processing JAR 
/Users/mduerig/.m2/repository/org/eclipse/jetty/jetty-util/8.1.2.v20120308/jetty-util-8.1.2.v20120308.jar
[DEBUG] Processing JAR 
/Users/mduerig/.m2/repository/ch/qos/logback/logback-classic/1.0.1/logback-classic-1.0.1.jar
[DEBUG] Processing JAR 
/Users/mduerig/.m2/repository/ch/qos/logback/logback-core/1.0.1/logback-core-1.0.1.jar
[INFO] Replacing original artifact with shaded artifact.
[INFO] Replacing 
/Users/mduerig/Checkouts/apache/jackrabbit/oak/trunk/oak-run/target/oak-run-0.2-SNAPSHOT.jar 
with 
/Users/mduerig/Checkouts/apache/jackrabbit/oak/trunk/oak-run/target/oak-run-0.2-SNAPSHOT-shaded.jar
[DEBUG] Extension realms for project 
org.apache.jackrabbit:oak-run:jar:0.2-SNAPSHOT: (none)
[DEBUG] Looking up lifecyle mappings for packaging jar from 
ClassRealm[plexus.core, parent: null]
[DEBUG] Dependency tree resolution listener events:
[DEBUG] testArtifact: 
artifact=org.apache.jackrabbit:oak-run:jar:0.2-SNAPSHOT
[DEBUG] includeArtifact: 
artifact=org.apache.jackrabbit:oak-run:jar:0.2-SNAPSHOT
[DEBUG] startProcessChildren: 
artifact=org.apache.jackrabbit:oak-run:jar:0.2-SNAPSHOT
[DEBUG] endProcessChildren: 
artifact=org.apache.jackrabbit:oak-run:jar:0.2-SNAPSHOT
[INFO]
[INFO] --- maven-failsafe-plugin:2.12:integration-test (default) @ 
oak-run ---
[DEBUG] org.apache.maven.plugins:maven-failsafe-plugin:jar:2.12:
[DEBUG]    org.apache.maven:maven-plugin-api:jar:2.0.9:compile
[DEBUG]    org.apache.maven.surefire:surefire-booter:jar:2.12:compile
[DEBUG]       org.apache.maven.surefire:surefire-api:jar:2.12:compile
[DEBUG]    org.apache.maven.surefire:maven-surefire-common:jar:2.12:compile
[DEBUG] 
org.apache.maven.shared:maven-common-artifact-filters:jar:1.3:compile
[DEBUG]    org.codehaus.plexus:plexus-utils:jar:3.0:compile
[DEBUG]    org.apache.maven:maven-artifact:jar:2.0.9:compile
[DEBUG]    org.apache.maven:maven-project:jar:2.0.9:compile
[DEBUG]       org.apache.maven:maven-settings:jar:2.0.9:compile
[DEBUG]       org.apache.maven:maven-profile:jar:2.0.9:compile
[DEBUG]       org.apache.maven:maven-model:jar:2.0.9:compile
[DEBUG]       org.apache.maven:maven-artifact-manager:jar:2.0.9:compile
[DEBUG]       org.apache.maven:maven-plugin-registry:jar:2.0.9:compile
[DEBUG] 
org.codehaus.plexus:plexus-container-default:jar:1.0-alpha-9-stable-1:compile
[DEBUG]          junit:junit:jar:3.8.1:test (scope managed from compile)
[DEBUG]    org.apache.maven:maven-core:jar:2.0.9:compile
[DEBUG] 
org.apache.maven:maven-plugin-parameter-documenter:jar:2.0.9:compile
[DEBUG] 
org.apache.maven.reporting:maven-reporting-api:jar:2.0.9:compile
[DEBUG]       org.apache.maven:maven-repository-metadata:jar:2.0.9:compile
[DEBUG]       org.apache.maven:maven-error-diagnostics:jar:2.0.9:compile
[DEBUG]       org.apache.maven:maven-plugin-descriptor:jar:2.0.9:compile
[DEBUG]       org.apache.maven:maven-monitor:jar:2.0.9:compile
[DEBUG]       classworlds:classworlds:jar:1.1:compile
[DEBUG]    org.apache.maven:maven-toolchain:jar:2.0.9:compile
[DEBUG] Created new class realm 
plugin>org.apache.maven.plugins:maven-failsafe-plugin:2.12
[DEBUG] Importing foreign packages into class realm 
plugin>org.apache.maven.plugins:maven-failsafe-plugin:2.12
[DEBUG]   Imported:  < maven.api
[DEBUG] Populating class realm 
plugin>org.apache.maven.plugins:maven-failsafe-plugin:2.12
[DEBUG]   Included: org.apache.maven.plugins:maven-failsafe-plugin:jar:2.12
[DEBUG]   Included: org.apache.maven.surefire:surefire-booter:jar:2.12
[DEBUG]   Included: org.apache.maven.surefire:surefire-api:jar:2.12
[DEBUG]   Included: org.apache.maven.surefire:maven-surefire-common:jar:2.12
[DEBUG]   Included: 
org.apache.maven.shared:maven-common-artifact-filters:jar:1.3
[DEBUG]   Included: org.codehaus.plexus:plexus-utils:jar:3.0
[DEBUG]   Included: org.apache.maven.reporting:maven-reporting-api:jar:2.0.9
[DEBUG]   Excluded: org.apache.maven:maven-plugin-api:jar:2.0.9
[DEBUG]   Excluded: org.apache.maven:maven-artifact:jar:2.0.9
[DEBUG]   Excluded: org.apache.maven:maven-project:jar:2.0.9
[DEBUG]   Excluded: org.apache.maven:maven-settings:jar:2.0.9
[DEBUG]   Excluded: org.apache.maven:maven-profile:jar:2.0.9
[DEBUG]   Excluded: org.apache.maven:maven-model:jar:2.0.9
[DEBUG]   Excluded: org.apache.maven:maven-artifact-manager:jar:2.0.9
[DEBUG]   Excluded: org.apache.maven:maven-plugin-registry:jar:2.0.9
[DEBUG]   Excluded: 
org.codehaus.plexus:plexus-container-default:jar:1.0-alpha-9-stable-1
[DEBUG]   Excluded: junit:junit:jar:3.8.1
[DEBUG]   Excluded: org.apache.maven:maven-core:jar:2.0.9
[DEBUG]   Excluded: 
org.apache.maven:maven-plugin-parameter-documenter:jar:2.0.9
[DEBUG]   Excluded: org.apache.maven:maven-repository-metadata:jar:2.0.9
[DEBUG]   Excluded: org.apache.maven:maven-error-diagnostics:jar:2.0.9
[DEBUG]   Excluded: org.apache.maven:maven-plugin-descriptor:jar:2.0.9
[DEBUG]   Excluded: org.apache.maven:maven-monitor:jar:2.0.9
[DEBUG]   Excluded: classworlds:classworlds:jar:1.1
[DEBUG]   Excluded: org.apache.maven:maven-toolchain:jar:2.0.9
[DEBUG] Configuring mojo 
org.apache.maven.plugins:maven-failsafe-plugin:2.12:integration-test 
from plugin realm 
ClassRealm[plugin>org.apache.maven.plugins:maven-failsafe-plugin:2.12, 
parent: sun.misc.Launcher$AppClassLoader@6d6f0472]
[DEBUG] Configuring mojo 
'org.apache.maven.plugins:maven-failsafe-plugin:2.12:integration-test' 
with basic configurator -->
[DEBUG]   (s) basedir = 
/Users/mduerig/Checkouts/apache/jackrabbit/oak/trunk/oak-run
[DEBUG]   (s) childDelegation = false
[DEBUG]   (s) classesDirectory = 
/Users/mduerig/Checkouts/apache/jackrabbit/oak/trunk/oak-run/target/classes
[DEBUG]   (s) disableXmlReport = false
[DEBUG]   (s) enableAssertions = true
[DEBUG]   (s) forkMode = once
[DEBUG]   (s) junitArtifactName = junit:junit
[DEBUG]   (s) localRepository =        id: local
       url: file:///Users/mduerig/.m2/repository/
    layout: none

[DEBUG]   (f) parallelMavenExecution = false
[DEBUG]   (s) perCoreThreadCount = true
[DEBUG]   (s) pluginArtifactMap = 
{org.apache.maven.plugins:maven-failsafe-plugin=org.apache.maven.plugins:maven-failsafe-plugin:maven-plugin:2.12:, 
org.apache.maven.surefire:surefire-booter=org.apache.maven.surefire:surefire-booter:jar:2.12:compile, 
org.apache.maven.surefire:surefire-api=org.apache.maven.surefire:surefire-api:jar:2.12:compile, 
org.apache.maven.surefire:maven-surefire-common=org.apache.maven.surefire:maven-surefire-common:jar:2.12:compile, 
org.apache.maven.shared:maven-common-artifact-filters=org.apache.maven.shared:maven-common-artifact-filters:jar:1.3:compile, 
org.codehaus.plexus:plexus-utils=org.codehaus.plexus:plexus-utils:jar:3.0:compile, 
org.apache.maven.reporting:maven-reporting-api=org.apache.maven.reporting:maven-reporting-api:jar:2.0.9:compile}
[DEBUG]   (f) pluginDescriptor = Component Descriptor: role: 
'org.apache.maven.plugin.Mojo', implementation: 
'org.apache.maven.plugin.failsafe.IntegrationTestMojo', role hint: 
'org.apache.maven.plugins:maven-failsafe-plugin:2.12:integration-test'
role: 'org.apache.maven.plugin.Mojo', implementation: 
'org.apache.maven.plugin.failsafe.VerifyMojo', role hint: 
'org.apache.maven.plugins:maven-failsafe-plugin:2.12:verify'
role: 'org.apache.maven.plugin.Mojo', implementation: 
'org.apache.maven.plugin.failsafe.HelpMojo', role hint: 
'org.apache.maven.plugins:maven-failsafe-plugin:2.12:help'
---
[DEBUG]   (s) printSummary = true
[DEBUG]   (s) project = MavenProject: 
org.apache.jackrabbit:oak-run:0.2-SNAPSHOT @ 
/Users/mduerig/Checkouts/apache/jackrabbit/oak/trunk/oak-run/dependency-reduced-pom.xml
[DEBUG]   (s) projectArtifactMap = 
{org.apache.jackrabbit:oak-jcr=org.apache.jackrabbit:oak-jcr:jar:0.2-SNAPSHOT:compile, 
javax.jcr:jcr=javax.jcr:jcr:jar:2.0:compile, 
org.apache.jackrabbit:oak-core=org.apache.jackrabbit:oak-core:jar:0.2-SNAPSHOT:compile, 
org.apache.jackrabbit:oak-mk=org.apache.jackrabbit:oak-mk:jar:0.2-SNAPSHOT:compile, 
org.apache.jackrabbit:jackrabbit-api=org.apache.jackrabbit:jackrabbit-api:jar:2.4.0:compile, 
org.apache.jackrabbit:jackrabbit-jcr-commons=org.apache.jackrabbit:jackrabbit-jcr-commons:jar:2.4.0:compile, 
commons-collections:commons-collections=commons-collections:commons-collections:jar:3.2.1:compile, 
org.slf4j:slf4j-api=org.slf4j:slf4j-api:jar:1.6.4:compile, 
org.slf4j:jcl-over-slf4j=org.slf4j:jcl-over-slf4j:jar:1.6.4:compile, 
org.apache.jackrabbit:jackrabbit-jcr-server=org.apache.jackrabbit:jackrabbit-jcr-server:jar:2.4.0:compile, 
org.apache.jackrabbit:jackrabbit-spi-commons=org.apache.jackrabbit:jackrabbit-spi-commons:jar:2.4.0:compile, 
org.apache.jackrabbit:jackrabbit-spi=org.apache.jackrabbit:jackrabbit-spi:jar:2.4.0:compile, 
commons-io:commons-io=commons-io:commons-io:jar:1.4:compile, 
org.apache.jackrabbit:jackrabbit-webdav=org.apache.jackrabbit:jackrabbit-webdav:jar:2.4.0:compile, 
commons-httpclient:commons-httpclient=commons-httpclient:commons-httpclient:jar:3.0:compile, 
commons-codec:commons-codec=commons-codec:commons-codec:jar:1.2:compile, 
org.apache.tika:tika-core=org.apache.tika:tika-core:jar:1.0:compile, 
commons-fileupload:commons-fileupload=commons-fileupload:commons-fileupload:jar:1.2.1:compile, 
org.eclipse.jetty:jetty-servlet=org.eclipse.jetty:jetty-servlet:jar:8.1.2.v20120308:compile, 
org.eclipse.jetty:jetty-security=org.eclipse.jetty:jetty-security:jar:8.1.2.v20120308:compile, 
org.eclipse.jetty:jetty-server=org.eclipse.jetty:jetty-server:jar:8.1.2.v20120308:compile, 
org.eclipse.jetty.orbit:javax.servlet=org.eclipse.jetty.orbit:javax.servlet:jar:3.0.0.v201112011016:compile, 
org.eclipse.jetty:jetty-continuation=org.eclipse.jetty:jetty-continuation:jar:8.1.2.v20120308:compile, 
org.eclipse.jetty:jetty-http=org.eclipse.jetty:jetty-http:jar:8.1.2.v20120308:compile, 
org.eclipse.jetty:jetty-io=org.eclipse.jetty:jetty-io:jar:8.1.2.v20120308:compile, 
org.eclipse.jetty:jetty-util=org.eclipse.jetty:jetty-util:jar:8.1.2.v20120308:compile, 
ch.qos.logback:logback-classic=ch.qos.logback:logback-classic:jar:1.0.1:compile, 
ch.qos.logback:logback-core=ch.qos.logback:logback-core:jar:1.0.1:compile}
[DEBUG]   (s) redirectTestOutputToFile = false
[DEBUG]   (s) remoteRepositories = [       id: day-central-plugin
       url: http://repo.dev.day.com/central
    layout: default
snapshots: [enabled => true, update => daily]
  releases: [enabled => true, update => daily]
,        id: maven-central-plugin
       url: http://repo1.maven.org/maven2
    layout: default
snapshots: [enabled => true, update => daily]
  releases: [enabled => true, update => daily]
,        id: central
       url: http://repo1.maven.org/maven2
    layout: default
snapshots: [enabled => false, update => daily]
  releases: [enabled => true, update => never]
]
[DEBUG]   (s) reportFormat = brief
[DEBUG]   (s) reportsDirectory = 
/Users/mduerig/Checkouts/apache/jackrabbit/oak/trunk/oak-run/target/failsafe-reports
[DEBUG]   (s) runOrder = filesystem
[DEBUG]   (s) session = org.apache.maven.execution.MavenSession@254ba9a2
[DEBUG]   (s) skip = false
[DEBUG]   (s) skipTests = false
[DEBUG]   (s) summaryFile = 
/Users/mduerig/Checkouts/apache/jackrabbit/oak/trunk/oak-run/target/failsafe-reports/failsafe-summary.xml
[DEBUG]   (s) systemPropertyVariables = {known.issues=null}
[DEBUG]   (s) testClassesDirectory = 
/Users/mduerig/Checkouts/apache/jackrabbit/oak/trunk/oak-run/target/test-classes
[DEBUG]   (s) testNGArtifactName = org.testng:testng
[DEBUG]   (s) testSourceDirectory = 
/Users/mduerig/Checkouts/apache/jackrabbit/oak/trunk/oak-run/src/test/java
[DEBUG]   (s) trimStackTrace = true
[DEBUG]   (s) useFile = true
[DEBUG]   (s) useManifestOnlyJar = true
[DEBUG]   (s) useSystemClassLoader = true
[DEBUG]   (s) useUnlimitedThreads = false
[DEBUG]   (s) workingDirectory = 
/Users/mduerig/Checkouts/apache/jackrabbit/oak/trunk/oak-run
[DEBUG] -- end configuration --
[INFO] Failsafe report directory: 
/Users/mduerig/Checkouts/apache/jackrabbit/oak/trunk/oak-run/target/failsafe-reports
[DEBUG] dummy:dummy:jar:1.0 (selected for null)
[DEBUG]   org.apache.maven.surefire:surefire-booter:jar:2.12:compile 
(selected for compile)
[DEBUG]     org.apache.maven.surefire:surefire-api:jar:2.12:compile 
(selected for compile)
[DEBUG] Adding to failsafe booter test classpath: 
/Users/mduerig/.m2/repository/org/apache/maven/surefire/surefire-booter/2.12/surefire-booter-2.12.jar 
Scope: compile
[DEBUG] Adding to failsafe booter test classpath: 
/Users/mduerig/.m2/repository/org/apache/maven/surefire/surefire-api/2.12/surefire-api-2.12.jar 
Scope: compile
[DEBUG] Setting system property 
[user.dir]=[/Users/mduerig/Checkouts/apache/jackrabbit/oak/trunk/oak-run]
[DEBUG] Setting system property 
[localRepository]=[/Users/mduerig/.m2/repository]
[DEBUG] Setting system property 
[basedir]=[/Users/mduerig/Checkouts/apache/jackrabbit/oak/trunk/oak-run]
[DEBUG] Using JVM: 
/System/Library/Frameworks/JavaVM.framework/Versions/1.6.0/Home/bin/java
[DEBUG] dummy:dummy:jar:1.0 (selected for null)
[WARNING] Invalid POM for 
org.apache.maven.surefire:surefire-junit3:jar:2.12, transitive 
dependencies (if any) will not be available, enable debug logging for 
more details: 1 problem was encountered while building the effective model
[FATAL] Non-parseable POM 
/Users/mduerig/.m2/repository/org/apache/maven/surefire/surefire-junit3/2.12/surefire-junit3-2.12.pom: 
entity reference name can not contain character =' (position: START_TAG 
seen 
...//www.webaddresshelp.bt.com/main?InterceptSource=0&ClientLocation=... 
@1:246)  @ line 1, column 246
  for project
[DEBUG]   org.apache.maven.surefire:surefire-junit3:jar:2.12:test 
(selected for test)
[DEBUG] Adding to failsafe test classpath: 
/Users/mduerig/.m2/repository/org/apache/maven/surefire/surefire-junit3/2.12/surefire-junit3-2.12.jar 
Scope: test
[DEBUG] test classpath classpath:
[DEBUG] 
/Users/mduerig/Checkouts/apache/jackrabbit/oak/trunk/oak-run/target/test-classes
[DEBUG] 
/Users/mduerig/Checkouts/apache/jackrabbit/oak/trunk/oak-run/target/classes
[DEBUG] 
/Users/mduerig/.m2/repository/org/apache/jackrabbit/oak-jcr/0.2-SNAPSHOT/oak-jcr-0.2-SNAPSHOT.jar
[DEBUG]   /Users/mduerig/.m2/repository/javax/jcr/jcr/2.0/jcr-2.0.jar
[DEBUG] 
/Users/mduerig/.m2/repository/org/apache/jackrabbit/oak-core/0.2-SNAPSHOT/oak-core-0.2-SNAPSHOT.jar
[DEBUG] 
/Users/mduerig/.m2/repository/org/apache/jackrabbit/oak-mk/0.2-SNAPSHOT/oak-mk-0.2-SNAPSHOT.jar
[DEBUG] 
/Users/mduerig/.m2/repository/org/apache/jackrabbit/jackrabbit-api/2.4.0/jackrabbit-api-2.4.0.jar
[DEBUG] 
/Users/mduerig/.m2/repository/org/apache/jackrabbit/jackrabbit-jcr-commons/2.4.0/jackrabbit-jcr-commons-2.4.0.jar
[DEBUG] 
/Users/mduerig/.m2/repository/commons-collections/commons-collections/3.2.1/commons-collections-3.2.1.jar
[DEBUG] 
/Users/mduerig/.m2/repository/org/slf4j/slf4j-api/1.6.4/slf4j-api-1.6.4.jar
[DEBUG] 
/Users/mduerig/.m2/repository/org/slf4j/jcl-over-slf4j/1.6.4/jcl-over-slf4j-1.6.4.jar
[DEBUG] 
/Users/mduerig/.m2/repository/org/apache/jackrabbit/jackrabbit-jcr-server/2.4.0/jackrabbit-jcr-server-2.4.0.jar
[DEBUG] 
/Users/mduerig/.m2/repository/org/apache/jackrabbit/jackrabbit-spi-commons/2.4.0/jackrabbit-spi-commons-2.4.0.jar
[DEBUG] 
/Users/mduerig/.m2/repository/org/apache/jackrabbit/jackrabbit-spi/2.4.0/jackrabbit-spi-2.4.0.jar
[DEBUG] 
/Users/mduerig/.m2/repository/commons-io/commons-io/1.4/commons-io-1.4.jar
[DEBUG] 
/Users/mduerig/.m2/repository/org/apache/jackrabbit/jackrabbit-webdav/2.4.0/jackrabbit-webdav-2.4.0.jar
[DEBUG] 
/Users/mduerig/.m2/repository/commons-httpclient/commons-httpclient/3.0/commons-httpclient-3.0.jar
[DEBUG] 
/Users/mduerig/.m2/repository/commons-codec/commons-codec/1.2/commons-codec-1.2.jar
[DEBUG] 
/Users/mduerig/.m2/repository/org/apache/tika/tika-core/1.0/tika-core-1.0.jar
[DEBUG] 
/Users/mduerig/.m2/repository/commons-fileupload/commons-fileupload/1.2.1/commons-fileupload-1.2.1.jar
[DEBUG] 
/Users/mduerig/.m2/repository/org/eclipse/jetty/jetty-servlet/8.1.2.v20120308/jetty-servlet-8.1.2.v20120308.jar
[DEBUG] 
/Users/mduerig/.m2/repository/org/eclipse/jetty/jetty-security/8.1.2.v20120308/jetty-security-8.1.2.v20120308.jar
[DEBUG] 
/Users/mduerig/.m2/repository/org/eclipse/jetty/jetty-server/8.1.2.v20120308/jetty-server-8.1.2.v20120308.jar
[DEBUG] 
/Users/mduerig/.m2/repository/org/eclipse/jetty/orbit/javax.servlet/3.0.0.v201112011016/javax.servlet-3.0.0.v201112011016.jar
[DEBUG] 
/Users/mduerig/.m2/repository/org/eclipse/jetty/jetty-continuation/8.1.2.v20120308/jetty-continuation-8.1.2.v20120308.jar
[DEBUG] 
/Users/mduerig/.m2/repository/org/eclipse/jetty/jetty-http/8.1.2.v20120308/jetty-http-8.1.2.v20120308.jar
[DEBUG] 
/Users/mduerig/.m2/repository/org/eclipse/jetty/jetty-io/8.1.2.v20120308/jetty-io-8.1.2.v20120308.jar
[DEBUG] 
/Users/mduerig/.m2/repository/org/eclipse/jetty/jetty-util/8.1.2.v20120308/jetty-util-8.1.2.v20120308.jar
[DEBUG] 
/Users/mduerig/.m2/repository/ch/qos/logback/logback-classic/1.0.1/logback-classic-1.0.1.jar
[DEBUG] 
/Users/mduerig/.m2/repository/ch/qos/logback/logback-core/1.0.1/logback-core-1.0.1.jar
[DEBUG] provider classpath classpath:
[DEBUG] 
/Users/mduerig/.m2/repository/org/apache/maven/surefire/surefire-junit3/2.12/surefire-junit3-2.12.jar

-------------------------------------------------------
  T E S T S
-------------------------------------------------------
Forking command line: /bin/sh -c cd 
/Users/mduerig/Checkouts/apache/jackrabbit/oak/trunk/oak-run && 
/System/Library/Frameworks/JavaVM.framework/Versions/1.6.0/Home/bin/java 
-jar 
/Users/mduerig/Checkouts/apache/jackrabbit/oak/trunk/oak-run/target/surefire/surefirebooter408703590524291074.jar 
/Users/mduerig/Checkouts/apache/jackrabbit/oak/trunk/oak-run/target/surefire/surefire2402906052041483381tmp 
/Users/mduerig/Checkouts/apache/jackrabbit/oak/trunk/oak-run/target/surefire/surefire_07441176985023881163tmp
org.apache.maven.surefire.util.SurefireReflectionException: 
java.lang.ClassNotFoundException: 
org.apache.maven.surefire.junit.JUnit3Provider; nested exception is 
java.lang.ClassNotFoundException: 
org.apache.maven.surefire.junit.JUnit3Provider
java.lang.ClassNotFoundException: 
org.apache.maven.surefire.junit.JUnit3Provider
	at java.net.URLClassLoader$1.run(URLClassLoader.java:202)
	at java.security.AccessController.doPrivileged(Native Method)
	at java.net.URLClassLoader.findClass(URLClassLoader.java:190)
	at java.lang.ClassLoader.loadClass(ClassLoader.java:307)
	at java.lang.ClassLoader.loadClass(ClassLoader.java:248)
	at 
org.apache.maven.surefire.booter.IsolatedClassLoader.loadClass(IsolatedClassLoader.java:97)
	at 
org.apache.maven.surefire.util.ReflectionUtils.loadClass(ReflectionUtils.java:228)
	at 
org.apache.maven.surefire.util.ReflectionUtils.instantiateOneArg(ReflectionUtils.java:128)
	at 
org.apache.maven.surefire.booter.SurefireReflector.instantiateProvider(SurefireReflector.java:239)
	at 
org.apache.maven.surefire.booter.ProviderFactory.createProvider(ProviderFactory.java:122)
	at 
org.apache.maven.surefire.booter.ProviderFactory.invokeProvider(ProviderFactory.java:81)
	at 
org.apache.maven.surefire.booter.ForkedBooter.runSuitesInProcess(ForkedBooter.java:103)
	at org.apache.maven.surefire.booter.ForkedBooter.main(ForkedBooter.java:74)

Results :

Tests run: 0, Failures: 0, Errors: 0, Skipped: 0

[WARNING] File encoding has not been set, using platform encoding 
MacRoman, i.e. build is platform dependent!
[INFO]
[INFO] --- maven-failsafe-plugin:2.12:verify (default) @ oak-run ---
[DEBUG] Configuring mojo 
org.apache.maven.plugins:maven-failsafe-plugin:2.12:verify from plugin 
realm 
ClassRealm[plugin>org.apache.maven.plugins:maven-failsafe-plugin:2.12, 
parent: sun.misc.Launcher$AppClassLoader@6d6f0472]
[DEBUG] Configuring mojo 
'org.apache.maven.plugins:maven-failsafe-plugin:2.12:verify' with basic 
configurator -->
[DEBUG]   (s) basedir = 
/Users/mduerig/Checkouts/apache/jackrabbit/oak/trunk/oak-run
[DEBUG]   (s) reportsDirectory = 
/Users/mduerig/Checkouts/apache/jackrabbit/oak/trunk/oak-run/target/failsafe-reports
[DEBUG]   (s) skip = false
[DEBUG]   (f) summaryFile = 
/Users/mduerig/Checkouts/apache/jackrabbit/oak/trunk/oak-run/target/failsafe-reports/failsafe-summary.xml
[DEBUG]   (s) testClassesDirectory = 
/Users/mduerig/Checkouts/apache/jackrabbit/oak/trunk/oak-run/target/test-classes
[DEBUG]   (s) testFailureIgnore = false
[DEBUG] -- end configuration --
[INFO] Failsafe report directory: 
/Users/mduerig/Checkouts/apache/jackrabbit/oak/trunk/oak-run/target/failsafe-reports
[WARNING] File encoding has not been set, using platform encoding 
MacRoman, i.e. build is platform dependent!
[INFO] 
------------------------------------------------------------------------
[INFO] BUILD FAILURE
[INFO] 
------------------------------------------------------------------------
[INFO] Total time: 8.281s
[INFO] Finished at: Wed Apr 11 19:40:04 BST 2012
[INFO] Final Memory: 22M/81M
[INFO] 
------------------------------------------------------------------------
[ERROR] Failed to execute goal 
org.apache.maven.plugins:maven-failsafe-plugin:2.12:verify (default) on 
project oak-run: There are test failures.
[ERROR]
[ERROR] Please refer to 
/Users/mduerig/Checkouts/apache/jackrabbit/oak/trunk/oak-run/target/failsafe-reports 
for the individual test results.
[ERROR] -> [Help 1]
org.apache.maven.lifecycle.LifecycleExecutionException: Failed to 
execute goal org.apache.maven.plugins:maven-failsafe-plugin:2.12:verify 
(default) on project oak-run: There are test failures.

Please refer to 
/Users/mduerig/Checkouts/apache/jackrabbit/oak/trunk/oak-run/target/failsafe-reports 
for the individual test results.
	at 
org.apache.maven.lifecycle.internal.MojoExecutor.execute(MojoExecutor.java:213)
	at 
org.apache.maven.lifecycle.internal.MojoExecutor.execute(MojoExecutor.java:153)
	at 
org.apache.maven.lifecycle.internal.MojoExecutor.execute(MojoExecutor.java:145)
	at 
org.apache.maven.lifecycle.internal.LifecycleModuleBuilder.buildProject(LifecycleModuleBuilder.java:84)
	at 
org.apache.maven.lifecycle.internal.LifecycleModuleBuilder.buildProject(LifecycleModuleBuilder.java:59)
	at 
org.apache.maven.lifecycle.internal.LifecycleStarter.singleThreadedBuild(LifecycleStarter.java:183)
	at 
org.apache.maven.lifecycle.internal.LifecycleStarter.execute(LifecycleStarter.java:161)
	at org.apache.maven.DefaultMaven.doExecute(DefaultMaven.java:319)
	at org.apache.maven.DefaultMaven.execute(DefaultMaven.java:156)
	at org.apache.maven.cli.MavenCli.execute(MavenCli.java:537)
	at org.apache.maven.cli.MavenCli.doMain(MavenCli.java:196)
	at org.apache.maven.cli.MavenCli.main(MavenCli.java:141)
	at sun.reflect.NativeMethodAccessorImpl.invoke0(Native Method)
	at 
sun.reflect.NativeMethodAccessorImpl.invoke(NativeMethodAccessorImpl.java:39)
	at 
sun.reflect.DelegatingMethodAccessorImpl.invoke(DelegatingMethodAccessorImpl.java:25)
	at java.lang.reflect.Method.invoke(Method.java:597)
	at 
org.codehaus.plexus.classworlds.launcher.Launcher.launchEnhanced(Launcher.java:290)
	at 
org.codehaus.plexus.classworlds.launcher.Launcher.launch(Launcher.java:230)
	at 
org.codehaus.plexus.classworlds.launcher.Launcher.mainWithExitCode(Launcher.java:409)
	at 
org.codehaus.plexus.classworlds.launcher.Launcher.main(Launcher.java:352)
Caused by: org.apache.maven.plugin.MojoFailureException: There are test 
failures.

Please refer to 
/Users/mduerig/Checkouts/apache/jackrabbit/oak/trunk/oak-run/target/failsafe-reports 
for the individual test results.
	at 
org.apache.maven.plugin.surefire.SurefireHelper.reportExecution(SurefireHelper.java:121)
	at org.apache.maven.plugin.failsafe.VerifyMojo.execute(VerifyMojo.java:208)
	at 
org.apache.maven.plugin.DefaultBuildPluginManager.executeMojo(DefaultBuildPluginManager.java:101)
	at 
org.apache.maven.lifecycle.internal.MojoExecutor.execute(MojoExecutor.java:209)
	... 19 more
[ERROR]
[ERROR]
[ERROR] For more information about the errors and possible solutions, 
please read the following articles:
[ERROR] [Help 1] 
http://cwiki.apache.org/confluence/display/MAVEN/MojoFailureException


Mime
View raw message