jackrabbit-dev mailing list archives

Site index · List index
Message view « Date » · « Thread »
Top « Date » · « Thread »
From Apache Jenkins Server <jenk...@builds.apache.org>
Subject Build failed in Jenkins: Jackrabbit-2.2 #107
Date Mon, 12 Aug 2013 08:32:10 GMT
See <https://builds.apache.org/job/Jackrabbit-2.2/107/>

------------------------------------------
[...truncated 4870 lines...]
[WARNING] *** CHECKSUM FAILED - Checksum failed on download: local = '8c7016884f50e6a4cd77be5e93622e4d673ea3df';
remote = '3e6ae3ff11283bf3a11fab829504292771271914' - RETRYING
[WARNING] *** CHECKSUM FAILED - Checksum failed on download: local = '8c7016884f50e6a4cd77be5e93622e4d673ea3df';
remote = '3e6ae3ff11283bf3a11fab829504292771271914' - IGNORING
[INFO] Uploading repository metadata for: 'snapshot org.apache.jackrabbit:jackrabbit-webdav:2.2.14-SNAPSHOT'
[INFO] Retrieving previous metadata from apache.snapshots.https
[INFO] Uploading repository metadata for: 'artifact org.apache.jackrabbit:jackrabbit-webdav'
[JENKINS] Archiving disabled
[INFO] ------------------------------------------------------------------------
[INFO] Building Jackrabbit JCR Server
[INFO]    task-segment: [clean, deploy]
[INFO] ------------------------------------------------------------------------
[INFO] [clean:clean {execution: default-clean}]
[TASKS] Scanning folder '<https://builds.apache.org/job/Jackrabbit-2.2/ws/2.2/jackrabbit-jcr-server'>
for files matching the pattern '**/*.java' - excludes: 
[TASKS] Found 102 files to scan for tasks
Found 62 open tasks.
[TASKS] Computing warning deltas based on reference build #103
[INFO] [remote-resources:process {execution: default}]
[INFO] [resources:resources {execution: default-resources}]
[INFO] Using 'UTF-8' encoding to copy filtered resources.
[INFO] Copying 1 resource
[INFO] Copying 3 resources
[INFO] [compiler:compile {execution: default-compile}]
[INFO] Compiling 92 source files to <https://builds.apache.org/job/Jackrabbit-2.2/ws/2.2/jackrabbit-jcr-server/target/classes>
[INFO] [resources:testResources {execution: default-testResources}]
[INFO] Using 'UTF-8' encoding to copy filtered resources.
[INFO] Copying 2 resources
[INFO] Copying 3 resources
[INFO] [compiler:testCompile {execution: default-testCompile}]
[INFO] Compiling 10 source files to <https://builds.apache.org/job/Jackrabbit-2.2/ws/2.2/jackrabbit-jcr-server/target/test-classes>
[INFO] [surefire:test {execution: default-test}]
[INFO] Surefire report directory: <https://builds.apache.org/job/Jackrabbit-2.2/ws/2.2/jackrabbit-jcr-server/target/surefire-reports>

-------------------------------------------------------
 T E S T S
-------------------------------------------------------
Running org.apache.jackrabbit.server.remoting.davex.DiffParserTest
Tests run: 11, Failures: 0, Errors: 0, Skipped: 0, Time elapsed: 0.038 sec
Running org.apache.jackrabbit.webdav.simple.LocatorFactoryImplExTest
Tests run: 1, Failures: 0, Errors: 0, Skipped: 0, Time elapsed: 0.183 sec
Running org.apache.jackrabbit.webdav.jcr.JcrValueTypeTest
Tests run: 3, Failures: 0, Errors: 0, Skipped: 0, Time elapsed: 0.007 sec
Running org.apache.jackrabbit.server.remoting.davex.BatchReadConfigTest
Tests run: 3, Failures: 0, Errors: 0, Skipped: 0, Time elapsed: 0.006 sec
Running org.apache.jackrabbit.server.remoting.davex.JsonDiffHandlerTest
Tests run: 1, Failures: 0, Errors: 0, Skipped: 0, Time elapsed: 0.009 sec
Running org.apache.jackrabbit.server.BasicCredentialsProviderTest
Tests run: 4, Failures: 0, Errors: 0, Skipped: 0, Time elapsed: 0.009 sec
Running org.apache.jackrabbit.webdav.simple.LitmusTest
-> running `basic':
 0. init.................. pass
 1. begin................. pass
 2. options............... pass
 3. put_get............... pass
 4. put_get_utf8_segment.. pass
 5. put_no_parent......... pass
 6. mkcol_over_plain...... pass
 7. delete................ pass
 8. delete_null........... pass
 9. delete_fragment....... WARNING: DELETE removed collection resource with Request-URI including
fragment; unsafe
    ...................... pass (with 1 warning)
10. mkcol................. pass
11. mkcol_again........... pass
12. delete_coll........... pass
13. mkcol_no_parent....... pass
14. mkcol_with_body....... pass
15. finish................ pass
<- summary for `basic': of 16 tests run: 16 passed, 0 failed. 100.0%
-> 1 warning was issued.
-> running `http':
 0. init.................. pass
 1. begin................. pass
 2. expect100............. pass
 3. finish................ pass
<- summary for `http': of 4 tests run: 4 passed, 0 failed. 100.0%
-> running `props':
 0. init.................. pass
 1. begin................. pass
 2. propfind_invalid...... pass
 3. propfind_invalid2..... pass
 4. propfind_d0........... pass
 5. propinit.............. pass
 6. propset............... pass
 7. propget............... pass
 8. propextended.......... pass
 9. propmove.............. pass
10. propget............... pass
11. propdeletes........... pass
12. propget............... pass
13. propreplace........... pass
14. propget............... pass
15. propnullns............ pass
16. propget............... pass
17. prophighunicode....... pass
18. propget............... pass
19. propremoveset......... pass
20. propget............... pass
21. propsetremove......... pass
22. propget............... pass
23. propvalnspace......... pass
24. propwformed........... pass
25. propinit.............. pass
26. propmanyns............ pass
27. propget............... pass
28. propcleanup........... pass
29. finish................ pass
<- summary for `props': of 30 tests run: 30 passed, 0 failed. 100.0%
-> running `copymove':
 0. init.................. pass
 1. begin................. pass
 2. copy_init............. pass
 3. copy_simple........... pass
 4. copy_overwrite........ pass
 5. copy_nodestcoll....... pass
 6. copy_cleanup.......... pass
 7. copy_coll............. pass
 8. copy_shallow.......... FAIL (collection COPY `/default/litmus/ccsrc/' to `/default/litmus/ccdest/':
403 Forbidden)
 9. move.................. pass
10. move_coll............. pass
11. move_cleanup.......... pass
12. finish................ pass
<- summary for `copymove': of 13 tests run: 12 passed, 1 failed. 92.3%
See debug.log for network/debug traces.
-> running `locks':
 0. init.................. pass
 1. begin................. pass
 2. options............... pass
 3. precond............... pass
 4. init_locks............ pass
 5. put................... pass
 6. lock_excl............. pass
 7. discover.............. pass
 8. refresh............... pass
 9. notowner_modify....... pass
10. notowner_lock......... pass
11. owner_modify.......... pass
12. notowner_modify....... pass
13. notowner_lock......... pass
14. copy.................. pass
15. cond_put.............. pass
16. fail_cond_put......... pass
17. cond_put_with_not..... pass
18. cond_put_corrupt_token WARNING: PUT failed with 412 not 423
    ...................... pass (with 1 warning)
19. complex_cond_put...... pass
20. fail_complex_cond_put. pass
21. unlock................ FAIL (UNLOCK on `/default/litmus/lockme': 400 Bad Request)
22. fail_cond_put_unlocked pass
23. lock_shared........... FAIL (LOCK on `/default/litmus/lockme': 412 Precondition Failed)
24. notowner_modify....... SKIPPED
25. notowner_lock......... SKIPPED
26. owner_modify.......... SKIPPED
27. double_sharedlock..... SKIPPED
28. notowner_modify....... SKIPPED
29. notowner_lock......... SKIPPED
30. unlock................ SKIPPED
31. prep_collection....... pass
32. lock_collection....... pass
33. owner_modify.......... pass
34. notowner_modify....... pass
35. refresh............... pass
36. indirect_refresh...... pass
37. unlock................ pass
38. unmapped_lock......... pass
39. unlock................ FAIL (UNLOCK on `/default/litmus/unmapped_url': 412 Precondition
Failed)
40. finish................ pass
-> 7 tests were skipped.
<- summary for `locks': of 34 tests run: 31 passed, 3 failed. 91.2%
-> 1 warning was issued.
See debug.log for network/debug traces.
Tests run: 1, Failures: 0, Errors: 0, Skipped: 0, Time elapsed: 10.681 sec
Running org.apache.jackrabbit.webdav.jcr.JcrDavExceptionTest
Tests run: 2, Failures: 0, Errors: 0, Skipped: 0, Time elapsed: 0.005 sec

Results :

Tests run: 26, Failures: 0, Errors: 0, Skipped: 0

[JENKINS] Recording test results
[INFO] [jar:jar {execution: default-jar}]
[INFO] Building jar: <https://builds.apache.org/job/Jackrabbit-2.2/ws/2.2/jackrabbit-jcr-server/target/jackrabbit-jcr-server-2.2.14-SNAPSHOT.jar>
[INFO] [apache-rat:check {execution: default}]
[INFO] Exclude: release.properties
[INFO] [install:install {execution: default-install}]
[INFO] Installing <https://builds.apache.org/job/Jackrabbit-2.2/ws/2.2/jackrabbit-jcr-server/target/jackrabbit-jcr-server-2.2.14-SNAPSHOT.jar>
to /home/jenkins/jenkins-slave/maven-repositories/1/org/apache/jackrabbit/jackrabbit-jcr-server/2.2.14-SNAPSHOT/jackrabbit-jcr-server-2.2.14-SNAPSHOT.jar
[INFO] [deploy:deploy {execution: default-deploy}]
[INFO] Retrieving previous build number from apache.snapshots.https
[WARNING] *** CHECKSUM FAILED - Checksum failed on download: local = 'f6f83dda4058e6af915604900572090c89d18b83';
remote = '777d7d5572f360e9ac429264cddaff507322cb84' - RETRYING
[WARNING] *** CHECKSUM FAILED - Checksum failed on download: local = 'f6f83dda4058e6af915604900572090c89d18b83';
remote = '777d7d5572f360e9ac429264cddaff507322cb84' - IGNORING
Uploading: https://repository.apache.org/content/repositories/snapshots/org/apache/jackrabbit/jackrabbit-jcr-server/2.2.14-SNAPSHOT/jackrabbit-jcr-server-2.2.14-20130812.081919-10.jar
288K uploaded  (jackrabbit-jcr-server-2.2.14-20130812.081919-10.jar)
[INFO] Retrieving previous metadata from apache.snapshots.https
[WARNING] *** CHECKSUM FAILED - Checksum failed on download: local = 'f6f83dda4058e6af915604900572090c89d18b83';
remote = '777d7d5572f360e9ac429264cddaff507322cb84' - RETRYING
[WARNING] *** CHECKSUM FAILED - Checksum failed on download: local = 'f6f83dda4058e6af915604900572090c89d18b83';
remote = '777d7d5572f360e9ac429264cddaff507322cb84' - IGNORING
[INFO] Uploading repository metadata for: 'snapshot org.apache.jackrabbit:jackrabbit-jcr-server:2.2.14-SNAPSHOT'
[INFO] Uploading project information for jackrabbit-jcr-server 2.2.14-20130812.081919-10
[INFO] Retrieving previous metadata from apache.snapshots.https
[INFO] Uploading repository metadata for: 'artifact org.apache.jackrabbit:jackrabbit-jcr-server'
[JENKINS] Archiving disabled
[INFO] ------------------------------------------------------------------------
[INFO] Building Jackrabbit JCR-RMI
[INFO]    task-segment: [clean, deploy]
[INFO] ------------------------------------------------------------------------
[INFO] [clean:clean {execution: default-clean}]
[TASKS] Scanning folder '<https://builds.apache.org/job/Jackrabbit-2.2/ws/2.2/jackrabbit-jcr-rmi'>
for files matching the pattern '**/*.java' - excludes: 
[TASKS] Found 159 files to scan for tasks
Found 78 open tasks.
[TASKS] Computing warning deltas based on reference build #103
[INFO] [remote-resources:process {execution: default}]
[INFO] [resources:resources {execution: default-resources}]
[INFO] Using 'UTF-8' encoding to copy filtered resources.
[INFO] Copying 2 resources
[INFO] Copying 3 resources
[INFO] [compiler:compile {execution: default-compile}]
[INFO] Compiling 157 source files to <https://builds.apache.org/job/Jackrabbit-2.2/ws/2.2/jackrabbit-jcr-rmi/target/classes>
[INFO] [antrun:run {execution: rmic}]
[INFO] Executing tasks
     [rmic] RMI Compiling 36 classes to <https://builds.apache.org/job/Jackrabbit-2.2/ws/2.2/jackrabbit-jcr-rmi/target/classes>
[INFO] Executed tasks
[INFO] [resources:testResources {execution: default-testResources}]
[INFO] Using 'UTF-8' encoding to copy filtered resources.
[INFO] Copying 2 resources
[INFO] Copying 3 resources
[INFO] [compiler:testCompile {execution: default-testCompile}]
[INFO] Compiling 2 source files to <https://builds.apache.org/job/Jackrabbit-2.2/ws/2.2/jackrabbit-jcr-rmi/target/test-classes>
[INFO] [surefire:test {execution: default-test}]
[INFO] Surefire report directory: <https://builds.apache.org/job/Jackrabbit-2.2/ws/2.2/jackrabbit-jcr-rmi/target/surefire-reports>

-------------------------------------------------------
 T E S T S
-------------------------------------------------------
Running org.apache.jackrabbit.rmi.ConformanceTest
Tests run: 1901, Failures: 0, Errors: 0, Skipped: 0, Time elapsed: 107.576 sec

Results :

Tests run: 1901, Failures: 0, Errors: 0, Skipped: 0

Sending e-mails to: dev@jackrabbit.apache.org
Sending e-mails to: dev@jackrabbit.apache.org
Sending e-mails to: dev@jackrabbit.apache.org
Sending e-mails to: dev@jackrabbit.apache.org
Sending e-mails to: dev@jackrabbit.apache.org
Sending e-mails to: dev@jackrabbit.apache.org
Sending e-mails to: dev@jackrabbit.apache.org
Sending e-mails to: dev@jackrabbit.apache.org
Sending e-mails to: dev@jackrabbit.apache.org
[locks-and-latches] Releasing all the locks
[locks-and-latches] All the locks released
ERROR: Maven JVM terminated unexpectedly with exit code 143


Mime
View raw message