jackrabbit-dev mailing list archives

Site index · List index
Message view « Date » · « Thread »
Top « Date » · « Thread »
From Apache Jenkins Server <jenk...@builds.apache.org>
Subject Build failed in Jenkins: Jackrabbit-2.2 #98
Date Mon, 28 Jan 2013 09:07:50 GMT
See <https://builds.apache.org/job/Jackrabbit-2.2/98/changes>

Changes:

[unico] JCR-3501 reset modcount of modified states when cancelling an update

------------------------------------------
[...truncated 541 lines...]
Tests run: 4, Failures: 0, Errors: 0, Skipped: 0, Time elapsed: 0.031 sec
Running org.apache.jackrabbit.spi.commons.nodetype.compact.CompactNodeTypeDefTest
Tests run: 1, Failures: 0, Errors: 0, Skipped: 0, Time elapsed: 0.248 sec
Running org.apache.jackrabbit.spi.commons.value.QValueTest
Tests run: 58, Failures: 0, Errors: 0, Skipped: 0, Time elapsed: 0.213 sec
Running org.apache.jackrabbit.spi.commons.value.ValueFormatTest
Tests run: 5, Failures: 0, Errors: 0, Skipped: 0, Time elapsed: 0.012 sec
Running org.apache.jackrabbit.spi.commons.nodetype.constraint.PathConstraintTest
Tests run: 10, Failures: 0, Errors: 0, Skipped: 0, Time elapsed: 0.007 sec
Running org.apache.jackrabbit.spi.commons.nodetype.PropertyDefinitionTemplateImplTest
Tests run: 2, Failures: 0, Errors: 0, Skipped: 0, Time elapsed: 0.005 sec
Running org.apache.jackrabbit.spi.commons.conversion.ParsingNameResolverTest
Tests run: 2, Failures: 0, Errors: 0, Skipped: 0, Time elapsed: 0.006 sec
Running org.apache.jackrabbit.spi.commons.name.ElementTest
Tests run: 6, Failures: 0, Errors: 0, Skipped: 0, Time elapsed: 0.005 sec
Running org.apache.jackrabbit.spi.commons.query.sql2.ParserTest
Tests run: 2, Failures: 0, Errors: 0, Skipped: 0, Time elapsed: 0.441 sec
Running org.apache.jackrabbit.spi.commons.nodetype.constraint.NumericConstraintTest
Tests run: 10, Failures: 0, Errors: 0, Skipped: 0, Time elapsed: 0.011 sec
Running org.apache.jackrabbit.spi.commons.name.MatcherTest
Tests run: 3, Failures: 0, Errors: 0, Skipped: 0, Time elapsed: 0.047 sec
Running org.apache.jackrabbit.spi.commons.nodetype.constraint.StringConstraintTest
Tests run: 10, Failures: 0, Errors: 0, Skipped: 0, Time elapsed: 0.006 sec
Running org.apache.jackrabbit.spi.commons.nodetype.constraint.BooleanConstraintTest
Tests run: 11, Failures: 0, Errors: 0, Skipped: 0, Time elapsed: 0.005 sec
Running org.apache.jackrabbit.spi.commons.nodetype.NodeDefinitionTemplateImplTest
Tests run: 1, Failures: 0, Errors: 0, Skipped: 0, Time elapsed: 0.004 sec
Running org.apache.jackrabbit.spi.commons.identifier.SerializationTest
Tests run: 2, Failures: 0, Errors: 0, Skipped: 0, Time elapsed: 0.018 sec
Running org.apache.jackrabbit.spi.commons.name.NameFactoryTest
Tests run: 3, Failures: 0, Errors: 0, Skipped: 0, Time elapsed: 0.005 sec
Running org.apache.jackrabbit.spi.commons.query.xpath.XPathOrderByTest
Tests run: 5, Failures: 0, Errors: 0, Skipped: 0, Time elapsed: 0.093 sec
Running org.apache.jackrabbit.spi.commons.nodetype.constraint.ReferenceConstraintTest
Tests run: 10, Failures: 0, Errors: 0, Skipped: 0, Time elapsed: 0.005 sec
Running org.apache.jackrabbit.spi.commons.query.xpath.QueryFormatTest
Tests run: 3, Failures: 0, Errors: 0, Skipped: 0, Time elapsed: 0.006 sec
Running org.apache.jackrabbit.spi.commons.name.PathTest
Tests run: 38, Failures: 0, Errors: 0, Skipped: 0, Time elapsed: 0.036 sec
Running org.apache.jackrabbit.spi.commons.name.PathFactoryTest
Tests run: 14, Failures: 0, Errors: 0, Skipped: 0, Time elapsed: 0.009 sec
Running org.apache.jackrabbit.spi.commons.conversion.PathParserTest
Tests run: 12, Failures: 0, Errors: 0, Skipped: 0, Time elapsed: 0.016 sec
Running org.apache.jackrabbit.spi.commons.name.PathBuilderTest
Tests run: 2, Failures: 0, Errors: 0, Skipped: 0, Time elapsed: 0.006 sec
Running org.apache.jackrabbit.spi.commons.conversion.NameParserTest
Tests run: 4, Failures: 0, Errors: 0, Skipped: 0, Time elapsed: 0.006 sec
Running org.apache.jackrabbit.spi.commons.nodetype.constraint.DateConstraintTest
Tests run: 10, Failures: 0, Errors: 0, Skipped: 0, Time elapsed: 0.012 sec
Running org.apache.jackrabbit.spi.commons.nodetype.constraint.NameConstraintTest
Tests run: 10, Failures: 0, Errors: 0, Skipped: 0, Time elapsed: 0.011 sec
Running org.apache.jackrabbit.spi.commons.nodetype.TestAll
Tests run: 3, Failures: 0, Errors: 0, Skipped: 0, Time elapsed: 0.002 sec
Running org.apache.jackrabbit.spi.commons.name.PatternTest
Tests run: 13, Failures: 0, Errors: 0, Skipped: 0, Time elapsed: 0.018 sec

Results :

Tests run: 255, Failures: 0, Errors: 0, Skipped: 0

[JENKINS] Recording test results
[INFO] [bundle:bundle {execution: default-bundle}]
[INFO] [apache-rat:check {execution: default}]
[INFO] Exclude: src/main/javacc/xpath/*
[INFO] [install:install {execution: default-install}]
[INFO] Installing <https://builds.apache.org/job/Jackrabbit-2.2/ws/2.2/jackrabbit-spi-commons/target/jackrabbit-spi-commons-2.2.14-SNAPSHOT.jar>
to /home/jenkins/jenkins-slave/maven-repositories/0/org/apache/jackrabbit/jackrabbit-spi-commons/2.2.14-SNAPSHOT/jackrabbit-spi-commons-2.2.14-SNAPSHOT.jar
[INFO] [bundle:install {execution: default-install}]
[INFO] Parsing file:/home/jenkins/jenkins-slave/maven-repositories/0/repository.xml
[Fatal Error] :-1:-1: Premature end of file.
org.xml.sax.SAXParseException: Premature end of file.
	at com.sun.org.apache.xerces.internal.parsers.DOMParser.parse(DOMParser.java:264)
	at com.sun.org.apache.xerces.internal.jaxp.DocumentBuilderImpl.parse(DocumentBuilderImpl.java:292)
	at javax.xml.parsers.DocumentBuilder.parse(DocumentBuilder.java:172)
	at org.apache.felix.obrplugin.ObrUpdate.parseFile(ObrUpdate.java:347)
	at org.apache.felix.obrplugin.ObrUpdate.parseRepositoryXml(ObrUpdate.java:324)
	at org.apache.felix.obrplugin.ObrInstall.execute(ObrInstall.java:140)
	at org.apache.maven.plugin.DefaultPluginManager.executeMojo(DefaultPluginManager.java:490)
	at hudson.maven.agent.PluginManagerInterceptor.executeMojo(PluginManagerInterceptor.java:182)
	at org.apache.maven.lifecycle.DefaultLifecycleExecutor.executeGoals(DefaultLifecycleExecutor.java:694)
	at org.apache.maven.lifecycle.DefaultLifecycleExecutor.executeGoalWithLifecycle(DefaultLifecycleExecutor.java:556)
	at org.apache.maven.lifecycle.DefaultLifecycleExecutor.executeGoal(DefaultLifecycleExecutor.java:535)
	at org.apache.maven.lifecycle.DefaultLifecycleExecutor.executeGoalAndHandleFailures(DefaultLifecycleExecutor.java:387)
	at org.apache.maven.lifecycle.DefaultLifecycleExecutor.executeTaskSegments(DefaultLifecycleExecutor.java:348)
	at org.apache.maven.lifecycle.DefaultLifecycleExecutor.execute(DefaultLifecycleExecutor.java:180)
	at org.apache.maven.lifecycle.LifecycleExecutorInterceptor.execute(LifecycleExecutorInterceptor.java:65)
	at org.apache.maven.DefaultMaven.doExecute(DefaultMaven.java:328)
	at org.apache.maven.DefaultMaven.execute(DefaultMaven.java:138)
	at org.apache.maven.cli.MavenCli.main(MavenCli.java:362)
	at sun.reflect.NativeMethodAccessorImpl.invoke0(Native Method)
	at sun.reflect.NativeMethodAccessorImpl.invoke(NativeMethodAccessorImpl.java:39)
	at sun.reflect.DelegatingMethodAccessorImpl.invoke(DelegatingMethodAccessorImpl.java:25)
	at java.lang.reflect.Method.invoke(Method.java:592)
	at org.codehaus.classworlds.Launcher.launchEnhanced(Launcher.java:315)
	at org.codehaus.classworlds.Launcher.launch(Launcher.java:255)
	at hudson.maven.agent.Main.launch(Main.java:185)
	at hudson.maven.MavenBuilder.call(MavenBuilder.java:153)
	at hudson.maven.Maven2Builder.call(Maven2Builder.java:79)
	at hudson.maven.Maven2Builder.call(Maven2Builder.java:55)
	at hudson.remoting.UserRequest.perform(UserRequest.java:118)
	at hudson.remoting.UserRequest.perform(UserRequest.java:48)
	at hudson.remoting.Request$2.run(Request.java:326)
	at hudson.remoting.InterceptingExecutorService$1.call(InterceptingExecutorService.java:72)
	at java.util.concurrent.FutureTask$Sync.innerRun(FutureTask.java:269)
	at java.util.concurrent.FutureTask.run(FutureTask.java:123)
	at java.util.concurrent.ThreadPoolExecutor$Worker.runTask(ThreadPoolExecutor.java:651)
	at java.util.concurrent.ThreadPoolExecutor$Worker.run(ThreadPoolExecutor.java:676)
	at java.lang.Thread.run(Thread.java:595)
[INFO] Writing OBR metadata
[INFO] [deploy:deploy {execution: default-deploy}]
[INFO] Retrieving previous build number from apache.snapshots.https
[WARNING] *** CHECKSUM FAILED - Checksum failed on download: local = 'e9b91d5e770ff21ab09493c43e56e18a218ab3b9';
remote = '9790c367907a0da1227beb1b157d6c0732392cc4' - RETRYING
[WARNING] *** CHECKSUM FAILED - Checksum failed on download: local = 'e9b91d5e770ff21ab09493c43e56e18a218ab3b9';
remote = '9790c367907a0da1227beb1b157d6c0732392cc4' - IGNORING
Uploading: https://repository.apache.org/content/repositories/snapshots/org/apache/jackrabbit/jackrabbit-spi-commons/2.2.14-SNAPSHOT/jackrabbit-spi-commons-2.2.14-20130128.090248-7.jar
724K uploaded  (jackrabbit-spi-commons-2.2.14-20130128.090248-7.jar)
[INFO] Retrieving previous metadata from apache.snapshots.https
[INFO] Uploading repository metadata for: 'artifact org.apache.jackrabbit:jackrabbit-spi-commons'
[INFO] Retrieving previous metadata from apache.snapshots.https
[WARNING] *** CHECKSUM FAILED - Checksum failed on download: local = 'e9b91d5e770ff21ab09493c43e56e18a218ab3b9';
remote = '9790c367907a0da1227beb1b157d6c0732392cc4' - RETRYING
[WARNING] *** CHECKSUM FAILED - Checksum failed on download: local = 'e9b91d5e770ff21ab09493c43e56e18a218ab3b9';
remote = '9790c367907a0da1227beb1b157d6c0732392cc4' - IGNORING
[INFO] Uploading repository metadata for: 'snapshot org.apache.jackrabbit:jackrabbit-spi-commons:2.2.14-SNAPSHOT'
[INFO] Uploading project information for jackrabbit-spi-commons 2.2.14-20130128.090248-7
[INFO] [bundle:deploy {execution: default-deploy}]
[INFO] Remote OBR update disabled (enable with -DremoteOBR)
[JENKINS] Archiving disabled
[INFO] ------------------------------------------------------------------------
[INFO] Building Jackrabbit Core
[INFO]    task-segment: [clean, deploy]
[INFO] ------------------------------------------------------------------------
[INFO] [clean:clean {execution: default-clean}]
[TASKS] Scanning folder '<https://builds.apache.org/job/Jackrabbit-2.2/ws/2.2/jackrabbit-core'>
for files matching the pattern '**/*.java' - excludes: 
[TASKS] Found 1052 files to scan for tasks
Found 235 open tasks.
[TASKS] Computing warning deltas based on reference build #96
Downloading: http://repo1.maven.org/maven2/org/apache/jackrabbit/jackrabbit-jcr-benchmark/1.5.0/jackrabbit-jcr-benchmark-1.5.0.pom
2K downloaded  (jackrabbit-jcr-benchmark-1.5.0.pom)
Downloading: http://repo1.maven.org/maven2/org/apache/jackrabbit/jackrabbit-jcr-tests/1.5.0/jackrabbit-jcr-tests-1.5.0.pom
2K downloaded  (jackrabbit-jcr-tests-1.5.0.pom)
Downloading: http://repo1.maven.org/maven2/com/h2database/h2/1.3.149/h2-1.3.149.pom
670b downloaded  (h2-1.3.149.pom)
[INFO] snapshot org.apache.jackrabbit:jackrabbit-api:2.2.14-SNAPSHOT: checking for updates
from apache.snapshots
Downloading: http://repo1.maven.org/maven2/com/h2database/h2/1.3.149/h2-1.3.149.jar
1209K downloaded  (h2-1.3.149.jar)
[INFO] snapshot org.apache.jackrabbit:jackrabbit-spi-commons:2.2.14-SNAPSHOT: checking for
updates from apache.snapshots
Downloading: http://repo1.maven.org/maven2/org/apache/jackrabbit/jackrabbit-jcr-benchmark/1.5.0/jackrabbit-jcr-benchmark-1.5.0.jar
11K downloaded  (jackrabbit-jcr-benchmark-1.5.0.jar)
[INFO] [remote-resources:process {execution: default}]
[INFO] [resources:resources {execution: default-resources}]
[INFO] Using 'UTF-8' encoding to copy filtered resources.
[INFO] Copying 65 resources
[INFO] Copying 1 resource
[INFO] Copying 3 resources
[INFO] [compiler:compile {execution: default-compile}]
[INFO] Compiling 713 source files to <https://builds.apache.org/job/Jackrabbit-2.2/ws/2.2/jackrabbit-core/target/classes>
[INFO] [resources:testResources {execution: default-testResources}]
[INFO] Using 'UTF-8' encoding to copy filtered resources.
[INFO] Copying 27 resources
[INFO] Copying 3 resources
[INFO] [antrun:run {execution: process-test-resources}]
[INFO] Executing tasks
     [copy] Copying 34 files to <https://builds.apache.org/job/Jackrabbit-2.2/ws/2.2/jackrabbit-core/target/repository>
     [copy] Copying 34 files to <https://builds.apache.org/job/Jackrabbit-2.2/ws/2.2/jackrabbit-core/target/repository-2>
[INFO] Executed tasks
[INFO] [compiler:testCompile {execution: default-testCompile}]
[INFO] Compiling 339 source files to <https://builds.apache.org/job/Jackrabbit-2.2/ws/2.2/jackrabbit-core/target/test-classes>
[INFO] [surefire:test {execution: default-test}]
[INFO] Surefire report directory: <https://builds.apache.org/job/Jackrabbit-2.2/ws/2.2/jackrabbit-core/target/surefire-reports>

-------------------------------------------------------
 T E S T S
-------------------------------------------------------
Running org.apache.jackrabbit.core.version.TestAll
Tests run: 5, Failures: 0, Errors: 0, Skipped: 0, Time elapsed: 16.254 sec
Running org.apache.jackrabbit.core.security.authorization.principalbased.TestAll
Tests run: 96, Failures: 0, Errors: 0, Skipped: 0, Time elapsed: 0.427 sec
Running org.apache.jackrabbit.api.security.TestAll
Tests run: 4, Failures: 0, Errors: 0, Skipped: 0, Time elapsed: 0.039 sec
Running org.apache.jackrabbit.core.security.authorization.acl.TestAll
Tests run: 130, Failures: 0, Errors: 0, Skipped: 0, Time elapsed: 9.518 sec
Running org.apache.jackrabbit.core.config.TestAll
Tests run: 25, Failures: 0, Errors: 0, Skipped: 0, Time elapsed: 0.239 sec
Running org.apache.jackrabbit.core.query.lucene.directory.TestAll
Tests run: 6, Failures: 0, Errors: 0, Skipped: 0, Time elapsed: 0.053 sec
Running org.apache.jackrabbit.core.security.user.TestAll
Tests run: 179, Failures: 0, Errors: 0, Skipped: 0, Time elapsed: 3.521 sec
Running org.apache.jackrabbit.core.security.authentication.TestAll
Tests run: 12, Failures: 0, Errors: 0, Skipped: 0, Time elapsed: 0.083 sec
Running org.apache.jackrabbit.core.journal.TestAll
Tests run: 4, Failures: 0, Errors: 0, Skipped: 0, Time elapsed: 1.032 sec
Running org.apache.jackrabbit.api.security.principal.TestAll
Tests run: 16, Failures: 0, Errors: 0, Skipped: 0, Time elapsed: 0.092 sec
Running org.apache.jackrabbit.core.state.TestAll
Tests run: 46, Failures: 0, Errors: 0, Skipped: 0, Time elapsed: 4.815 sec
Running org.apache.jackrabbit.api.TestAll
Tests run: 2, Failures: 0, Errors: 0, Skipped: 0, Time elapsed: 0.168 sec
Running org.apache.jackrabbit.core.security.TestAll
Tests run: 16, Failures: 0, Errors: 0, Skipped: 0, Time elapsed: 1.075 sec
Running org.apache.jackrabbit.core.lock.TestAll
Tests run: 7, Failures: 0, Errors: 0, Skipped: 0, Time elapsed: 10.58 sec
Running org.apache.jackrabbit.core.security.principal.TestAll
Tests run: 6, Failures: 0, Errors: 0, Skipped: 0, Time elapsed: 0.038 sec
Running org.apache.jackrabbit.core.util.TestAll
Tests run: 4, Failures: 0, Errors: 0, Skipped: 0, Time elapsed: 2.252 sec
Running org.apache.jackrabbit.core.persistence.util.TestAll
Tests run: 10, Failures: 0, Errors: 0, Skipped: 0, Time elapsed: 0.021 sec
Running org.apache.jackrabbit.api.security.user.TestAll
Tests run: 113, Failures: 0, Errors: 0, Skipped: 0, Time elapsed: 20.962 sec
Running org.apache.jackrabbit.core.nodetype.xml.TestAll
Tests run: 38, Failures: 0, Errors: 0, Skipped: 0, Time elapsed: 0.711 sec
Running org.apache.jackrabbit.core.cluster.TestAll
Tests run: 11, Failures: 0, Errors: 0, Skipped: 0, Time elapsed: 4.714 sec
Running org.apache.jackrabbit.core.TestAll
Tests run: 134, Failures: 0, Errors: 0, Skipped: 0, Time elapsed: 4.661 sec
Running org.apache.jackrabbit.core.fs.TestAll
Tests run: 3, Failures: 0, Errors: 0, Skipped: 0, Time elapsed: 1.175 sec
Running org.apache.jackrabbit.core.security.authorization.combined.TestAll
Tests run: 51, Failures: 0, Errors: 0, Skipped: 0, Time elapsed: 0.901 sec
Running org.apache.jackrabbit.core.xml.TestAll
Tests run: 13, Failures: 0, Errors: 0, Skipped: 0, Time elapsed: 0.181 sec
Running org.apache.jackrabbit.core.util.db.TestAll
Tests run: 13, Failures: 0, Errors: 0, Skipped: 0, Time elapsed: 0.915 sec
Running org.apache.jackrabbit.core.observation.TestAll
Tests run: 14, Failures: 0, Errors: 0, Skipped: 0, Time elapsed: 0.232 sec
Running org.apache.jackrabbit.core.retention.TestAll
Tests run: 5, Failures: 0, Errors: 0, Skipped: 0, Time elapsed: 0.016 sec
Running org.apache.jackrabbit.core.value.TestAll
Tests run: 92, Failures: 0, Errors: 0, Skipped: 0, Time elapsed: 0.076 sec
Running org.apache.jackrabbit.core.nodetype.TestAll
Tests run: 2, Failures: 0, Errors: 0, Skipped: 0, Time elapsed: 0.439 sec
Running org.apache.jackrabbit.core.id.TestAll
Tests run: 6, Failures: 0, Errors: 0, Skipped: 0, Time elapsed: 0.005 sec
Running org.apache.jackrabbit.core.query.lucene.TestAll
Tests run: 15, Failures: 0, Errors: 0, Skipped: 0, Time elapsed: 4.56 sec
Running org.apache.jackrabbit.core.persistence.TestAll
Tests run: 1, Failures: 0, Errors: 0, Skipped: 0, Time elapsed: 5.128 sec
Running org.apache.jackrabbit.core.query.TestAll
Tests run: 205, Failures: 0, Errors: 0, Skipped: 0, Time elapsed: 6.717 sec
Running org.apache.jackrabbit.core.security.authorization.TestAll
Tests run: 29, Failures: 0, Errors: 0, Skipped: 0, Time elapsed: 0.061 sec
Running org.apache.jackrabbit.core.data.TestAll
Tests run: 30, Failures: 0, Errors: 0, Skipped: 0, Time elapsed: 12.719 sec

Results :

Tests run: 1343, Failures: 0, Errors: 0, Skipped: 0

[locks-and-latches] Releasing all the locks
[locks-and-latches] All the locks released
ERROR: Maven JVM terminated unexpectedly with exit code 143


Mime
View raw message