jackrabbit-dev mailing list archives

Site index · List index
Message view « Date » · « Thread »
Top « Date » · « Thread »
From Apache Jenkins Server <jenk...@builds.apache.org>
Subject Build failed in Jenkins: Jackrabbit-2.2 #93
Date Mon, 29 Oct 2012 20:14:28 GMT
See <https://builds.apache.org/job/Jackrabbit-2.2/93/changes>

Changes:

[reschke] JCR-3439: let PrincipalManagerImpl.CheckedGroup implement JackrabbitPrincipal (also
improve equals() method) (ported to 2.2)

------------------------------------------
[...truncated 4424 lines...]
[WARNING] *** CHECKSUM FAILED - Checksum failed on download: local = 'ddd106e42e6f5874787c7480e74e1506cf119846';
remote = '5e533bac027b3154da2e0ce81ded4bf39361a310' - IGNORING
[INFO] Uploading repository metadata for: 'snapshot org.apache.jackrabbit:jackrabbit-spi:2.2.14-SNAPSHOT'
[INFO] Retrieving previous metadata from apache.snapshots.https
[INFO] Uploading repository metadata for: 'artifact org.apache.jackrabbit:jackrabbit-spi'
[INFO] Uploading project information for jackrabbit-spi 2.2.14-20121029.201300-4
[INFO] Retrieving previous build number from apache.snapshots.https
Uploading: https://repository.apache.org/content/repositories/snapshots/org/apache/jackrabbit/jackrabbit-spi/2.2.14-SNAPSHOT/jackrabbit-spi-2.2.14-20121029.201300-4-tests.jar
23K uploaded  (jackrabbit-spi-2.2.14-20121029.201300-4-tests.jar)
[INFO] [bundle:deploy {execution: default-deploy}]
[INFO] Remote OBR update disabled (enable with -DremoteOBR)
[JENKINS] Archiving disabled - not archiving <https://builds.apache.org/job/Jackrabbit-2.2/ws/2.2/jackrabbit-spi/pom.xml>
[JENKINS] Archiving disabled - not archiving <https://builds.apache.org/job/Jackrabbit-2.2/ws/2.2/jackrabbit-spi/target/jackrabbit-spi-2.2.14-SNAPSHOT.jar>
[JENKINS] Archiving disabled - not archiving <https://builds.apache.org/job/Jackrabbit-2.2/ws/2.2/jackrabbit-spi/target/jackrabbit-spi-2.2.14-SNAPSHOT-tests.jar>
[INFO] ------------------------------------------------------------------------
[INFO] Building Jackrabbit SPI Commons
[INFO]    task-segment: [clean, deploy]
[INFO] ------------------------------------------------------------------------
[INFO] [clean:clean {execution: default-clean}]
[TASKS] Scanning folder '<https://builds.apache.org/job/Jackrabbit-2.2/ws/2.2/jackrabbit-spi-commons'>
for files matching the pattern '**/*.java' - excludes: 
[TASKS] Found 234 files to scan for tasks
Found 40 open tasks.
[TASKS] Computing warning deltas based on reference build #92
[INFO] [javacc:jjtree-javacc {execution: sql}]
Java Compiler Compiler Version 4.0 (Tree Builder)
(type "jjtree" with no arguments for help)
Reading from file <https://builds.apache.org/job/Jackrabbit-2.2/ws/2.2/jackrabbit-spi-commons/src/main/javacc/sql/JCRSQL.jjt>
. . .
File "<https://builds.apache.org/job/Jackrabbit-2.2/ws/2.2/jackrabbit-spi-commons/target/generated-sources/jjtree/org/apache/jackrabbit/spi/commons/query/sql/Node.java">
does not exist.  Will create one.
File "<https://builds.apache.org/job/Jackrabbit-2.2/ws/2.2/jackrabbit-spi-commons/target/generated-sources/jjtree/org/apache/jackrabbit/spi/commons/query/sql/SimpleNode.java">
does not exist.  Will create one.
File "<https://builds.apache.org/job/Jackrabbit-2.2/ws/2.2/jackrabbit-spi-commons/target/generated-sources/jjtree/org/apache/jackrabbit/spi/commons/query/sql/ASTQuery.java">
does not exist.  Will create one.
File "<https://builds.apache.org/job/Jackrabbit-2.2/ws/2.2/jackrabbit-spi-commons/target/generated-sources/jjtree/org/apache/jackrabbit/spi/commons/query/sql/ASTSelectList.java">
does not exist.  Will create one.
File "<https://builds.apache.org/job/Jackrabbit-2.2/ws/2.2/jackrabbit-spi-commons/target/generated-sources/jjtree/org/apache/jackrabbit/spi/commons/query/sql/ASTFromClause.java">
does not exist.  Will create one.
File "<https://builds.apache.org/job/Jackrabbit-2.2/ws/2.2/jackrabbit-spi-commons/target/generated-sources/jjtree/org/apache/jackrabbit/spi/commons/query/sql/ASTWhereClause.java">
does not exist.  Will create one.
File "<https://builds.apache.org/job/Jackrabbit-2.2/ws/2.2/jackrabbit-spi-commons/target/generated-sources/jjtree/org/apache/jackrabbit/spi/commons/query/sql/ASTPredicate.java">
does not exist.  Will create one.
File "<https://builds.apache.org/job/Jackrabbit-2.2/ws/2.2/jackrabbit-spi-commons/target/generated-sources/jjtree/org/apache/jackrabbit/spi/commons/query/sql/ASTLowerFunction.java">
does not exist.  Will create one.
File "<https://builds.apache.org/job/Jackrabbit-2.2/ws/2.2/jackrabbit-spi-commons/target/generated-sources/jjtree/org/apache/jackrabbit/spi/commons/query/sql/ASTUpperFunction.java">
does not exist.  Will create one.
File "<https://builds.apache.org/job/Jackrabbit-2.2/ws/2.2/jackrabbit-spi-commons/target/generated-sources/jjtree/org/apache/jackrabbit/spi/commons/query/sql/ASTOrExpression.java">
does not exist.  Will create one.
File "<https://builds.apache.org/job/Jackrabbit-2.2/ws/2.2/jackrabbit-spi-commons/target/generated-sources/jjtree/org/apache/jackrabbit/spi/commons/query/sql/ASTAndExpression.java">
does not exist.  Will create one.
File "<https://builds.apache.org/job/Jackrabbit-2.2/ws/2.2/jackrabbit-spi-commons/target/generated-sources/jjtree/org/apache/jackrabbit/spi/commons/query/sql/ASTNotExpression.java">
does not exist.  Will create one.
File "<https://builds.apache.org/job/Jackrabbit-2.2/ws/2.2/jackrabbit-spi-commons/target/generated-sources/jjtree/org/apache/jackrabbit/spi/commons/query/sql/ASTBracketExpression.java">
does not exist.  Will create one.
File "<https://builds.apache.org/job/Jackrabbit-2.2/ws/2.2/jackrabbit-spi-commons/target/generated-sources/jjtree/org/apache/jackrabbit/spi/commons/query/sql/ASTContainsExpression.java">
does not exist.  Will create one.
File "<https://builds.apache.org/job/Jackrabbit-2.2/ws/2.2/jackrabbit-spi-commons/target/generated-sources/jjtree/org/apache/jackrabbit/spi/commons/query/sql/ASTLiteral.java">
does not exist.  Will create one.
File "<https://builds.apache.org/job/Jackrabbit-2.2/ws/2.2/jackrabbit-spi-commons/target/generated-sources/jjtree/org/apache/jackrabbit/spi/commons/query/sql/ASTIdentifier.java">
does not exist.  Will create one.
File "<https://builds.apache.org/job/Jackrabbit-2.2/ws/2.2/jackrabbit-spi-commons/target/generated-sources/jjtree/org/apache/jackrabbit/spi/commons/query/sql/ASTExcerptFunction.java">
does not exist.  Will create one.
File "<https://builds.apache.org/job/Jackrabbit-2.2/ws/2.2/jackrabbit-spi-commons/target/generated-sources/jjtree/org/apache/jackrabbit/spi/commons/query/sql/ASTOrderByClause.java">
does not exist.  Will create one.
File "<https://builds.apache.org/job/Jackrabbit-2.2/ws/2.2/jackrabbit-spi-commons/target/generated-sources/jjtree/org/apache/jackrabbit/spi/commons/query/sql/ASTOrderSpec.java">
does not exist.  Will create one.
File "<https://builds.apache.org/job/Jackrabbit-2.2/ws/2.2/jackrabbit-spi-commons/target/generated-sources/jjtree/org/apache/jackrabbit/spi/commons/query/sql/ASTAscendingOrderSpec.java">
does not exist.  Will create one.
File "<https://builds.apache.org/job/Jackrabbit-2.2/ws/2.2/jackrabbit-spi-commons/target/generated-sources/jjtree/org/apache/jackrabbit/spi/commons/query/sql/ASTDescendingOrderSpec.java">
does not exist.  Will create one.
Annotated grammar generated successfully in <https://builds.apache.org/job/Jackrabbit-2.2/ws/2.2/jackrabbit-spi-commons/target/generated-sources/jjtree/org/apache/jackrabbit/spi/commons/query/sql/JCRSQL.jj>
Java Compiler Compiler Version 4.0 (Parser Generator)
(type "javacc" with no arguments for help)
Reading from file <https://builds.apache.org/job/Jackrabbit-2.2/ws/2.2/jackrabbit-spi-commons/target/generated-sources/jjtree/org/apache/jackrabbit/spi/commons/query/sql/JCRSQL.jj>
. . .
Note: UNICODE_INPUT option is specified. Please make sure you create the parser/lexer using
a Reader with the correct character encoding.
File "TokenMgrError.java" does not exist.  Will create one.
File "ParseException.java" does not exist.  Will create one.
File "Token.java" does not exist.  Will create one.
File "SimpleCharStream.java" does not exist.  Will create one.
Parser generated successfully.
[INFO] Processed 1 grammar
[INFO] [javacc:jjtree-javacc {execution: xpath}]
Java Compiler Compiler Version 4.0 (Tree Builder)
(type "jjtree" with no arguments for help)
Reading from file <https://builds.apache.org/job/Jackrabbit-2.2/ws/2.2/jackrabbit-spi-commons/src/main/javacc/xpath/XPath.jjt>
. . .
File "<https://builds.apache.org/job/Jackrabbit-2.2/ws/2.2/jackrabbit-spi-commons/target/generated-sources/jjtree/org/apache/jackrabbit/spi/commons/query/xpath/Node.java">
does not exist.  Will create one.
File "<https://builds.apache.org/job/Jackrabbit-2.2/ws/2.2/jackrabbit-spi-commons/target/generated-sources/jjtree/org/apache/jackrabbit/spi/commons/query/xpath/SimpleNode.java">
does not exist.  Will create one.
Annotated grammar generated successfully in <https://builds.apache.org/job/Jackrabbit-2.2/ws/2.2/jackrabbit-spi-commons/target/generated-sources/jjtree/org/apache/jackrabbit/spi/commons/query/xpath/XPath.jj>
Java Compiler Compiler Version 4.0 (Parser Generator)
(type "javacc" with no arguments for help)
Reading from file <https://builds.apache.org/job/Jackrabbit-2.2/ws/2.2/jackrabbit-spi-commons/target/generated-sources/jjtree/org/apache/jackrabbit/spi/commons/query/xpath/XPath.jj>
. . .
Warning: Line 535, Column 2: Non-ASCII characters used in regular expression.
Please make sure you use the correct Reader when you create the parser that can handle your
character set.
Warning:  "\'" cannot be matched as a string literal token at line 1566, column 2. It will
be matched as  <AposAttrContentChar>.
File "TokenMgrError.java" does not exist.  Will create one.
File "ParseException.java" does not exist.  Will create one.
File "Token.java" does not exist.  Will create one.
File "SimpleCharStream.java" does not exist.  Will create one.
Parser generated with 0 errors and 2 warnings.
[INFO] Processed 1 grammar
[INFO] snapshot org.apache.jackrabbit:jackrabbit-spi:2.2.14-SNAPSHOT: checking for updates
from apache.snapshots
[INFO] snapshot org.apache.jackrabbit:jackrabbit-jcr-commons:2.2.14-SNAPSHOT: checking for
updates from apache.snapshots
[INFO] [antrun:run {execution: delete-sources}]
[INFO] Executing tasks
     [echo] Remove files that have been customized in Jackrabbit
[INFO] Executed tasks
[INFO] [remote-resources:process {execution: default}]
[INFO] [resources:resources {execution: default-resources}]
[INFO] Using 'UTF-8' encoding to copy filtered resources.
[INFO] Copying 1 resource
[INFO] Copying 3 resources
[INFO] [compiler:compile {execution: default-compile}]
[INFO] Compiling 238 source files to <https://builds.apache.org/job/Jackrabbit-2.2/ws/2.2/jackrabbit-spi-commons/target/classes>
[INFO] [resources:testResources {execution: default-testResources}]
[INFO] Using 'UTF-8' encoding to copy filtered resources.
[INFO] Copying 3 resources
[INFO] Copying 3 resources
[INFO] [compiler:testCompile {execution: default-testCompile}]
[INFO] Compiling 34 source files to <https://builds.apache.org/job/Jackrabbit-2.2/ws/2.2/jackrabbit-spi-commons/target/test-classes>
[INFO] [surefire:test {execution: default-test}]
[INFO] Surefire report directory: <https://builds.apache.org/job/Jackrabbit-2.2/ws/2.2/jackrabbit-spi-commons/target/surefire-reports>

-------------------------------------------------------
 T E S T S
-------------------------------------------------------
Running org.apache.jackrabbit.spi.commons.batch.ConsolidatedBatchTest
Tests run: 1, Failures: 0, Errors: 0, Skipped: 0, Time elapsed: 0.059 sec
Running org.apache.jackrabbit.spi.commons.conversion.ParsingPathResolverTest
Tests run: 4, Failures: 0, Errors: 0, Skipped: 0, Time elapsed: 0.026 sec
Running org.apache.jackrabbit.spi.commons.nodetype.compact.CompactNodeTypeDefTest
Tests run: 1, Failures: 0, Errors: 0, Skipped: 0, Time elapsed: 0.207 sec
Running org.apache.jackrabbit.spi.commons.value.QValueTest
Tests run: 58, Failures: 0, Errors: 0, Skipped: 0, Time elapsed: 0.131 sec
Running org.apache.jackrabbit.spi.commons.value.ValueFormatTest
Tests run: 5, Failures: 0, Errors: 0, Skipped: 0, Time elapsed: 0.008 sec
Running org.apache.jackrabbit.spi.commons.nodetype.constraint.PathConstraintTest
Tests run: 10, Failures: 0, Errors: 0, Skipped: 0, Time elapsed: 0.006 sec
Running org.apache.jackrabbit.spi.commons.conversion.ParsingNameResolverTest
Tests run: 2, Failures: 0, Errors: 0, Skipped: 0, Time elapsed: 0.003 sec
Running org.apache.jackrabbit.spi.commons.nodetype.PropertyDefinitionTemplateImplTest
Tests run: 2, Failures: 0, Errors: 0, Skipped: 0, Time elapsed: 0.009 sec
Running org.apache.jackrabbit.spi.commons.name.ElementTest
Tests run: 6, Failures: 0, Errors: 0, Skipped: 0, Time elapsed: 0.003 sec
Running org.apache.jackrabbit.spi.commons.query.sql2.ParserTest
Tests run: 2, Failures: 0, Errors: 0, Skipped: 0, Time elapsed: 0.376 sec
Running org.apache.jackrabbit.spi.commons.name.MatcherTest
Tests run: 3, Failures: 0, Errors: 0, Skipped: 0, Time elapsed: 0.009 sec
Running org.apache.jackrabbit.spi.commons.nodetype.constraint.NumericConstraintTest
Tests run: 10, Failures: 0, Errors: 0, Skipped: 0, Time elapsed: 0.01 sec
Running org.apache.jackrabbit.spi.commons.nodetype.constraint.StringConstraintTest
Tests run: 10, Failures: 0, Errors: 0, Skipped: 0, Time elapsed: 0.004 sec
Running org.apache.jackrabbit.spi.commons.nodetype.constraint.BooleanConstraintTest
Tests run: 11, Failures: 0, Errors: 0, Skipped: 0, Time elapsed: 0.004 sec
Running org.apache.jackrabbit.spi.commons.nodetype.NodeDefinitionTemplateImplTest
Tests run: 1, Failures: 0, Errors: 0, Skipped: 0, Time elapsed: 0.002 sec
Running org.apache.jackrabbit.spi.commons.identifier.SerializationTest
Tests run: 2, Failures: 0, Errors: 0, Skipped: 0, Time elapsed: 0.015 sec
Running org.apache.jackrabbit.spi.commons.name.NameFactoryTest
Tests run: 3, Failures: 0, Errors: 0, Skipped: 0, Time elapsed: 0.004 sec
Running org.apache.jackrabbit.spi.commons.query.xpath.XPathOrderByTest
Tests run: 5, Failures: 0, Errors: 0, Skipped: 0, Time elapsed: 0.073 sec
Running org.apache.jackrabbit.spi.commons.nodetype.constraint.ReferenceConstraintTest
Tests run: 10, Failures: 0, Errors: 0, Skipped: 0, Time elapsed: 0.004 sec
Running org.apache.jackrabbit.spi.commons.query.xpath.QueryFormatTest
Tests run: 3, Failures: 0, Errors: 0, Skipped: 0, Time elapsed: 0.005 sec
Running org.apache.jackrabbit.spi.commons.name.PathTest
Tests run: 38, Failures: 0, Errors: 0, Skipped: 0, Time elapsed: 0.027 sec
Running org.apache.jackrabbit.spi.commons.name.PathFactoryTest
Tests run: 14, Failures: 0, Errors: 0, Skipped: 0, Time elapsed: 0.007 sec
Running org.apache.jackrabbit.spi.commons.conversion.PathParserTest
Tests run: 12, Failures: 0, Errors: 0, Skipped: 0, Time elapsed: 0.013 sec
Running org.apache.jackrabbit.spi.commons.name.PathBuilderTest
Tests run: 2, Failures: 0, Errors: 0, Skipped: 0, Time elapsed: 0.004 sec
Running org.apache.jackrabbit.spi.commons.conversion.NameParserTest
Tests run: 4, Failures: 0, Errors: 0, Skipped: 0, Time elapsed: 0.005 sec
Running org.apache.jackrabbit.spi.commons.nodetype.constraint.DateConstraintTest
Tests run: 10, Failures: 0, Errors: 0, Skipped: 0, Time elapsed: 0.01 sec
Running org.apache.jackrabbit.spi.commons.nodetype.constraint.NameConstraintTest
Tests run: 10, Failures: 0, Errors: 0, Skipped: 0, Time elapsed: 0.009 sec
Running org.apache.jackrabbit.spi.commons.nodetype.TestAll
Tests run: 3, Failures: 0, Errors: 0, Skipped: 0, Time elapsed: 0.002 sec
Running org.apache.jackrabbit.spi.commons.name.PatternTest
Tests run: 13, Failures: 0, Errors: 0, Skipped: 0, Time elapsed: 0.014 sec

Results :

Tests run: 255, Failures: 0, Errors: 0, Skipped: 0

[JENKINS] Recording test results
[INFO] [bundle:bundle {execution: default-bundle}]
[INFO] [apache-rat:check {execution: default}]
[INFO] Exclude: src/main/javacc/xpath/*
[INFO] [install:install {execution: default-install}]
[INFO] Installing <https://builds.apache.org/job/Jackrabbit-2.2/ws/2.2/jackrabbit-spi-commons/target/jackrabbit-spi-commons-2.2.14-SNAPSHOT.jar>
to /home/jenkins/jenkins-slave/maven-repositories/0/org/apache/jackrabbit/jackrabbit-spi-commons/2.2.14-SNAPSHOT/jackrabbit-spi-commons-2.2.14-SNAPSHOT.jar
[INFO] [bundle:install {execution: default-install}]
[INFO] Parsing file:/home/jenkins/jenkins-slave/maven-repositories/0/repository.xml
[INFO] Installing org/apache/jackrabbit/jackrabbit-spi-commons/2.2.14-SNAPSHOT/jackrabbit-spi-commons-2.2.14-SNAPSHOT.jar
[INFO] Writing OBR metadata
[INFO] [deploy:deploy {execution: default-deploy}]
[INFO] Retrieving previous build number from apache.snapshots.https
[WARNING] *** CHECKSUM FAILED - Checksum failed on download: local = '8fca29af6f9fb328c8a89201f290ed8242a90965';
remote = '90a1428530a27ab3c1758282b8f09d82d24add37' - RETRYING
[WARNING] *** CHECKSUM FAILED - Checksum failed on download: local = '8fca29af6f9fb328c8a89201f290ed8242a90965';
remote = '90a1428530a27ab3c1758282b8f09d82d24add37' - IGNORING
Uploading: https://repository.apache.org/content/repositories/snapshots/org/apache/jackrabbit/jackrabbit-spi-commons/2.2.14-SNAPSHOT/jackrabbit-spi-commons-2.2.14-20121029.201300-4.jar
724K uploaded  (jackrabbit-spi-commons-2.2.14-20121029.201300-4.jar)
[INFO] Retrieving previous metadata from apache.snapshots.https
[INFO] Uploading repository metadata for: 'artifact org.apache.jackrabbit:jackrabbit-spi-commons'
[INFO] Retrieving previous metadata from apache.snapshots.https
[WARNING] *** CHECKSUM FAILED - Checksum failed on download: local = '8fca29af6f9fb328c8a89201f290ed8242a90965';
remote = '90a1428530a27ab3c1758282b8f09d82d24add37' - RETRYING
[WARNING] *** CHECKSUM FAILED - Checksum failed on download: local = '8fca29af6f9fb328c8a89201f290ed8242a90965';
remote = '90a1428530a27ab3c1758282b8f09d82d24add37' - IGNORING
[INFO] Uploading repository metadata for: 'snapshot org.apache.jackrabbit:jackrabbit-spi-commons:2.2.14-SNAPSHOT'
[INFO] Uploading project information for jackrabbit-spi-commons 2.2.14-20121029.201300-4
[INFO] [bundle:deploy {execution: default-deploy}]
[INFO] Remote OBR update disabled (enable with -DremoteOBR)
[JENKINS] Archiving disabled - not archiving <https://builds.apache.org/job/Jackrabbit-2.2/ws/2.2/jackrabbit-spi-commons/pom.xml>
[JENKINS] Archiving disabled - not archiving <https://builds.apache.org/job/Jackrabbit-2.2/ws/2.2/jackrabbit-spi-commons/target/jackrabbit-spi-commons-2.2.14-SNAPSHOT.jar>
[INFO] ------------------------------------------------------------------------
[INFO] Building Jackrabbit Core
[INFO]    task-segment: [clean, deploy]
[INFO] ------------------------------------------------------------------------
[INFO] [clean:clean {execution: default-clean}]
[TASKS] Scanning folder '<https://builds.apache.org/job/Jackrabbit-2.2/ws/2.2/jackrabbit-core'>
for files matching the pattern '**/*.java' - excludes: 
[TASKS] Found 1052 files to scan for tasks
Found 235 open tasks.
[TASKS] Computing warning deltas based on reference build #92
[INFO] snapshot org.apache.jackrabbit:jackrabbit-api:2.2.14-SNAPSHOT: checking for updates
from apache.snapshots
[INFO] snapshot org.apache.jackrabbit:jackrabbit-spi-commons:2.2.14-SNAPSHOT: checking for
updates from apache.snapshots
[INFO] [remote-resources:process {execution: default}]
[INFO] [resources:resources {execution: default-resources}]
[INFO] Using 'UTF-8' encoding to copy filtered resources.
[INFO] Copying 65 resources
[INFO] Copying 1 resource
[INFO] Copying 3 resources
[INFO] [compiler:compile {execution: default-compile}]
[INFO] Compiling 713 source files to <https://builds.apache.org/job/Jackrabbit-2.2/ws/2.2/jackrabbit-core/target/classes>
[INFO] [resources:testResources {execution: default-testResources}]
[INFO] Using 'UTF-8' encoding to copy filtered resources.
[INFO] Copying 27 resources
[INFO] Copying 3 resources
[INFO] [antrun:run {execution: process-test-resources}]
[INFO] Executing tasks
     [copy] Copying 34 files to <https://builds.apache.org/job/Jackrabbit-2.2/ws/2.2/jackrabbit-core/target/repository>
     [copy] Copying 34 files to <https://builds.apache.org/job/Jackrabbit-2.2/ws/2.2/jackrabbit-core/target/repository-2>
[INFO] Executed tasks
[INFO] [compiler:testCompile {execution: default-testCompile}]
[INFO] Compiling 339 source files to <https://builds.apache.org/job/Jackrabbit-2.2/ws/2.2/jackrabbit-core/target/test-classes>
[JENKINS] Archiving disabled - not archiving <https://builds.apache.org/job/Jackrabbit-2.2/ws/2.2/jackrabbit-core/pom.xml>
[INFO] ------------------------------------------------------------------------
[ERROR] BUILD FAILURE
[INFO] ------------------------------------------------------------------------
[INFO] Compilation failure

<https://builds.apache.org/job/Jackrabbit-2.2/ws/2.2/jackrabbit-core/src/test/java/org/apache/jackrabbit/core/security/principal/PrincipalManagerTest.java>:[47,9]
method does not override a method from its superclass

<https://builds.apache.org/job/Jackrabbit-2.2/ws/2.2/jackrabbit-core/src/test/java/org/apache/jackrabbit/core/security/principal/PrincipalManagerTest.java>:[52,9]
method does not override a method from its superclass

<https://builds.apache.org/job/Jackrabbit-2.2/ws/2.2/jackrabbit-core/src/test/java/org/apache/jackrabbit/core/security/principal/PrincipalManagerTest.java>:[57,9]
method does not override a method from its superclass

<https://builds.apache.org/job/Jackrabbit-2.2/ws/2.2/jackrabbit-core/src/test/java/org/apache/jackrabbit/core/security/principal/PrincipalManagerTest.java>:[62,9]
method does not override a method from its superclass

<https://builds.apache.org/job/Jackrabbit-2.2/ws/2.2/jackrabbit-core/src/test/java/org/apache/jackrabbit/core/security/principal/PrincipalManagerTest.java>:[67,9]
method does not override a method from its superclass


[INFO] ------------------------------------------------------------------------
[INFO] For more information, run Maven with the -e switch
[INFO] ------------------------------------------------------------------------
[INFO] Total time: 1 minute 41 seconds
[INFO] Finished at: Mon Oct 29 20:14:26 GMT 2012
[INFO] Final Memory: 86M/611M
[INFO] ------------------------------------------------------------------------
channel stopped
[locks-and-latches] Releasing all the locks
[locks-and-latches] All the locks released

Mime
View raw message