jackrabbit-dev mailing list archives

Site index · List index
Message view « Date » · « Thread »
Top « Date » · « Thread »
From Apache Jenkins Server <jenk...@builds.apache.org>
Subject Build failed in Jenkins: Jackrabbit-2.2 #95
Date Wed, 31 Oct 2012 20:26:53 GMT
See <https://builds.apache.org/job/Jackrabbit-2.2/95/changes>

Changes:

[reschke] add missing svn:eol-style properties

------------------------------------------
[...truncated 4444 lines...]
[INFO] Retrieving previous build number from apache.snapshots.https
[WARNING] *** CHECKSUM FAILED - Checksum failed on download: local = '6be089ac834f554d3e5224d6ce5123c2cb8aaf6b';
remote = 'ed7f7b2f93e7078908716eaeaa50bb9310888a06' - RETRYING
[WARNING] *** CHECKSUM FAILED - Checksum failed on download: local = '6be089ac834f554d3e5224d6ce5123c2cb8aaf6b';
remote = 'ed7f7b2f93e7078908716eaeaa50bb9310888a06' - IGNORING
Uploading: https://repository.apache.org/content/repositories/snapshots/org/apache/jackrabbit/jackrabbit-jcr-tests/2.2.14-SNAPSHOT/jackrabbit-jcr-tests-2.2.14-20121031.202456-6.jar
801K uploaded  (jackrabbit-jcr-tests-2.2.14-20121031.202456-6.jar)
[INFO] Uploading project information for jackrabbit-jcr-tests 2.2.14-20121031.202456-6
[INFO] Retrieving previous metadata from apache.snapshots.https
[WARNING] *** CHECKSUM FAILED - Checksum failed on download: local = '6be089ac834f554d3e5224d6ce5123c2cb8aaf6b';
remote = 'ed7f7b2f93e7078908716eaeaa50bb9310888a06' - RETRYING
[WARNING] *** CHECKSUM FAILED - Checksum failed on download: local = '6be089ac834f554d3e5224d6ce5123c2cb8aaf6b';
remote = 'ed7f7b2f93e7078908716eaeaa50bb9310888a06' - IGNORING
[INFO] Uploading repository metadata for: 'snapshot org.apache.jackrabbit:jackrabbit-jcr-tests:2.2.14-SNAPSHOT'
[INFO] Retrieving previous metadata from apache.snapshots.https
[INFO] Uploading repository metadata for: 'artifact org.apache.jackrabbit:jackrabbit-jcr-tests'
[JENKINS] Archiving disabled - not archiving <https://builds.apache.org/job/Jackrabbit-2.2/ws/2.2/jackrabbit-jcr-tests/pom.xml>
[JENKINS] Archiving disabled - not archiving <https://builds.apache.org/job/Jackrabbit-2.2/ws/2.2/jackrabbit-jcr-tests/target/jackrabbit-jcr-tests-2.2.14-SNAPSHOT.jar>
[INFO] ------------------------------------------------------------------------
[INFO] Building Jackrabbit SPI
[INFO]    task-segment: [clean, deploy]
[INFO] ------------------------------------------------------------------------
[INFO] [clean:clean {execution: default-clean}]
[TASKS] Scanning folder '<https://builds.apache.org/job/Jackrabbit-2.2/ws/2.2/jackrabbit-spi'>
for files matching the pattern '**/*.java' - excludes: 
[TASKS] Found 40 files to scan for tasks
Found 3 open tasks.
[TASKS] Computing warning deltas based on reference build #94
[INFO] [remote-resources:process {execution: default}]
[INFO] [resources:resources {execution: default-resources}]
[INFO] Using 'UTF-8' encoding to copy filtered resources.
[INFO] skip non existing resourceDirectory <https://builds.apache.org/job/Jackrabbit-2.2/ws/2.2/jackrabbit-spi/src/main/resources>
[INFO] Copying 3 resources
[INFO] [compiler:compile {execution: default-compile}]
[INFO] Compiling 32 source files to <https://builds.apache.org/job/Jackrabbit-2.2/ws/2.2/jackrabbit-spi/target/classes>
[INFO] [resources:testResources {execution: default-testResources}]
[INFO] Using 'UTF-8' encoding to copy filtered resources.
[INFO] skip non existing resourceDirectory <https://builds.apache.org/job/Jackrabbit-2.2/ws/2.2/jackrabbit-spi/src/test/resources>
[INFO] Copying 3 resources
[INFO] [compiler:testCompile {execution: default-testCompile}]
[INFO] Compiling 8 source files to <https://builds.apache.org/job/Jackrabbit-2.2/ws/2.2/jackrabbit-spi/target/test-classes>
[INFO] [surefire:test {execution: default-test}]
[INFO] Tests are skipped.
[INFO] [bundle:bundle {execution: default-bundle}]
[INFO] [assembly:single {execution: default}]
[INFO] Reading assembly descriptor: assembly.xml
[INFO] Building jar: <https://builds.apache.org/job/Jackrabbit-2.2/ws/2.2/jackrabbit-spi/target/jackrabbit-spi-2.2.14-SNAPSHOT-tests.jar>
[INFO] [apache-rat:check {execution: default}]
[INFO] Exclude: release.properties
[INFO] [install:install {execution: default-install}]
[INFO] Installing <https://builds.apache.org/job/Jackrabbit-2.2/ws/2.2/jackrabbit-spi/target/jackrabbit-spi-2.2.14-SNAPSHOT.jar>
to /home/jenkins/jenkins-slave/maven-repositories/1/org/apache/jackrabbit/jackrabbit-spi/2.2.14-SNAPSHOT/jackrabbit-spi-2.2.14-SNAPSHOT.jar
[INFO] Installing <https://builds.apache.org/job/Jackrabbit-2.2/ws/2.2/jackrabbit-spi/target/jackrabbit-spi-2.2.14-SNAPSHOT-tests.jar>
to /home/jenkins/jenkins-slave/maven-repositories/1/org/apache/jackrabbit/jackrabbit-spi/2.2.14-SNAPSHOT/jackrabbit-spi-2.2.14-SNAPSHOT-tests.jar
[INFO] [bundle:install {execution: default-install}]
[INFO] Parsing file:/home/jenkins/jenkins-slave/maven-repositories/1/repository.xml
[Fatal Error] :-1:-1: Premature end of file.
org.xml.sax.SAXParseException: Premature end of file.
	at com.sun.org.apache.xerces.internal.parsers.DOMParser.parse(DOMParser.java:264)
	at com.sun.org.apache.xerces.internal.jaxp.DocumentBuilderImpl.parse(DocumentBuilderImpl.java:292)
	at javax.xml.parsers.DocumentBuilder.parse(DocumentBuilder.java:172)
	at org.apache.felix.obrplugin.ObrUpdate.parseFile(ObrUpdate.java:347)
	at org.apache.felix.obrplugin.ObrUpdate.parseRepositoryXml(ObrUpdate.java:324)
	at org.apache.felix.obrplugin.ObrInstall.execute(ObrInstall.java:140)
	at org.apache.maven.plugin.DefaultPluginManager.executeMojo(DefaultPluginManager.java:490)
	at hudson.maven.agent.PluginManagerInterceptor.executeMojo(PluginManagerInterceptor.java:182)
	at org.apache.maven.lifecycle.DefaultLifecycleExecutor.executeGoals(DefaultLifecycleExecutor.java:694)
	at org.apache.maven.lifecycle.DefaultLifecycleExecutor.executeGoalWithLifecycle(DefaultLifecycleExecutor.java:556)
	at org.apache.maven.lifecycle.DefaultLifecycleExecutor.executeGoal(DefaultLifecycleExecutor.java:535)
	at org.apache.maven.lifecycle.DefaultLifecycleExecutor.executeGoalAndHandleFailures(DefaultLifecycleExecutor.java:387)
	at org.apache.maven.lifecycle.DefaultLifecycleExecutor.executeTaskSegments(DefaultLifecycleExecutor.java:348)
	at org.apache.maven.lifecycle.DefaultLifecycleExecutor.execute(DefaultLifecycleExecutor.java:180)
	at org.apache.maven.lifecycle.LifecycleExecutorInterceptor.execute(LifecycleExecutorInterceptor.java:65)
	at org.apache.maven.DefaultMaven.doExecute(DefaultMaven.java:328)
	at org.apache.maven.DefaultMaven.execute(DefaultMaven.java:138)
	at org.apache.maven.cli.MavenCli.main(MavenCli.java:362)
	at sun.reflect.NativeMethodAccessorImpl.invoke0(Native Method)
	at sun.reflect.NativeMethodAccessorImpl.invoke(NativeMethodAccessorImpl.java:39)
	at sun.reflect.DelegatingMethodAccessorImpl.invoke(DelegatingMethodAccessorImpl.java:25)
	at java.lang.reflect.Method.invoke(Method.java:592)
	at org.codehaus.classworlds.Launcher.launchEnhanced(Launcher.java:315)
	at org.codehaus.classworlds.Launcher.launch(Launcher.java:255)
	at hudson.maven.agent.Main.launch(Main.java:185)
	at hudson.maven.MavenBuilder.call(MavenBuilder.java:151)
	at hudson.maven.Maven2Builder.call(Maven2Builder.java:77)
	at hudson.maven.Maven2Builder.call(Maven2Builder.java:53)
	at hudson.remoting.UserRequest.perform(UserRequest.java:118)
	at hudson.remoting.UserRequest.perform(UserRequest.java:48)
	at hudson.remoting.Request$2.run(Request.java:326)
	at hudson.remoting.InterceptingExecutorService$1.call(InterceptingExecutorService.java:72)
	at java.util.concurrent.FutureTask$Sync.innerRun(FutureTask.java:269)
	at java.util.concurrent.FutureTask.run(FutureTask.java:123)
	at java.util.concurrent.ThreadPoolExecutor$Worker.runTask(ThreadPoolExecutor.java:651)
	at java.util.concurrent.ThreadPoolExecutor$Worker.run(ThreadPoolExecutor.java:676)
	at java.lang.Thread.run(Thread.java:595)
[INFO] Writing OBR metadata
[INFO] [deploy:deploy {execution: default-deploy}]
[INFO] Retrieving previous build number from apache.snapshots.https
[WARNING] *** CHECKSUM FAILED - Checksum failed on download: local = '41c2f15a04046236e9f98f3934ca98e055d9a4c2';
remote = '292fa42cd08eb1c38f5fce9a80d87f4e21689b83' - RETRYING
[WARNING] *** CHECKSUM FAILED - Checksum failed on download: local = '41c2f15a04046236e9f98f3934ca98e055d9a4c2';
remote = '292fa42cd08eb1c38f5fce9a80d87f4e21689b83' - IGNORING
Uploading: https://repository.apache.org/content/repositories/snapshots/org/apache/jackrabbit/jackrabbit-spi/2.2.14-SNAPSHOT/jackrabbit-spi-2.2.14-20121031.202456-6.jar
26K uploaded  (jackrabbit-spi-2.2.14-20121031.202456-6.jar)
[INFO] Retrieving previous metadata from apache.snapshots.https
[WARNING] *** CHECKSUM FAILED - Checksum failed on download: local = '41c2f15a04046236e9f98f3934ca98e055d9a4c2';
remote = '292fa42cd08eb1c38f5fce9a80d87f4e21689b83' - RETRYING
[WARNING] *** CHECKSUM FAILED - Checksum failed on download: local = '41c2f15a04046236e9f98f3934ca98e055d9a4c2';
remote = '292fa42cd08eb1c38f5fce9a80d87f4e21689b83' - IGNORING
[INFO] Uploading repository metadata for: 'snapshot org.apache.jackrabbit:jackrabbit-spi:2.2.14-SNAPSHOT'
[INFO] Retrieving previous metadata from apache.snapshots.https
[INFO] Uploading repository metadata for: 'artifact org.apache.jackrabbit:jackrabbit-spi'
[INFO] Uploading project information for jackrabbit-spi 2.2.14-20121031.202456-6
[INFO] Retrieving previous build number from apache.snapshots.https
Uploading: https://repository.apache.org/content/repositories/snapshots/org/apache/jackrabbit/jackrabbit-spi/2.2.14-SNAPSHOT/jackrabbit-spi-2.2.14-20121031.202456-6-tests.jar
23K uploaded  (jackrabbit-spi-2.2.14-20121031.202456-6-tests.jar)
[INFO] [bundle:deploy {execution: default-deploy}]
[INFO] Remote OBR update disabled (enable with -DremoteOBR)
[JENKINS] Archiving disabled - not archiving <https://builds.apache.org/job/Jackrabbit-2.2/ws/2.2/jackrabbit-spi/pom.xml>
[JENKINS] Archiving disabled - not archiving <https://builds.apache.org/job/Jackrabbit-2.2/ws/2.2/jackrabbit-spi/target/jackrabbit-spi-2.2.14-SNAPSHOT.jar>
[JENKINS] Archiving disabled - not archiving <https://builds.apache.org/job/Jackrabbit-2.2/ws/2.2/jackrabbit-spi/target/jackrabbit-spi-2.2.14-SNAPSHOT-tests.jar>
[INFO] ------------------------------------------------------------------------
[INFO] Building Jackrabbit SPI Commons
[INFO]    task-segment: [clean, deploy]
[INFO] ------------------------------------------------------------------------
[INFO] [clean:clean {execution: default-clean}]
[TASKS] Scanning folder '<https://builds.apache.org/job/Jackrabbit-2.2/ws/2.2/jackrabbit-spi-commons'>
for files matching the pattern '**/*.java' - excludes: 
[TASKS] Found 234 files to scan for tasks
Found 40 open tasks.
[TASKS] Computing warning deltas based on reference build #94
[INFO] [javacc:jjtree-javacc {execution: sql}]
Java Compiler Compiler Version 4.0 (Tree Builder)
(type "jjtree" with no arguments for help)
Reading from file <https://builds.apache.org/job/Jackrabbit-2.2/ws/2.2/jackrabbit-spi-commons/src/main/javacc/sql/JCRSQL.jjt>
. . .
File "<https://builds.apache.org/job/Jackrabbit-2.2/ws/2.2/jackrabbit-spi-commons/target/generated-sources/jjtree/org/apache/jackrabbit/spi/commons/query/sql/Node.java">
does not exist.  Will create one.
File "<https://builds.apache.org/job/Jackrabbit-2.2/ws/2.2/jackrabbit-spi-commons/target/generated-sources/jjtree/org/apache/jackrabbit/spi/commons/query/sql/SimpleNode.java">
does not exist.  Will create one.
File "<https://builds.apache.org/job/Jackrabbit-2.2/ws/2.2/jackrabbit-spi-commons/target/generated-sources/jjtree/org/apache/jackrabbit/spi/commons/query/sql/ASTQuery.java">
does not exist.  Will create one.
File "<https://builds.apache.org/job/Jackrabbit-2.2/ws/2.2/jackrabbit-spi-commons/target/generated-sources/jjtree/org/apache/jackrabbit/spi/commons/query/sql/ASTSelectList.java">
does not exist.  Will create one.
File "<https://builds.apache.org/job/Jackrabbit-2.2/ws/2.2/jackrabbit-spi-commons/target/generated-sources/jjtree/org/apache/jackrabbit/spi/commons/query/sql/ASTFromClause.java">
does not exist.  Will create one.
File "<https://builds.apache.org/job/Jackrabbit-2.2/ws/2.2/jackrabbit-spi-commons/target/generated-sources/jjtree/org/apache/jackrabbit/spi/commons/query/sql/ASTWhereClause.java">
does not exist.  Will create one.
File "<https://builds.apache.org/job/Jackrabbit-2.2/ws/2.2/jackrabbit-spi-commons/target/generated-sources/jjtree/org/apache/jackrabbit/spi/commons/query/sql/ASTPredicate.java">
does not exist.  Will create one.
File "<https://builds.apache.org/job/Jackrabbit-2.2/ws/2.2/jackrabbit-spi-commons/target/generated-sources/jjtree/org/apache/jackrabbit/spi/commons/query/sql/ASTLowerFunction.java">
does not exist.  Will create one.
File "<https://builds.apache.org/job/Jackrabbit-2.2/ws/2.2/jackrabbit-spi-commons/target/generated-sources/jjtree/org/apache/jackrabbit/spi/commons/query/sql/ASTUpperFunction.java">
does not exist.  Will create one.
File "<https://builds.apache.org/job/Jackrabbit-2.2/ws/2.2/jackrabbit-spi-commons/target/generated-sources/jjtree/org/apache/jackrabbit/spi/commons/query/sql/ASTOrExpression.java">
does not exist.  Will create one.
File "<https://builds.apache.org/job/Jackrabbit-2.2/ws/2.2/jackrabbit-spi-commons/target/generated-sources/jjtree/org/apache/jackrabbit/spi/commons/query/sql/ASTAndExpression.java">
does not exist.  Will create one.
File "<https://builds.apache.org/job/Jackrabbit-2.2/ws/2.2/jackrabbit-spi-commons/target/generated-sources/jjtree/org/apache/jackrabbit/spi/commons/query/sql/ASTNotExpression.java">
does not exist.  Will create one.
File "<https://builds.apache.org/job/Jackrabbit-2.2/ws/2.2/jackrabbit-spi-commons/target/generated-sources/jjtree/org/apache/jackrabbit/spi/commons/query/sql/ASTBracketExpression.java">
does not exist.  Will create one.
File "<https://builds.apache.org/job/Jackrabbit-2.2/ws/2.2/jackrabbit-spi-commons/target/generated-sources/jjtree/org/apache/jackrabbit/spi/commons/query/sql/ASTContainsExpression.java">
does not exist.  Will create one.
File "<https://builds.apache.org/job/Jackrabbit-2.2/ws/2.2/jackrabbit-spi-commons/target/generated-sources/jjtree/org/apache/jackrabbit/spi/commons/query/sql/ASTLiteral.java">
does not exist.  Will create one.
File "<https://builds.apache.org/job/Jackrabbit-2.2/ws/2.2/jackrabbit-spi-commons/target/generated-sources/jjtree/org/apache/jackrabbit/spi/commons/query/sql/ASTIdentifier.java">
does not exist.  Will create one.
File "<https://builds.apache.org/job/Jackrabbit-2.2/ws/2.2/jackrabbit-spi-commons/target/generated-sources/jjtree/org/apache/jackrabbit/spi/commons/query/sql/ASTExcerptFunction.java">
does not exist.  Will create one.
File "<https://builds.apache.org/job/Jackrabbit-2.2/ws/2.2/jackrabbit-spi-commons/target/generated-sources/jjtree/org/apache/jackrabbit/spi/commons/query/sql/ASTOrderByClause.java">
does not exist.  Will create one.
File "<https://builds.apache.org/job/Jackrabbit-2.2/ws/2.2/jackrabbit-spi-commons/target/generated-sources/jjtree/org/apache/jackrabbit/spi/commons/query/sql/ASTOrderSpec.java">
does not exist.  Will create one.
File "<https://builds.apache.org/job/Jackrabbit-2.2/ws/2.2/jackrabbit-spi-commons/target/generated-sources/jjtree/org/apache/jackrabbit/spi/commons/query/sql/ASTAscendingOrderSpec.java">
does not exist.  Will create one.
File "<https://builds.apache.org/job/Jackrabbit-2.2/ws/2.2/jackrabbit-spi-commons/target/generated-sources/jjtree/org/apache/jackrabbit/spi/commons/query/sql/ASTDescendingOrderSpec.java">
does not exist.  Will create one.
Annotated grammar generated successfully in <https://builds.apache.org/job/Jackrabbit-2.2/ws/2.2/jackrabbit-spi-commons/target/generated-sources/jjtree/org/apache/jackrabbit/spi/commons/query/sql/JCRSQL.jj>
Java Compiler Compiler Version 4.0 (Parser Generator)
(type "javacc" with no arguments for help)
Reading from file <https://builds.apache.org/job/Jackrabbit-2.2/ws/2.2/jackrabbit-spi-commons/target/generated-sources/jjtree/org/apache/jackrabbit/spi/commons/query/sql/JCRSQL.jj>
. . .
Note: UNICODE_INPUT option is specified. Please make sure you create the parser/lexer using
a Reader with the correct character encoding.
File "TokenMgrError.java" does not exist.  Will create one.
File "ParseException.java" does not exist.  Will create one.
File "Token.java" does not exist.  Will create one.
File "SimpleCharStream.java" does not exist.  Will create one.
Parser generated successfully.
[INFO] Processed 1 grammar
[INFO] [javacc:jjtree-javacc {execution: xpath}]
Java Compiler Compiler Version 4.0 (Tree Builder)
(type "jjtree" with no arguments for help)
Reading from file <https://builds.apache.org/job/Jackrabbit-2.2/ws/2.2/jackrabbit-spi-commons/src/main/javacc/xpath/XPath.jjt>
. . .
File "<https://builds.apache.org/job/Jackrabbit-2.2/ws/2.2/jackrabbit-spi-commons/target/generated-sources/jjtree/org/apache/jackrabbit/spi/commons/query/xpath/Node.java">
does not exist.  Will create one.
File "<https://builds.apache.org/job/Jackrabbit-2.2/ws/2.2/jackrabbit-spi-commons/target/generated-sources/jjtree/org/apache/jackrabbit/spi/commons/query/xpath/SimpleNode.java">
does not exist.  Will create one.
Annotated grammar generated successfully in <https://builds.apache.org/job/Jackrabbit-2.2/ws/2.2/jackrabbit-spi-commons/target/generated-sources/jjtree/org/apache/jackrabbit/spi/commons/query/xpath/XPath.jj>
Java Compiler Compiler Version 4.0 (Parser Generator)
(type "javacc" with no arguments for help)
Reading from file <https://builds.apache.org/job/Jackrabbit-2.2/ws/2.2/jackrabbit-spi-commons/target/generated-sources/jjtree/org/apache/jackrabbit/spi/commons/query/xpath/XPath.jj>
. . .
Warning: Line 535, Column 2: Non-ASCII characters used in regular expression.
Please make sure you use the correct Reader when you create the parser that can handle your
character set.
Warning:  "\'" cannot be matched as a string literal token at line 1566, column 2. It will
be matched as  <AposAttrContentChar>.
File "TokenMgrError.java" does not exist.  Will create one.
File "ParseException.java" does not exist.  Will create one.
File "Token.java" does not exist.  Will create one.
File "SimpleCharStream.java" does not exist.  Will create one.
Parser generated with 0 errors and 2 warnings.
[INFO] Processed 1 grammar
[INFO] snapshot org.apache.jackrabbit:jackrabbit-spi:2.2.14-SNAPSHOT: checking for updates
from apache.snapshots
[INFO] snapshot org.apache.jackrabbit:jackrabbit-jcr-commons:2.2.14-SNAPSHOT: checking for
updates from apache.snapshots
[INFO] [antrun:run {execution: delete-sources}]
[INFO] Executing tasks
     [echo] Remove files that have been customized in Jackrabbit
[INFO] Executed tasks
[INFO] [remote-resources:process {execution: default}]
[INFO] [resources:resources {execution: default-resources}]
[INFO] Using 'UTF-8' encoding to copy filtered resources.
[INFO] Copying 1 resource
[INFO] Copying 3 resources
[INFO] [compiler:compile {execution: default-compile}]
[INFO] Compiling 238 source files to <https://builds.apache.org/job/Jackrabbit-2.2/ws/2.2/jackrabbit-spi-commons/target/classes>
[INFO] [resources:testResources {execution: default-testResources}]
[INFO] Using 'UTF-8' encoding to copy filtered resources.
[INFO] Copying 3 resources
[INFO] Copying 3 resources
[INFO] [compiler:testCompile {execution: default-testCompile}]
[INFO] Compiling 34 source files to <https://builds.apache.org/job/Jackrabbit-2.2/ws/2.2/jackrabbit-spi-commons/target/test-classes>
[INFO] [surefire:test {execution: default-test}]
[INFO] Surefire report directory: <https://builds.apache.org/job/Jackrabbit-2.2/ws/2.2/jackrabbit-spi-commons/target/surefire-reports>
Oct 31, 2012 8:26:51 PM hudson.remoting.SynchronousCommandTransport$ReaderThread run
SEVERE: I/O error in channel channel
java.io.StreamCorruptedException
	at java.io.ObjectInputStream.readObject0(ObjectInputStream.java:1332)
	at java.io.ObjectInputStream.readObject(ObjectInputStream.java:348)
	at hudson.remoting.Command.readFrom(Command.java:90)
	at hudson.remoting.ClassicCommandTransport.read(ClassicCommandTransport.java:59)
	at hudson.remoting.SynchronousCommandTransport$ReaderThread.run(SynchronousCommandTransport.java:48)
channel stopped
killed.
[INFO] ------------------------------------------------------------------------
[ERROR] FATAL ERROR
[INFO] ------------------------------------------------------------------------
[INFO] null
[INFO] ------------------------------------------------------------------------
[INFO] Trace
java.lang.reflect.UndeclaredThrowableException
	at $Proxy2.isArchivingDisabled(Unknown Source)
	at hudson.maven.MavenBuildProxy$Filter.isArchivingDisabled(MavenBuildProxy.java:227)
	at hudson.maven.reporters.MavenArtifact.archive(MavenArtifact.java:223)
	at hudson.maven.reporters.MavenArtifactArchiver.postBuild(MavenArtifactArchiver.java:108)
	at hudson.maven.Maven2Builder.postModule(Maven2Builder.java:127)
	at hudson.maven.MavenBuilder$Adapter.fireLeaveModule(MavenBuilder.java:327)
	at hudson.maven.MavenBuilder$Adapter.postBuild(MavenBuilder.java:285)
	at org.apache.maven.lifecycle.LifecycleExecutorInterceptor.execute(LifecycleExecutorInterceptor.java:68)
	at org.apache.maven.DefaultMaven.doExecute(DefaultMaven.java:328)
	at org.apache.maven.DefaultMaven.execute(DefaultMaven.java:138)
	at org.apache.maven.cli.MavenCli.main(MavenCli.java:362)
	at sun.reflect.NativeMethodAccessorImpl.invoke0(Native Method)
	at sun.reflect.NativeMethodAccessorImpl.invoke(NativeMethodAccessorImpl.java:39)
	at sun.reflect.DelegatingMethodAccessorImpl.invoke(DelegatingMethodAccessorImpl.java:25)
	at java.lang.reflect.Method.invoke(Method.java:592)
	at org.codehaus.classworlds.Launcher.launchEnhanced(Launcher.java:315)
	at org.codehaus.classworlds.Launcher.launch(Launcher.java:255)
	at hudson.maven.agent.Main.launch(Main.java:185)
	at hudson.maven.MavenBuilder.call(MavenBuilder.java:151)
	at hudson.maven.Maven2Builder.call(Maven2Builder.java:77)
	at hudson.maven.Maven2Builder.call(Maven2Builder.java:53)
	at hudson.remoting.UserRequest.perform(UserRequest.java:118)
	at hudson.remoting.UserRequest.perform(UserRequest.java:48)
	at hudson.remoting.Request$2.run(Request.java:326)
	at hudson.remoting.InterceptingExecutorService$1.call(InterceptingExecutorService.java:72)
	at java.util.concurrent.FutureTask$Sync.innerRun(FutureTask.java:269)
	at java.util.concurrent.FutureTask.run(FutureTask.java:123)
	at java.util.concurrent.ThreadPoolExecutor$Worker.runTask(ThreadPoolExecutor.java:651)
	at java.util.concurrent.ThreadPoolExecutor$Worker.run(ThreadPoolExecutor.java:676)
	at java.lang.Thread.run(Thread.java:595)
Caused by: hudson.remoting.ChannelClosedException: channel is already closed
	at hudson.remoting.Channel.send(Channel.java:493)
	at hudson.remoting.Request.call(Request.java:129)
[locks-and-latches] Releasing all the locks
[locks-and-latches] All the locks released
ERROR: Maven JVM terminated unexpectedly with exit code 0


Mime
View raw message