jackrabbit-dev mailing list archives

Site index · List index
Message view « Date » · « Thread »
Top « Date » · « Thread »
From Apache Jenkins Server <jenk...@builds.apache.org>
Subject Build failed in Jenkins: Jackrabbit-2.2 #92
Date Tue, 23 Oct 2012 14:51:06 GMT
See <https://builds.apache.org/job/Jackrabbit-2.2/92/>

------------------------------------------
[...truncated 1232 lines...]
[INFO] Including generated jar file[jackrabbit-jca-2.2.14-SNAPSHOT.jar]
[INFO] Copying artifact[org.apache.jackrabbit, org.apache.jackrabbit:jackrabbit-core:jar:2.2.14-SNAPSHOT,
compile]
[INFO] Copying artifact[concurrent, concurrent:concurrent:jar:1.3.4, compile]
[INFO] Copying artifact[commons-collections, commons-collections:commons-collections:jar:3.2.1,
compile]
[INFO] Copying artifact[commons-io, commons-io:commons-io:jar:1.4, compile]
[INFO] Copying artifact[commons-dbcp, commons-dbcp:commons-dbcp:jar:1.3, compile]
[INFO] Copying artifact[commons-pool, commons-pool:commons-pool:jar:1.5.4, compile]
[INFO] Copying artifact[org.apache.jackrabbit, org.apache.jackrabbit:jackrabbit-api:jar:2.2.14-SNAPSHOT,
compile]
[INFO] Copying artifact[org.apache.jackrabbit, org.apache.jackrabbit:jackrabbit-jcr-commons:jar:2.2.14-SNAPSHOT,
compile]
[INFO] Copying artifact[org.apache.jackrabbit, org.apache.jackrabbit:jackrabbit-spi-commons:jar:2.2.14-SNAPSHOT,
compile]
[INFO] Copying artifact[org.apache.jackrabbit, org.apache.jackrabbit:jackrabbit-spi:jar:2.2.14-SNAPSHOT,
compile]
[INFO] Copying artifact[org.slf4j, org.slf4j:slf4j-api:jar:1.5.11, compile]
[INFO] Copying artifact[org.apache.tika, org.apache.tika:tika-parsers:jar:0.8, compile]
[INFO] Copying artifact[org.apache.tika, org.apache.tika:tika-core:jar:0.8, compile]
[INFO] Copying artifact[commons-httpclient, commons-httpclient:commons-httpclient:jar:3.0,
compile]
[INFO] Copying artifact[commons-codec, commons-codec:commons-codec:jar:1.2, compile]
[INFO] Copying artifact[org.apache.commons, org.apache.commons:commons-compress:jar:1.1, compile]
[INFO] Copying artifact[org.apache.pdfbox, org.apache.pdfbox:pdfbox:jar:1.3.1, compile]
[INFO] Copying artifact[org.apache.pdfbox, org.apache.pdfbox:fontbox:jar:1.3.1, compile]
[INFO] Copying artifact[org.apache.pdfbox, org.apache.pdfbox:jempbox:jar:1.3.1, compile]
[INFO] Copying artifact[org.bouncycastle, org.bouncycastle:bcmail-jdk15:jar:1.45, compile]
[INFO] Copying artifact[org.bouncycastle, org.bouncycastle:bcprov-jdk15:jar:1.45, compile]
[INFO] Copying artifact[org.apache.poi, org.apache.poi:poi:jar:3.7, compile]
[INFO] Copying artifact[org.apache.poi, org.apache.poi:poi-scratchpad:jar:3.7, compile]
[INFO] Copying artifact[org.apache.poi, org.apache.poi:poi-ooxml:jar:3.7, compile]
[INFO] Copying artifact[org.apache.poi, org.apache.poi:poi-ooxml-schemas:jar:3.7, compile]
[INFO] Copying artifact[org.apache.xmlbeans, org.apache.xmlbeans:xmlbeans:jar:2.3.0, compile]
[INFO] Copying artifact[org.apache.geronimo.specs, org.apache.geronimo.specs:geronimo-stax-api_1.0_spec:jar:1.0.1,
compile]
[INFO] Copying artifact[dom4j, dom4j:dom4j:jar:1.6.1, compile]
[INFO] Copying artifact[org.ccil.cowan.tagsoup, org.ccil.cowan.tagsoup:tagsoup:jar:1.2, compile]
[INFO] Copying artifact[asm, asm:asm:jar:3.1, compile]
[INFO] Copying artifact[com.drewnoakes, com.drewnoakes:metadata-extractor:jar:2.4.0-beta-1,
compile]
[INFO] Copying artifact[de.l3s.boilerpipe, de.l3s.boilerpipe:boilerpipe:jar:1.1.0, compile]
[INFO] Copying artifact[rome, rome:rome:jar:0.9, compile]
[INFO] Copying artifact[jdom, jdom:jdom:jar:1.0, compile]
[INFO] Copying artifact[edu.ucar, edu.ucar:netcdf:jar:4.2-min, compile]
[INFO] Copying artifact[org.slf4j, org.slf4j:jcl-over-slf4j:jar:1.5.11, compile]
[INFO] Copying artifact[org.apache.lucene, org.apache.lucene:lucene-core:jar:2.4.1, compile]
[INFO] Copying artifact[org.apache.derby, org.apache.derby:derby:jar:10.5.3.0_1, compile]
[INFO] Copying artifact[ch.qos.logback, ch.qos.logback:logback-classic:jar:0.9.20, compile]
[INFO] Copying artifact[ch.qos.logback, ch.qos.logback:logback-core:jar:0.9.20, compile]
[INFO] Copy rar resources to <https://builds.apache.org/job/Jackrabbit-2.2/ws/2.2/jackrabbit-jca/target/jackrabbit-jca-2.2.14-SNAPSHOT>
[INFO] Using ra.xml <https://builds.apache.org/job/Jackrabbit-2.2/ws/2.2/jackrabbit-jca/src/main/rar/META-INF/ra.xml>
[INFO] Could not find manifest file: <https://builds.apache.org/job/Jackrabbit-2.2/ws/2.2/jackrabbit-jca/src/main/rar/META-INF/MANIFEST.MF>
- Generating one
[INFO] Building jar: <https://builds.apache.org/job/Jackrabbit-2.2/ws/2.2/jackrabbit-jca/target/jackrabbit-jca-2.2.14-SNAPSHOT.rar>
[INFO] [build-helper:attach-artifact {execution: attach-artifacts}]
[INFO] [apache-rat:check {execution: default}]
[INFO] Exclude: release.properties
[INFO] [install:install {execution: default-install}]
[INFO] Installing <https://builds.apache.org/job/Jackrabbit-2.2/ws/2.2/jackrabbit-jca/target/jackrabbit-jca-2.2.14-SNAPSHOT.rar>
to /home/jenkins/jenkins-slave/maven-repositories/1/org/apache/jackrabbit/jackrabbit-jca/2.2.14-SNAPSHOT/jackrabbit-jca-2.2.14-SNAPSHOT.rar
[INFO] Installing <https://builds.apache.org/job/Jackrabbit-2.2/ws/2.2/jackrabbit-jca/target/jackrabbit-jca-2.2.14-SNAPSHOT.jar>
to /home/jenkins/jenkins-slave/maven-repositories/1/org/apache/jackrabbit/jackrabbit-jca/2.2.14-SNAPSHOT/jackrabbit-jca-2.2.14-SNAPSHOT.jar
[INFO] [deploy:deploy {execution: default-deploy}]
[INFO] Retrieving previous build number from apache.snapshots.https
[WARNING] *** CHECKSUM FAILED - Checksum failed on download: local = '497d581004ae4bd270d5114c76d7583e6d95e5ae';
remote = 'cb6e11074ac8153f163c181e65037d7d4db789f2' - RETRYING
[WARNING] *** CHECKSUM FAILED - Checksum failed on download: local = '497d581004ae4bd270d5114c76d7583e6d95e5ae';
remote = 'cb6e11074ac8153f163c181e65037d7d4db789f2' - IGNORING
Uploading: https://repository.apache.org/content/repositories/snapshots/org/apache/jackrabbit/jackrabbit-jca/2.2.14-SNAPSHOT/jackrabbit-jca-2.2.14-20121023.143636-3.rar
26144K uploaded  (jackrabbit-jca-2.2.14-20121023.143636-3.rar)
[INFO] Retrieving previous metadata from apache.snapshots.https
[WARNING] *** CHECKSUM FAILED - Checksum failed on download: local = '497d581004ae4bd270d5114c76d7583e6d95e5ae';
remote = 'cb6e11074ac8153f163c181e65037d7d4db789f2' - RETRYING
[WARNING] *** CHECKSUM FAILED - Checksum failed on download: local = '497d581004ae4bd270d5114c76d7583e6d95e5ae';
remote = 'cb6e11074ac8153f163c181e65037d7d4db789f2' - IGNORING
[INFO] Uploading repository metadata for: 'snapshot org.apache.jackrabbit:jackrabbit-jca:2.2.14-SNAPSHOT'
[INFO] Retrieving previous metadata from apache.snapshots.https
[INFO] Uploading repository metadata for: 'artifact org.apache.jackrabbit:jackrabbit-jca'
[INFO] Uploading project information for jackrabbit-jca 2.2.14-20121023.143636-3
[INFO] Retrieving previous build number from apache.snapshots.https
Uploading: https://repository.apache.org/content/repositories/snapshots/org/apache/jackrabbit/jackrabbit-jca/2.2.14-SNAPSHOT/jackrabbit-jca-2.2.14-20121023.143636-3.jar
29K uploaded  (jackrabbit-jca-2.2.14-20121023.143636-3.jar)
[JENKINS] Archiving disabled - not archiving <https://builds.apache.org/job/Jackrabbit-2.2/ws/2.2/jackrabbit-jca/pom.xml>
[JENKINS] Archiving disabled - not archiving <https://builds.apache.org/job/Jackrabbit-2.2/ws/2.2/jackrabbit-jca/target/jackrabbit-jca-2.2.14-SNAPSHOT.rar>
[JENKINS] Archiving disabled - not archiving <https://builds.apache.org/job/Jackrabbit-2.2/ws/2.2/jackrabbit-jca/target/jackrabbit-jca-2.2.14-SNAPSHOT.jar>
[INFO] ------------------------------------------------------------------------
[INFO] Building Jackrabbit JCR to SPI
[INFO]    task-segment: [clean, deploy]
[INFO] ------------------------------------------------------------------------
[INFO] [clean:clean {execution: default-clean}]
[TASKS] Scanning folder '<https://builds.apache.org/job/Jackrabbit-2.2/ws/2.2/jackrabbit-jcr2spi'>
for files matching the pattern '**/*.java' - excludes: 
[TASKS] Found 212 files to scan for tasks
Found 66 open tasks.
[TASKS] Computing warning deltas based on reference build #90
[INFO] [remote-resources:process {execution: default}]
[INFO] [resources:resources {execution: default-resources}]
[INFO] Using 'UTF-8' encoding to copy filtered resources.
[INFO] Copying 1 resource
[INFO] Copying 3 resources
[INFO] [compiler:compile {execution: default-compile}]
[INFO] Compiling 134 source files to <https://builds.apache.org/job/Jackrabbit-2.2/ws/2.2/jackrabbit-jcr2spi/target/classes>
[INFO] [resources:testResources {execution: default-testResources}]
[INFO] Using 'UTF-8' encoding to copy filtered resources.
[INFO] Copying 2 resources
[INFO] Copying 3 resources
[INFO] [compiler:testCompile {execution: default-testCompile}]
[INFO] Compiling 78 source files to <https://builds.apache.org/job/Jackrabbit-2.2/ws/2.2/jackrabbit-jcr2spi/target/test-classes>
[INFO] [surefire:test {execution: default-test}]
[INFO] Surefire report directory: <https://builds.apache.org/job/Jackrabbit-2.2/ws/2.2/jackrabbit-jcr2spi/target/surefire-reports>

-------------------------------------------------------
 T E S T S
-------------------------------------------------------
There are no tests to run.

Results :

Tests run: 0, Failures: 0, Errors: 0, Skipped: 0

[JENKINS] Recording test results[INFO] [bundle:bundle {execution: default-bundle}]

[INFO] [assembly:single {execution: default}]
[INFO] Reading assembly descriptor: assembly.xml
[INFO] Building jar: <https://builds.apache.org/job/Jackrabbit-2.2/ws/2.2/jackrabbit-jcr2spi/target/jackrabbit-jcr2spi-2.2.14-SNAPSHOT-tests.jar>
[INFO] [apache-rat:check {execution: default}]
[INFO] Exclude: release.properties
[INFO] [install:install {execution: default-install}]
[INFO] Installing <https://builds.apache.org/job/Jackrabbit-2.2/ws/2.2/jackrabbit-jcr2spi/target/jackrabbit-jcr2spi-2.2.14-SNAPSHOT.jar>
to /home/jenkins/jenkins-slave/maven-repositories/1/org/apache/jackrabbit/jackrabbit-jcr2spi/2.2.14-SNAPSHOT/jackrabbit-jcr2spi-2.2.14-SNAPSHOT.jar
[INFO] Installing <https://builds.apache.org/job/Jackrabbit-2.2/ws/2.2/jackrabbit-jcr2spi/target/jackrabbit-jcr2spi-2.2.14-SNAPSHOT-tests.jar>
to /home/jenkins/jenkins-slave/maven-repositories/1/org/apache/jackrabbit/jackrabbit-jcr2spi/2.2.14-SNAPSHOT/jackrabbit-jcr2spi-2.2.14-SNAPSHOT-tests.jar
[INFO] [bundle:install {execution: default-install}]
[INFO] Parsing file:/home/jenkins/jenkins-slave/maven-repositories/1/repository.xml
[INFO] Installing org/apache/jackrabbit/jackrabbit-jcr2spi/2.2.14-SNAPSHOT/jackrabbit-jcr2spi-2.2.14-SNAPSHOT.jar
[INFO] Installing org/apache/jackrabbit/jackrabbit-jcr2spi/2.2.14-SNAPSHOT/jackrabbit-jcr2spi-2.2.14-SNAPSHOT-tests.jar
[INFO] Writing OBR metadata
[INFO] [deploy:deploy {execution: default-deploy}]
[INFO] Retrieving previous build number from apache.snapshots.https
[WARNING] *** CHECKSUM FAILED - Checksum failed on download: local = '6263ad3e340062b78a4909701dc342add1d25162';
remote = '578c390e0d21fd078de69735f7a6d0fcab977aa0' - RETRYING
[WARNING] *** CHECKSUM FAILED - Checksum failed on download: local = '6263ad3e340062b78a4909701dc342add1d25162';
remote = '578c390e0d21fd078de69735f7a6d0fcab977aa0' - IGNORING
Uploading: https://repository.apache.org/content/repositories/snapshots/org/apache/jackrabbit/jackrabbit-jcr2spi/2.2.14-SNAPSHOT/jackrabbit-jcr2spi-2.2.14-20121023.143636-3.jar
388K uploaded  (jackrabbit-jcr2spi-2.2.14-20121023.143636-3.jar)
[INFO] Uploading project information for jackrabbit-jcr2spi 2.2.14-20121023.143636-3
[INFO] Retrieving previous metadata from apache.snapshots.https
[INFO] Uploading repository metadata for: 'artifact org.apache.jackrabbit:jackrabbit-jcr2spi'
[INFO] Retrieving previous metadata from apache.snapshots.https
[WARNING] *** CHECKSUM FAILED - Checksum failed on download: local = '6263ad3e340062b78a4909701dc342add1d25162';
remote = '578c390e0d21fd078de69735f7a6d0fcab977aa0' - RETRYING
[WARNING] *** CHECKSUM FAILED - Checksum failed on download: local = '6263ad3e340062b78a4909701dc342add1d25162';
remote = '578c390e0d21fd078de69735f7a6d0fcab977aa0' - IGNORING
[INFO] Uploading repository metadata for: 'snapshot org.apache.jackrabbit:jackrabbit-jcr2spi:2.2.14-SNAPSHOT'
[INFO] Retrieving previous build number from apache.snapshots.https
Uploading: https://repository.apache.org/content/repositories/snapshots/org/apache/jackrabbit/jackrabbit-jcr2spi/2.2.14-SNAPSHOT/jackrabbit-jcr2spi-2.2.14-20121023.143636-3-tests.jar
160K uploaded  (jackrabbit-jcr2spi-2.2.14-20121023.143636-3-tests.jar)
[INFO] [bundle:deploy {execution: default-deploy}]
[INFO] Remote OBR update disabled (enable with -DremoteOBR)
[JENKINS] Archiving disabled - not archiving <https://builds.apache.org/job/Jackrabbit-2.2/ws/2.2/jackrabbit-jcr2spi/pom.xml>
[JENKINS] Archiving disabled - not archiving <https://builds.apache.org/job/Jackrabbit-2.2/ws/2.2/jackrabbit-jcr2spi/target/jackrabbit-jcr2spi-2.2.14-SNAPSHOT.jar>
[JENKINS] Archiving disabled - not archiving <https://builds.apache.org/job/Jackrabbit-2.2/ws/2.2/jackrabbit-jcr2spi/target/jackrabbit-jcr2spi-2.2.14-SNAPSHOT-tests.jar>
[INFO] ------------------------------------------------------------------------
[INFO] Building Jackrabbit SPI to JCR
[INFO]    task-segment: [clean, deploy]
[INFO] ------------------------------------------------------------------------
[INFO] [clean:clean {execution: default-clean}]
[TASKS] Scanning folder '<https://builds.apache.org/job/Jackrabbit-2.2/ws/2.2/jackrabbit-spi2jcr'>
for files matching the pattern '**/*.java' - excludes: 
[TASKS] Found 19 files to scan for tasks
Found 5 open tasks.
[TASKS] Computing warning deltas based on reference build #90
[INFO] snapshot org.apache.jackrabbit:jackrabbit-jcr2spi:2.2.14-SNAPSHOT: checking for updates
from apache.snapshots
[INFO] [remote-resources:process {execution: default}]
[INFO] [resources:resources {execution: default-resources}]
[INFO] Using 'UTF-8' encoding to copy filtered resources.
[INFO] skip non existing resourceDirectory <https://builds.apache.org/job/Jackrabbit-2.2/ws/2.2/jackrabbit-spi2jcr/src/main/resources>
[INFO] Copying 3 resources
[INFO] [compiler:compile {execution: default-compile}]
[INFO] Compiling 13 source files to <https://builds.apache.org/job/Jackrabbit-2.2/ws/2.2/jackrabbit-spi2jcr/target/classes>
[INFO] [resources:testResources {execution: default-testResources}]
[INFO] Using 'UTF-8' encoding to copy filtered resources.
[INFO] Copying 4 resources
[INFO] Copying 3 resources
[INFO] [compiler:testCompile {execution: default-testCompile}]
[INFO] Compiling 6 source files to <https://builds.apache.org/job/Jackrabbit-2.2/ws/2.2/jackrabbit-spi2jcr/target/test-classes>
[INFO] [surefire:test {execution: default-test}]
[INFO] Surefire report directory: <https://builds.apache.org/job/Jackrabbit-2.2/ws/2.2/jackrabbit-spi2jcr/target/surefire-reports>

-------------------------------------------------------
 T E S T S
-------------------------------------------------------
Running org.apache.jackrabbit.spi2jcr.spi.TestAll
Tests run: 92, Failures: 0, Errors: 0, Skipped: 0, Time elapsed: 7.459 sec
Running org.apache.jackrabbit.test.TestAll
Tests run: 1900, Failures: 0, Errors: 0, Skipped: 0, Time elapsed: 83.063 sec
Running org.apache.jackrabbit.spi2jcr.jcr2spi.TestAll
Tests run: 412, Failures: 0, Errors: 0, Skipped: 0, Time elapsed: 6.487 sec

Results :

Tests run: 2404, Failures: 0, Errors: 0, Skipped: 0

[JENKINS] Recording test results
[INFO] [jar:jar {execution: default-jar}]
[INFO] Building jar: <https://builds.apache.org/job/Jackrabbit-2.2/ws/2.2/jackrabbit-spi2jcr/target/jackrabbit-spi2jcr-2.2.14-SNAPSHOT.jar>
[INFO] [apache-rat:check {execution: default}]
[INFO] Exclude: src/test/resources/jaas.config
[INFO] Exclude: src/test/resources/testdata.xml
[INFO] Exclude: *.log
[INFO] [install:install {execution: default-install}]
[INFO] Installing <https://builds.apache.org/job/Jackrabbit-2.2/ws/2.2/jackrabbit-spi2jcr/target/jackrabbit-spi2jcr-2.2.14-SNAPSHOT.jar>
to /home/jenkins/jenkins-slave/maven-repositories/1/org/apache/jackrabbit/jackrabbit-spi2jcr/2.2.14-SNAPSHOT/jackrabbit-spi2jcr-2.2.14-SNAPSHOT.jar
[INFO] [deploy:deploy {execution: default-deploy}]
[INFO] Retrieving previous build number from apache.snapshots.https
[WARNING] *** CHECKSUM FAILED - Checksum failed on download: local = 'af5c8ff03fce242f4c21054cdeea8ef2249b58fb';
remote = '754e8872c349417c4e722177b9b0615c34941da4' - RETRYING
[WARNING] *** CHECKSUM FAILED - Checksum failed on download: local = 'af5c8ff03fce242f4c21054cdeea8ef2249b58fb';
remote = '754e8872c349417c4e722177b9b0615c34941da4' - IGNORING
Uploading: https://repository.apache.org/content/repositories/snapshots/org/apache/jackrabbit/jackrabbit-spi2jcr/2.2.14-SNAPSHOT/jackrabbit-spi2jcr-2.2.14-20121023.143636-3.jar
91K uploaded  (jackrabbit-spi2jcr-2.2.14-20121023.143636-3.jar)
[INFO] Retrieving previous metadata from apache.snapshots.https
[WARNING] *** CHECKSUM FAILED - Checksum failed on download: local = 'af5c8ff03fce242f4c21054cdeea8ef2249b58fb';
remote = '754e8872c349417c4e722177b9b0615c34941da4' - RETRYING
[WARNING] *** CHECKSUM FAILED - Checksum failed on download: local = 'af5c8ff03fce242f4c21054cdeea8ef2249b58fb';
remote = '754e8872c349417c4e722177b9b0615c34941da4' - IGNORING
[INFO] Uploading repository metadata for: 'snapshot org.apache.jackrabbit:jackrabbit-spi2jcr:2.2.14-SNAPSHOT'
[INFO] Retrieving previous metadata from apache.snapshots.https
[INFO] Uploading repository metadata for: 'artifact org.apache.jackrabbit:jackrabbit-spi2jcr'
[INFO] Uploading project information for jackrabbit-spi2jcr 2.2.14-20121023.143636-3
[JENKINS] Archiving disabled - not archiving <https://builds.apache.org/job/Jackrabbit-2.2/ws/2.2/jackrabbit-spi2jcr/pom.xml>
[JENKINS] Archiving disabled - not archiving <https://builds.apache.org/job/Jackrabbit-2.2/ws/2.2/jackrabbit-spi2jcr/target/jackrabbit-spi2jcr-2.2.14-SNAPSHOT.jar>
[INFO] ------------------------------------------------------------------------
[INFO] Building Jackrabbit SPI to WebDAV
[INFO]    task-segment: [clean, deploy]
[INFO] ------------------------------------------------------------------------
[INFO] [clean:clean {execution: default-clean}]
[TASKS] Scanning folder '<https://builds.apache.org/job/Jackrabbit-2.2/ws/2.2/jackrabbit-spi2dav'>
for files matching the pattern '**/*.java' - excludes: 
[TASKS] Found 48 files to scan for tasks
Found 54 open tasks.
[TASKS] Computing warning deltas based on reference build #90
[INFO] [remote-resources:process {execution: default}]
[INFO] [resources:resources {execution: default-resources}]
[INFO] Using 'UTF-8' encoding to copy filtered resources.
[INFO] skip non existing resourceDirectory <https://builds.apache.org/job/Jackrabbit-2.2/ws/2.2/jackrabbit-spi2dav/src/main/resources>
[INFO] Copying 3 resources
[INFO] [compiler:compile {execution: default-compile}]
[INFO] Compiling 34 source files to <https://builds.apache.org/job/Jackrabbit-2.2/ws/2.2/jackrabbit-spi2dav/target/classes>
[INFO] [resources:testResources {execution: default-testResources}]
[INFO] Using 'UTF-8' encoding to copy filtered resources.
[INFO] Copying 4 resources
[INFO] Copying 3 resources
[INFO] [compiler:testCompile {execution: default-testCompile}]
[INFO] Compiling 14 source files to <https://builds.apache.org/job/Jackrabbit-2.2/ws/2.2/jackrabbit-spi2dav/target/test-classes>
[INFO] [surefire:test {execution: default-test}]
[INFO] Tests are skipped.
[INFO] [jar:jar {execution: default-jar}]
[INFO] Building jar: <https://builds.apache.org/job/Jackrabbit-2.2/ws/2.2/jackrabbit-spi2dav/target/jackrabbit-spi2dav-2.2.14-SNAPSHOT.jar>
[INFO] [assembly:single {execution: default}]
[INFO] Reading assembly descriptor: assembly.xml
[INFO] Building jar: <https://builds.apache.org/job/Jackrabbit-2.2/ws/2.2/jackrabbit-spi2dav/target/jackrabbit-spi2dav-2.2.14-SNAPSHOT-tests.jar>
Oct 23, 2012 2:51:02 PM hudson.remoting.SynchronousCommandTransport$ReaderThread run
SEVERE: I/O error in channel channel
java.io.StreamCorruptedException
	at java.io.ObjectInputStream.readObject0(ObjectInputStream.java:1332)
	at java.io.ObjectInputStream.readObject(ObjectInputStream.java:348)
	at hudson.remoting.Command.readFrom(Command.java:90)
	at hudson.remoting.ClassicCommandTransport.read(ClassicCommandTransport.java:59)
	at hudson.remoting.SynchronousCommandTransport$ReaderThread.run(SynchronousCommandTransport.java:48)
channel stopped
[INFO] ------------------------------------------------------------------------
[ERROR] FATAL ERROR
[INFO] ------------------------------------------------------------------------
[locks-and-latches] Releasing all the locks
[locks-and-latches] All the locks released
ERROR: Maven JVM terminated unexpectedly with exit code 0


Mime
View raw message