jackrabbit-dev mailing list archives

Site index · List index
Message view « Date » · « Thread »
Top « Date » · « Thread »
From Apache Jenkins Server <jenk...@builds.apache.org>
Subject Build failed in Jenkins: Jackrabbit-trunk #1571
Date Tue, 05 Jul 2011 09:08:55 GMT
See <https://builds.apache.org/job/Jackrabbit-trunk/1571/changes>

Changes:

[alexparvulescu] JCR-2918 Avoid unnecessary index reader calls when using aggregate definitions

------------------------------------------
[...truncated 570 lines...]
(type "javacc" with no arguments for help)
Reading from file <https://builds.apache.org/job/Jackrabbit-trunk/ws/trunk/jackrabbit-spi-commons/target/generated-sources/jjtree/org/apache/jackrabbit/spi/commons/query/xpath/XPath.jj>
. . .
Warning: Line 535, Column 2: Non-ASCII characters used in regular expression.
Please make sure you use the correct Reader when you create the parser that can handle your
character set.
Warning:  "\'" cannot be matched as a string literal token at line 1560, column 2. It will
be matched as  <AposAttrContentChar>.
File "TokenMgrError.java" does not exist.  Will create one.
File "ParseException.java" does not exist.  Will create one.
File "Token.java" does not exist.  Will create one.
File "SimpleCharStream.java" does not exist.  Will create one.
Parser generated with 0 errors and 2 warnings.
[INFO] Processed 1 grammar
[TASKS] Skipping maven reporter: there is already a result available.
[INFO] snapshot org.apache.jackrabbit:jackrabbit-spi:2.3-SNAPSHOT: checking for updates from
apache.snapshots
[INFO] snapshot org.apache.jackrabbit:jackrabbit-jcr-commons:2.3-SNAPSHOT: checking for updates
from apache.snapshots
[INFO] [antrun:run {execution: delete-sources}]
[INFO] Executing tasks
     [echo] Remove files that have been customized in Jackrabbit
[INFO] Executed tasks
[TASKS] Skipping maven reporter: there is already a result available.
[INFO] [remote-resources:process {execution: default}]
[TASKS] Skipping maven reporter: there is already a result available.
[INFO] [resources:resources {execution: default-resources}]
[INFO] Using 'UTF-8' encoding to copy filtered resources.
[INFO] Copying 1 resource
[INFO] Copying 3 resources
[TASKS] Skipping maven reporter: there is already a result available.
[INFO] [compiler:compile {execution: default-compile}]
[INFO] Compiling 244 source files to <https://builds.apache.org/job/Jackrabbit-trunk/ws/trunk/jackrabbit-spi-commons/target/classes>
[TASKS] Skipping maven reporter: there is already a result available.
[INFO] [resources:testResources {execution: default-testResources}]
[INFO] Using 'UTF-8' encoding to copy filtered resources.
[INFO] Copying 5 resources
[INFO] Copying 3 resources
[TASKS] Skipping maven reporter: there is already a result available.
[INFO] [compiler:testCompile {execution: default-testCompile}]
[INFO] Compiling 36 source files to <https://builds.apache.org/job/Jackrabbit-trunk/ws/trunk/jackrabbit-spi-commons/target/test-classes>
[TASKS] Skipping maven reporter: there is already a result available.
[INFO] [surefire:test {execution: default-test}]
[INFO] Surefire report directory: <https://builds.apache.org/job/Jackrabbit-trunk/ws/trunk/jackrabbit-spi-commons/target/surefire-reports>

-------------------------------------------------------
 T E S T S
-------------------------------------------------------
Running org.apache.jackrabbit.spi.commons.batch.ConsolidatedBatchTest
Tests run: 1, Failures: 0, Errors: 0, Skipped: 0, Time elapsed: 0.327 sec
Running org.apache.jackrabbit.spi.commons.privilege.PrivilegeHandlerTest
Tests run: 4, Failures: 0, Errors: 0, Skipped: 0, Time elapsed: 0.289 sec
Running org.apache.jackrabbit.spi.commons.conversion.ParsingPathResolverTest
Tests run: 4, Failures: 0, Errors: 0, Skipped: 0, Time elapsed: 0.402 sec
Running org.apache.jackrabbit.spi.commons.nodetype.compact.CompactNodeTypeDefTest
Tests run: 1, Failures: 0, Errors: 0, Skipped: 0, Time elapsed: 1.732 sec
Running org.apache.jackrabbit.spi.commons.value.QValueTest
Tests run: 58, Failures: 0, Errors: 0, Skipped: 0, Time elapsed: 1.193 sec
Running org.apache.jackrabbit.spi.commons.value.ValueFormatTest
Tests run: 5, Failures: 0, Errors: 0, Skipped: 0, Time elapsed: 0.077 sec
Running org.apache.jackrabbit.spi.commons.nodetype.constraint.PathConstraintTest
Tests run: 10, Failures: 0, Errors: 0, Skipped: 0, Time elapsed: 0.07 sec
Running org.apache.jackrabbit.spi.commons.nodetype.PropertyDefinitionTemplateImplTest
Tests run: 2, Failures: 0, Errors: 0, Skipped: 0, Time elapsed: 0.008 sec
Running org.apache.jackrabbit.spi.commons.conversion.ParsingNameResolverTest
Tests run: 2, Failures: 0, Errors: 0, Skipped: 0, Time elapsed: 0.004 sec
Running org.apache.jackrabbit.spi.commons.name.ElementTest
Tests run: 6, Failures: 0, Errors: 0, Skipped: 0, Time elapsed: 0.008 sec
Running org.apache.jackrabbit.spi.commons.query.sql2.ParserTest
Tests run: 2, Failures: 0, Errors: 0, Skipped: 0, Time elapsed: 3.63 sec
Running org.apache.jackrabbit.spi.commons.nodetype.constraint.NumericConstraintTest
Tests run: 10, Failures: 0, Errors: 0, Skipped: 0, Time elapsed: 0.014 sec
Running org.apache.jackrabbit.spi.commons.name.MatcherTest
Tests run: 3, Failures: 0, Errors: 0, Skipped: 0, Time elapsed: 0.018 sec
Running org.apache.jackrabbit.spi.commons.nodetype.constraint.StringConstraintTest
Tests run: 10, Failures: 0, Errors: 0, Skipped: 0, Time elapsed: 0.007 sec
Running org.apache.jackrabbit.spi.commons.nodetype.constraint.BooleanConstraintTest
Tests run: 11, Failures: 0, Errors: 0, Skipped: 0, Time elapsed: 0.012 sec
Running org.apache.jackrabbit.spi.commons.nodetype.NodeDefinitionTemplateImplTest
Tests run: 1, Failures: 0, Errors: 0, Skipped: 0, Time elapsed: 0.008 sec
Running org.apache.jackrabbit.spi.commons.identifier.SerializationTest
Tests run: 2, Failures: 0, Errors: 0, Skipped: 0, Time elapsed: 0.016 sec
Running org.apache.jackrabbit.spi.commons.privilege.TestAll
Tests run: 4, Failures: 0, Errors: 0, Skipped: 0, Time elapsed: 0.163 sec
Running org.apache.jackrabbit.spi.commons.name.NameFactoryTest
Tests run: 3, Failures: 0, Errors: 0, Skipped: 0, Time elapsed: 0.009 sec
Running org.apache.jackrabbit.spi.commons.query.xpath.XPathOrderByTest
Tests run: 5, Failures: 0, Errors: 0, Skipped: 0, Time elapsed: 0.46 sec
Running org.apache.jackrabbit.spi.commons.nodetype.constraint.ReferenceConstraintTest
Tests run: 10, Failures: 0, Errors: 0, Skipped: 0, Time elapsed: 0.011 sec
Running org.apache.jackrabbit.spi.commons.query.xpath.QueryFormatTest
Tests run: 3, Failures: 0, Errors: 0, Skipped: 0, Time elapsed: 0.011 sec
Running org.apache.jackrabbit.spi.commons.name.PathTest
Tests run: 38, Failures: 0, Errors: 0, Skipped: 0, Time elapsed: 0.404 sec
Running org.apache.jackrabbit.spi.commons.name.PathFactoryTest
Tests run: 14, Failures: 0, Errors: 0, Skipped: 0, Time elapsed: 0.199 sec
Running org.apache.jackrabbit.spi.commons.conversion.PathParserTest
Tests run: 12, Failures: 0, Errors: 0, Skipped: 0, Time elapsed: 0.026 sec
Running org.apache.jackrabbit.spi.commons.name.PathBuilderTest
Tests run: 2, Failures: 0, Errors: 0, Skipped: 0, Time elapsed: 0.229 sec
Running org.apache.jackrabbit.spi.commons.conversion.NameParserTest
Tests run: 4, Failures: 0, Errors: 0, Skipped: 0, Time elapsed: 0.011 sec
Running org.apache.jackrabbit.spi.commons.nodetype.constraint.DateConstraintTest
Tests run: 10, Failures: 0, Errors: 0, Skipped: 0, Time elapsed: 0.034 sec
Running org.apache.jackrabbit.spi.commons.nodetype.TestAll
Tests run: 3, Failures: 0, Errors: 0, Skipped: 0, Time elapsed: 0.004 sec
Running org.apache.jackrabbit.spi.commons.nodetype.constraint.NameConstraintTest
Tests run: 10, Failures: 0, Errors: 0, Skipped: 0, Time elapsed: 0.007 sec
Running org.apache.jackrabbit.spi.commons.name.PatternTest
Tests run: 13, Failures: 0, Errors: 0, Skipped: 0, Time elapsed: 0.022 sec

Results :

Tests run: 263, Failures: 0, Errors: 0, Skipped: 0

[TASKS] Skipping maven reporter: there is already a result available.
[JENKINS] Recording test results
[INFO] [bundle:bundle {execution: default-bundle}]
[TASKS] Skipping maven reporter: there is already a result available.
[INFO] [apache-rat:check {execution: default}]
[INFO] Exclude: src/main/javacc/xpath/*
[INFO] [install:install {execution: default-install}]
[TASKS] Skipping maven reporter: there is already a result available.
[INFO] Installing <https://builds.apache.org/job/Jackrabbit-trunk/ws/trunk/jackrabbit-spi-commons/target/jackrabbit-spi-commons-2.3-SNAPSHOT.jar>
to /export/home/hudson/.m2/repository/org/apache/jackrabbit/jackrabbit-spi-commons/2.3-SNAPSHOT/jackrabbit-spi-commons-2.3-SNAPSHOT.jar
[TASKS] Skipping maven reporter: there is already a result available.[INFO] [bundle:install
{execution: default-install}]
[INFO] Parsing file:/export/home/hudson/.m2/repository/repository.xml

[Fatal Error] :-1:-1: Premature end of file.
org.xml.sax.SAXParseException: Premature end of file.
	at com.sun.org.apache.xerces.internal.parsers.DOMParser.parse(DOMParser.java:264)
	at com.sun.org.apache.xerces.internal.jaxp.DocumentBuilderImpl.parse(DocumentBuilderImpl.java:292)
	at javax.xml.parsers.DocumentBuilder.parse(DocumentBuilder.java:172)
	at org.apache.felix.obrplugin.ObrUpdate.parseFile(ObrUpdate.java:347)
	at org.apache.felix.obrplugin.ObrUpdate.parseRepositoryXml(ObrUpdate.java:324)
	at org.apache.felix.obrplugin.ObrInstall.execute(ObrInstall.java:140)
	at org.apache.maven.plugin.DefaultPluginManager.executeMojo(DefaultPluginManager.java:490)
	at hudson.maven.agent.PluginManagerInterceptor.executeMojo(PluginManagerInterceptor.java:182)
	at org.apache.maven.lifecycle.DefaultLifecycleExecutor.executeGoals(DefaultLifecycleExecutor.java:694)
	at org.apache.maven.lifecycle.DefaultLifecycleExecutor.executeGoalWithLifecycle(DefaultLifecycleExecutor.java:556)
	at org.apache.maven.lifecycle.DefaultLifecycleExecutor.executeGoal(DefaultLifecycleExecutor.java:535)
	at org.apache.maven.lifecycle.DefaultLifecycleExecutor.executeGoalAndHandleFailures(DefaultLifecycleExecutor.java:387)
	at org.apache.maven.lifecycle.DefaultLifecycleExecutor.executeTaskSegments(DefaultLifecycleExecutor.java:348)
	at org.apache.maven.lifecycle.DefaultLifecycleExecutor.execute(DefaultLifecycleExecutor.java:180)
	at org.apache.maven.lifecycle.LifecycleExecutorInterceptor.execute(LifecycleExecutorInterceptor.java:65)
	at org.apache.maven.DefaultMaven.doExecute(DefaultMaven.java:328)
	at org.apache.maven.DefaultMaven.execute(DefaultMaven.java:138)
	at org.apache.maven.cli.MavenCli.main(MavenCli.java:362)
	at sun.reflect.NativeMethodAccessorImpl.invoke0(Native Method)
	at sun.reflect.NativeMethodAccessorImpl.invoke(NativeMethodAccessorImpl.java:39)
	at sun.reflect.DelegatingMethodAccessorImpl.invoke(DelegatingMethodAccessorImpl.java:25)
	at java.lang.reflect.Method.invoke(Method.java:592)
	at org.codehaus.classworlds.Launcher.launchEnhanced(Launcher.java:315)
	at org.codehaus.classworlds.Launcher.launch(Launcher.java:255)
	at hudson.maven.agent.Main.launch(Main.java:185)
	at hudson.maven.MavenBuilder.call(MavenBuilder.java:164)
	at hudson.maven.MavenModuleSetBuild$Builder.call(MavenModuleSetBuild.java:987)
	at hudson.maven.MavenModuleSetBuild$Builder.call(MavenModuleSetBuild.java:918)
	at hudson.remoting.UserRequest.perform(UserRequest.java:118)
	at hudson.remoting.UserRequest.perform(UserRequest.java:48)
	at hudson.remoting.Request$2.run(Request.java:270)
	at java.util.concurrent.Executors$RunnableAdapter.call(Executors.java:417)
	at java.util.concurrent.FutureTask$Sync.innerRun(FutureTask.java:269)
	at java.util.concurrent.FutureTask.run(FutureTask.java:123)
	at java.util.concurrent.ThreadPoolExecutor$Worker.runTask(ThreadPoolExecutor.java:651)
	at java.util.concurrent.ThreadPoolExecutor$Worker.run(ThreadPoolExecutor.java:676)
	at java.lang.Thread.run(Thread.java:595)
[INFO] Writing OBR metadata
[TASKS] Skipping maven reporter: there is already a result available.
[INFO] [deploy:deploy {execution: default-deploy}]
[INFO] Retrieving previous build number from apache.snapshots.https
Uploading: https://repository.apache.org/content/repositories/snapshots/org/apache/jackrabbit/jackrabbit-spi-commons/2.3-SNAPSHOT/jackrabbit-spi-commons-2.3-20110705.090423-183.jar
737K uploaded  (jackrabbit-spi-commons-2.3-20110705.090423-183.jar)
[INFO] Retrieving previous metadata from apache.snapshots.https
[INFO] Uploading repository metadata for: 'snapshot org.apache.jackrabbit:jackrabbit-spi-commons:2.3-SNAPSHOT'
[INFO] Retrieving previous metadata from apache.snapshots.https
[INFO] Uploading repository metadata for: 'artifact org.apache.jackrabbit:jackrabbit-spi-commons'
[INFO] Uploading project information for jackrabbit-spi-commons 2.3-20110705.090423-183
[TASKS] Skipping maven reporter: there is already a result available.
[INFO] [bundle:deploy {execution: default-deploy}]
[INFO] Remote OBR update disabled (enable with -DremoteOBR)
[TASKS] Skipping maven reporter: there is already a result available.
[JENKINS] Archiving disabled - not archiving <https://builds.apache.org/job/Jackrabbit-trunk/ws/trunk/jackrabbit-spi-commons/pom.xml>
[JENKINS] Archiving disabled - not archiving <https://builds.apache.org/job/Jackrabbit-trunk/ws/trunk/jackrabbit-spi-commons/target/jackrabbit-spi-commons-2.3-SNAPSHOT.jar>
[INFO] ------------------------------------------------------------------------
[INFO] Building Jackrabbit Core
[INFO]    task-segment: [clean, deploy]
[INFO] ------------------------------------------------------------------------
[INFO] [clean:clean {execution: default-clean}]
[INFO] Deleting file set: <https://builds.apache.org/job/Jackrabbit-trunk/ws/trunk/jackrabbit-core/target>
(included: [**], excluded: [])
[TASKS] Scanning folder '<https://builds.apache.org/job/Jackrabbit-trunk/ws/trunk/jackrabbit-core/src/main/java'>
for tasks ... 
[TASKS] Found 217.
[TASKS] Scanning folder '<https://builds.apache.org/job/Jackrabbit-trunk/ws/trunk/jackrabbit-core/src/test/java'>
for tasks ... 
[TASKS] Found 30.
[TASKS] Scanning folder '<https://builds.apache.org/job/Jackrabbit-trunk/ws/trunk/jackrabbit-core/src/main/resources'>
for tasks ... 
[TASKS] Found 0.
[TASKS] Scanning folder '<https://builds.apache.org/job/Jackrabbit-trunk/ws/trunk/jackrabbit-core/src/main/resources-filtered'>
for tasks ... 
[TASKS] Found 0.
[TASKS] Scanning folder '<https://builds.apache.org/job/Jackrabbit-trunk/ws/trunk/jackrabbit-core/src/test/resources'>
for tasks ... 
[TASKS] Found 0.
[TASKS] Using set difference to compute new warnings
[TASKS] Not changing build status, since no threshold has been exceeded
[INFO] snapshot org.apache.jackrabbit:jackrabbit-api:2.3-SNAPSHOT: checking for updates from
apache.snapshots
[INFO] snapshot org.apache.jackrabbit:jackrabbit-spi-commons:2.3-SNAPSHOT: checking for updates
from apache.snapshots
[INFO] [remote-resources:process {execution: default}]
[TASKS] Skipping maven reporter: there is already a result available.
[INFO] [resources:resources {execution: default-resources}]
[INFO] Using 'UTF-8' encoding to copy filtered resources.
[INFO] Copying 70 resources
[INFO] Copying 1 resource
[INFO] Copying 3 resources
[TASKS] Skipping maven reporter: there is already a result available.
[INFO] [compiler:compile {execution: default-compile}]
[INFO] Compiling 720 source files to <https://builds.apache.org/job/Jackrabbit-trunk/ws/trunk/jackrabbit-core/target/classes>
[TASKS] Skipping maven reporter: there is already a result available.
[JENKINS] Archiving disabled - not archiving <https://builds.apache.org/job/Jackrabbit-trunk/ws/trunk/jackrabbit-core/pom.xml>
[INFO] ------------------------------------------------------------------------
[ERROR] BUILD FAILURE
[INFO] ------------------------------------------------------------------------
[INFO] Compilation failure
<https://builds.apache.org/job/Jackrabbit-trunk/ws/trunk/jackrabbit-core/src/main/java/org/apache/jackrabbit/core/query/lucene/JackrabbitQueryParser.java>:[24,31]
package javax.xml.stream.events does not exist


[INFO] ------------------------------------------------------------------------
[INFO] For more information, run Maven with the -e switch
[INFO] ------------------------------------------------------------------------
[INFO] Total time: 4 minutes 53 seconds
[INFO] Finished at: Tue Jul 05 05:08:52 EDT 2011
[INFO] Final Memory: 64M/256M
[INFO] ------------------------------------------------------------------------
[TASKS] Aggregating results of Jackrabbit Parent POM
[TASKS] Using set difference to compute new warnings
[TASKS] Not changing build status, since no threshold has been exceeded
[TASKS] Aggregating results of Apache Jackrabbit API
[TASKS] Using set difference to compute new warnings
[TASKS] Not changing build status, since no threshold has been exceeded
[TASKS] Aggregating results of Jackrabbit JCR Commons
[TASKS] Using set difference to compute new warnings
[TASKS] Not changing build status, since no threshold has been exceeded
[TASKS] Aggregating results of Jackrabbit JCR Tests
[TASKS] Using set difference to compute new warnings
[TASKS] Not changing build status, since no threshold has been exceeded
[TASKS] Aggregating results of Jackrabbit SPI
[TASKS] Using set difference to compute new warnings
[TASKS] Not changing build status, since no threshold has been exceeded
[TASKS] Aggregating results of Jackrabbit SPI Commons
[TASKS] Using set difference to compute new warnings
[TASKS] Not changing build status, since no threshold has been exceeded
[TASKS] Aggregating results of Jackrabbit Core
[TASKS] Using set difference to compute new warnings
[TASKS] Not changing build status, since no threshold has been exceeded
Sending e-mails to: dev@jackrabbit.apache.org
channel stopped
[locks-and-latches] Releasing all the locks
[locks-and-latches] All the locks released


Mime
View raw message