jackrabbit-dev mailing list archives

Site index · List index
Message view « Date » · « Thread »
Top « Date » · « Thread »
From Apache Jenkins Server <hud...@hudson.apache.org>
Subject Build failed in Jenkins: Jackrabbit-trunk #1519
Date Thu, 28 Apr 2011 09:43:59 GMT
See <https://builds.apache.org/hudson/job/Jackrabbit-trunk/1519/changes>

Changes:

[angela] JCR-2951 - Item.remove fails if a child-item is not visible to the editing session

[angela] add @Override

[angela] JCR-2952 - PrivilegeHandlerTest fails on Windows

------------------------------------------
[...truncated 533 lines...]
Running org.apache.jackrabbit.spi.commons.nodetype.constraint.BooleanConstraintTest
Tests run: 11, Failures: 0, Errors: 0, Skipped: 0, Time elapsed: 0.027 sec
Running org.apache.jackrabbit.spi.commons.nodetype.NodeDefinitionTemplateImplTest
Tests run: 1, Failures: 0, Errors: 0, Skipped: 0, Time elapsed: 0.028 sec
Running org.apache.jackrabbit.spi.commons.identifier.SerializationTest
Tests run: 2, Failures: 0, Errors: 0, Skipped: 0, Time elapsed: 0.015 sec
Running org.apache.jackrabbit.spi.commons.privilege.TestAll
Tests run: 4, Failures: 0, Errors: 0, Skipped: 0, Time elapsed: 0.037 sec
Running org.apache.jackrabbit.spi.commons.query.xpath.XPathOrderByTest
Tests run: 5, Failures: 0, Errors: 0, Skipped: 0, Time elapsed: 0.216 sec
Running org.apache.jackrabbit.spi.commons.name.NameFactoryTest
Tests run: 3, Failures: 0, Errors: 0, Skipped: 0, Time elapsed: 0.006 sec
Running org.apache.jackrabbit.spi.commons.nodetype.constraint.ReferenceConstraintTest
Tests run: 10, Failures: 0, Errors: 0, Skipped: 0, Time elapsed: 0.011 sec
Running org.apache.jackrabbit.spi.commons.query.xpath.QueryFormatTest
Tests run: 3, Failures: 0, Errors: 0, Skipped: 0, Time elapsed: 0.009 sec
Running org.apache.jackrabbit.spi.commons.name.PathTest
Tests run: 38, Failures: 0, Errors: 0, Skipped: 0, Time elapsed: 0.065 sec
Running org.apache.jackrabbit.spi.commons.name.PathFactoryTest
Tests run: 14, Failures: 0, Errors: 0, Skipped: 0, Time elapsed: 0.036 sec
Running org.apache.jackrabbit.spi.commons.conversion.PathParserTest
Tests run: 8, Failures: 0, Errors: 0, Skipped: 0, Time elapsed: 0.011 sec
Running org.apache.jackrabbit.spi.commons.name.PathBuilderTest
Tests run: 2, Failures: 0, Errors: 0, Skipped: 0, Time elapsed: 0.005 sec
Running org.apache.jackrabbit.spi.commons.conversion.NameParserTest
Tests run: 4, Failures: 0, Errors: 0, Skipped: 0, Time elapsed: 0.005 sec
Running org.apache.jackrabbit.spi.commons.nodetype.constraint.DateConstraintTest
Tests run: 10, Failures: 0, Errors: 0, Skipped: 0, Time elapsed: 0.029 sec
Running org.apache.jackrabbit.spi.commons.nodetype.TestAll
Tests run: 3, Failures: 0, Errors: 0, Skipped: 0, Time elapsed: 0.003 sec
Running org.apache.jackrabbit.spi.commons.nodetype.constraint.NameConstraintTest
Tests run: 10, Failures: 0, Errors: 0, Skipped: 0, Time elapsed: 0.021 sec
Running org.apache.jackrabbit.spi.commons.name.PatternTest
Tests run: 13, Failures: 0, Errors: 0, Skipped: 0, Time elapsed: 0.019 sec

Results :

Tests run: 258, Failures: 0, Errors: 0, Skipped: 0

[INFO] [bundle:bundle {execution: default-bundle}]
[INFO] [apache-rat:check {execution: default}]
[INFO] Exclude: src/main/javacc/xpath/*
[INFO] [install:install {execution: default-install}]
[INFO] Installing <https://builds.apache.org/hudson/job/Jackrabbit-trunk/ws/trunk/jackrabbit-spi-commons/target/jackrabbit-spi-commons-2.3-SNAPSHOT.jar>
to /export/home/hudson/.m2/repository/org/apache/jackrabbit/jackrabbit-spi-commons/2.3-SNAPSHOT/jackrabbit-spi-commons-2.3-SNAPSHOT.jar
[INFO] [bundle:install {execution: default-install}]
[INFO] Parsing file:/export/home/hudson/.m2/repository/repository.xml
[INFO] Installing org/apache/jackrabbit/jackrabbit-spi-commons/2.3-SNAPSHOT/jackrabbit-spi-commons-2.3-SNAPSHOT.jar
[INFO] Writing OBR metadata
[INFO] [deploy:deploy {execution: default-deploy}]
[INFO] Retrieving previous build number from apache.snapshots.https
Uploading: https://repository.apache.org/content/repositories/snapshots/org/apache/jackrabbit/jackrabbit-spi-commons/2.3-SNAPSHOT/jackrabbit-spi-commons-2.3-20110428.092627-137.jar
736K uploaded  (jackrabbit-spi-commons-2.3-20110428.092627-137.jar)
[INFO] Retrieving previous metadata from apache.snapshots.https
[INFO] Uploading repository metadata for: 'snapshot org.apache.jackrabbit:jackrabbit-spi-commons:2.3-SNAPSHOT'
[INFO] Retrieving previous metadata from apache.snapshots.https
[INFO] Uploading repository metadata for: 'artifact org.apache.jackrabbit:jackrabbit-spi-commons'
[INFO] Uploading project information for jackrabbit-spi-commons 2.3-20110428.092627-137
[INFO] [bundle:deploy {execution: default-deploy}]
[INFO] Remote OBR update disabled (enable with -DremoteOBR)
[INFO] ------------------------------------------------------------------------
[INFO] Building Jackrabbit Core
[INFO]    task-segment: [clean, deploy]
[INFO] ------------------------------------------------------------------------
[INFO] [clean:clean {execution: default-clean}]
[INFO] Deleting file set: <https://builds.apache.org/hudson/job/Jackrabbit-trunk/ws/trunk/jackrabbit-core/target>
(included: [**], excluded: [])

[TASKS] Scanning folder '<https://builds.apache.org/hudson/job/Jackrabbit-trunk/ws/trunk/jackrabbit-core/src/test/java'>
for tasks ... 
[TASKS] Found 30.
[TASKS] Scanning folder '<https://builds.apache.org/hudson/job/Jackrabbit-trunk/ws/trunk/jackrabbit-core/src/main/resources'>
for tasks ... 
[TASKS] Found 0.
[TASKS] Scanning folder '<https://builds.apache.org/hudson/job/Jackrabbit-trunk/ws/trunk/jackrabbit-core/src/main/resources-filtered'>
for tasks ... 
[TASKS] Found 0.
[TASKS] Scanning folder '<https://builds.apache.org/hudson/job/Jackrabbit-trunk/ws/trunk/jackrabbit-core/src/test/resources'>
for tasks ... 
[TASKS] Found 0.
[TASKS] Skipping maven reporter: there is already a result available.
[TASKS] Skipping maven reporter: there is already a result available.
[TASKS] Skipping maven reporter: there is already a result available.
[TASKS] Skipping maven reporter: there is already a result available.
[TASKS] Skipping maven reporter: there is already a result available.
[TASKS] Skipping maven reporter: there is already a result available.
[INFO] snapshot org.apache.jackrabbit:jackrabbit-api:2.3-SNAPSHOT: checking for updates from
apache.snapshots
[INFO] snapshot org.apache.jackrabbit:jackrabbit-spi-commons:2.3-SNAPSHOT: checking for updates
from apache.snapshots
[INFO] [remote-resources:process {execution: default}]
[INFO] [resources:resources {execution: default-resources}]
[INFO] Using 'UTF-8' encoding to copy filtered resources.
[INFO] Copying 70 resources
[INFO] Copying 1 resource
[INFO] Copying 3 resources
[INFO] [compiler:compile {execution: default-compile}]
[INFO] Compiling 719 source files to <https://builds.apache.org/hudson/job/Jackrabbit-trunk/ws/trunk/jackrabbit-core/target/classes>
[INFO] [resources:testResources {execution: default-testResources}]
[INFO] Using 'UTF-8' encoding to copy filtered resources.
[INFO] Copying 28 resources
[INFO] Copying 3 resources
[INFO] [antrun:run {execution: process-test-resources}]
[INFO] Executing tasks
     [copy] Copying 34 files to <https://builds.apache.org/hudson/job/Jackrabbit-trunk/ws/trunk/jackrabbit-core/target/repository>
     [copy] Copying 34 files to <https://builds.apache.org/hudson/job/Jackrabbit-trunk/ws/trunk/jackrabbit-core/target/repository-2>
[INFO] Executed tasks
[INFO] [compiler:testCompile {execution: default-testCompile}]
[INFO] Compiling 332 source files to <https://builds.apache.org/hudson/job/Jackrabbit-trunk/ws/trunk/jackrabbit-core/target/test-classes>
[INFO] [surefire:test {execution: default-test}]
[INFO] Surefire report directory: <https://builds.apache.org/hudson/job/Jackrabbit-trunk/ws/trunk/jackrabbit-core/target/surefire-reports>

-------------------------------------------------------
 T E S T S
-------------------------------------------------------
Running org.apache.jackrabbit.core.version.TestAll
Tests run: 5, Failures: 0, Errors: 0, Skipped: 0, Time elapsed: 14.79 sec
Running org.apache.jackrabbit.core.security.authorization.principalbased.TestAll
Tests run: 96, Failures: 0, Errors: 0, Skipped: 0, Time elapsed: 0.48 sec
Running org.apache.jackrabbit.api.security.authorization.TestAll
Tests run: 7, Failures: 0, Errors: 0, Skipped: 0, Time elapsed: 0.028 sec
Running org.apache.jackrabbit.core.config.TestAll
Tests run: 25, Failures: 0, Errors: 0, Skipped: 0, Time elapsed: 0.524 sec
Running org.apache.jackrabbit.api.security.TestAll
Tests run: 4, Failures: 0, Errors: 0, Skipped: 0, Time elapsed: 0.084 sec
Running org.apache.jackrabbit.core.security.authorization.acl.TestAll
Tests run: 129, Failures: 0, Errors: 0, Skipped: 0, Time elapsed: 9.139 sec
Running org.apache.jackrabbit.core.query.lucene.directory.TestAll
Tests run: 6, Failures: 0, Errors: 0, Skipped: 0, Time elapsed: 0.029 sec
Running org.apache.jackrabbit.core.security.authentication.TestAll
Tests run: 18, Failures: 0, Errors: 0, Skipped: 0, Time elapsed: 0.14 sec
Running org.apache.jackrabbit.core.security.user.TestAll
Tests run: 181, Failures: 0, Errors: 0, Skipped: 0, Time elapsed: 4.028 sec
Running org.apache.jackrabbit.core.journal.TestAll
Tests run: 4, Failures: 0, Errors: 0, Skipped: 0, Time elapsed: 1.052 sec
Running org.apache.jackrabbit.api.security.principal.TestAll
Tests run: 16, Failures: 0, Errors: 0, Skipped: 0, Time elapsed: 0.155 sec
Running org.apache.jackrabbit.core.state.TestAll
Tests run: 46, Failures: 0, Errors: 0, Skipped: 0, Time elapsed: 4.964 sec
Running org.apache.jackrabbit.core.security.TestAll
Tests run: 16, Failures: 0, Errors: 0, Skipped: 0, Time elapsed: 0.642 sec
Running org.apache.jackrabbit.core.lock.TestAll
Tests run: 7, Failures: 0, Errors: 0, Skipped: 0, Time elapsed: 10.853 sec
Running org.apache.jackrabbit.api.TestAll
Tests run: 2, Failures: 0, Errors: 0, Skipped: 0, Time elapsed: 0.24 sec
Running org.apache.jackrabbit.core.util.TestAll
Tests run: 4, Failures: 0, Errors: 0, Skipped: 0, Time elapsed: 2.208 sec
Running org.apache.jackrabbit.core.security.principal.TestAll
Tests run: 5, Failures: 0, Errors: 0, Skipped: 0, Time elapsed: 0.027 sec
Running org.apache.jackrabbit.core.persistence.util.TestAll
Tests run: 5, Failures: 0, Errors: 0, Skipped: 0, Time elapsed: 0.069 sec
Running org.apache.jackrabbit.api.security.user.TestAll
Tests run: 114, Failures: 0, Errors: 0, Skipped: 0, Time elapsed: 21.221 sec
Running org.apache.jackrabbit.core.cluster.TestAll
Tests run: 11, Failures: 0, Errors: 0, Skipped: 0, Time elapsed: 2.14 sec
Running org.apache.jackrabbit.core.nodetype.xml.TestAll
Tests run: 38, Failures: 0, Errors: 0, Skipped: 0, Time elapsed: 0.746 sec
Running org.apache.jackrabbit.core.fs.TestAll
Tests run: 3, Failures: 0, Errors: 0, Skipped: 0, Time elapsed: 0.666 sec
Running org.apache.jackrabbit.core.TestAll
Tests run: 128, Failures: 0, Errors: 0, Skipped: 0, Time elapsed: 2.191 sec
Running org.apache.jackrabbit.core.security.authorization.combined.TestAll
Tests run: 49, Failures: 0, Errors: 0, Skipped: 0, Time elapsed: 1.51 sec
Running org.apache.jackrabbit.core.xml.TestAll
Tests run: 13, Failures: 0, Errors: 0, Skipped: 0, Time elapsed: 0.223 sec
Running org.apache.jackrabbit.core.util.db.TestAll
Tests run: 13, Failures: 0, Errors: 0, Skipped: 0, Time elapsed: 0.113 sec
Running org.apache.jackrabbit.core.security.authentication.token.TestAll
Tests run: 13, Failures: 0, Errors: 0, Skipped: 0, Time elapsed: 11.388 sec
Running org.apache.jackrabbit.core.observation.TestAll
Tests run: 14, Failures: 0, Errors: 0, Skipped: 0, Time elapsed: 0.246 sec
Running org.apache.jackrabbit.core.retention.TestAll
Tests run: 5, Failures: 0, Errors: 0, Skipped: 0, Time elapsed: 0.017 sec
Running org.apache.jackrabbit.core.value.TestAll
Tests run: 92, Failures: 0, Errors: 0, Skipped: 0, Time elapsed: 0.085 sec
Running org.apache.jackrabbit.core.nodetype.TestAll
Tests run: 2, Failures: 0, Errors: 0, Skipped: 0, Time elapsed: 0.478 sec
Running org.apache.jackrabbit.core.id.TestAll
Tests run: 12, Failures: 0, Errors: 0, Skipped: 0, Time elapsed: 0.118 sec
Running org.apache.jackrabbit.core.query.lucene.TestAll
Tests run: 13, Failures: 0, Errors: 0, Skipped: 0, Time elapsed: 3.187 sec
Running org.apache.jackrabbit.core.persistence.TestAll
Tests run: 1, Failures: 0, Errors: 0, Skipped: 0, Time elapsed: 1.411 sec
Running org.apache.jackrabbit.core.query.TestAll
Tests run: 176, Failures: 0, Errors: 0, Skipped: 0, Time elapsed: 7.918 sec
Running org.apache.jackrabbit.core.security.authorization.TestAll
Tests run: 76, Failures: 0, Errors: 0, Skipped: 0, Time elapsed: 0.726 sec
Running org.apache.jackrabbit.core.data.TestAll
Tests run: 24, Failures: 0, Errors: 0, Skipped: 0, Time elapsed: 13.717 sec

Results :

Tests run: 1373, Failures: 0, Errors: 0, Skipped: 0

[TASKS] Skipping maven reporter: there is already a result available.
[JENKINS] Recording test results
[locks-and-latches] Releasing all the locks
[locks-and-latches] All the locks released
ERROR: Processing failed due to a bug in the code. Please report this to jenkinsci-users@googlegroups.com
hudson.remoting.RequestAbortedException: hudson.remoting.RequestAbortedException: java.io.UTFDataFormatException
	at hudson.remoting.Request.call(Request.java:137)
	at hudson.remoting.Channel.call(Channel.java:643)
	at hudson.maven.ProcessCache$MavenProcess.call(ProcessCache.java:156)
	at hudson.maven.MavenModuleSetBuild$RunnerImpl.doRun(MavenModuleSetBuild.java:736)
	at hudson.model.AbstractBuild$AbstractRunner.run(AbstractBuild.java:423)
	at hudson.model.Run.run(Run.java:1362)
	at hudson.maven.MavenModuleSetBuild.run(MavenModuleSetBuild.java:467)
	at hudson.model.ResourceController.execute(ResourceController.java:88)
	at hudson.model.Executor.run(Executor.java:145)
Caused by: hudson.remoting.RequestAbortedException: java.io.UTFDataFormatException
	at hudson.remoting.Request.abort(Request.java:257)
	at hudson.remoting.Channel.terminate(Channel.java:694)
	at hudson.slaves.Channels$1.terminate(Channels.java:77)
	at hudson.remoting.Channel$ReaderThread.run(Channel.java:1016)
Caused by: java.io.UTFDataFormatException
	at java.io.ObjectInputStream$BlockDataInputStream.readUTFSpan(ObjectInputStream.java:3081)
	at java.io.ObjectInputStream$BlockDataInputStream.readUTFBody(ObjectInputStream.java:3006)
	at java.io.ObjectInputStream$BlockDataInputStream.readUTF(ObjectInputStream.java:2819)
	at java.io.ObjectInputStream.readUTF(ObjectInputStream.java:1050)
	at java.io.ObjectStreamClass.readNonProxy(ObjectStreamClass.java:616)
	at java.io.ObjectInputStream.readClassDescriptor(ObjectInputStream.java:808)
	at java.io.ObjectInputStream.readNonProxyDesc(ObjectInputStream.java:1564)
	at java.io.ObjectInputStream.readClassDesc(ObjectInputStream.java:1495)
	at java.io.ObjectInputStream.readObject0(ObjectInputStream.java:1315)
	at java.io.ObjectInputStream.readObject(ObjectInputStream.java:350)
	at hudson.remoting.Channel$ReaderThread.run(Channel.java:992)
project=hudson.maven.MavenModuleSet@5c50595a[Jackrabbit-trunk]
project.getModules()=[hudson.maven.MavenModule@e78862c[Jackrabbit-trunk/org.apache.jackrabbit:jackrabbit][Jackrabbit-trunk/org.apache.jackrabbit:jackrabbit][relativePath:],
hudson.maven.MavenModule@48462f0b[Jackrabbit-trunk/org.apache.jackrabbit:jackrabbit-api][Jackrabbit-trunk/org.apache.jackrabbit:jackrabbit-api][relativePath:jackrabbit-api],
hudson.maven.MavenModule@531ae96e[Jackrabbit-trunk/org.apache.jackrabbit:jackrabbit-bundle][Jackrabbit-trunk/org.apache.jackrabbit:jackrabbit-bundle][relativePath:jackrabbit-bundle],
hudson.maven.MavenModule@215cfda1[Jackrabbit-trunk/org.apache.jackrabbit:jackrabbit-core][Jackrabbit-trunk/org.apache.jackrabbit:jackrabbit-core][relativePath:jackrabbit-core],
hudson.maven.MavenModule@633d2934[Jackrabbit-trunk/org.apache.jackrabbit:jackrabbit-jca][Jackrabbit-trunk/org.apache.jackrabbit:jackrabbit-jca][relativePath:jackrabbit-jca],
hudson.maven.MavenModule@1f12b792[Jackrabbit-trunk/org.apache.jackrabbit:jackrabbit-jcr-client][Jackrabbit-trunk/org.apache.jackrabbit:jackrabbit-jcr-client][relativePath:jackrabbit-jcr-client],
hudson.maven.MavenModule@6f8400b6[Jackrabbit-trunk/org.apache.jackrabbit:jackrabbit-jcr-commons][Jackrabbit-trunk/org.apache.jackrabbit:jackrabbit-jcr-commons][relativePath:jackrabbit-jcr-commons],
hudson.maven.MavenModule@2750d409[Jackrabbit-trunk/org.apache.jackrabbit:jackrabbit-jcr-rmi][Jackrabbit-trunk/org.apache.jackrabbit:jackrabbit-jcr-rmi][relativePath:jackrabbit-jcr-rmi],
hudson.maven.MavenModule@2106f5c[Jackrabbit-trunk/org.apache.jackrabbit:jackrabbit-jcr-server][Jackrabbit-trunk/org.apache.jackrabbit:jackrabbit-jcr-server][relativePath:jackrabbit-jcr-server],
hudson.maven.MavenModule@63d1b4df[Jackrabbit-trunk/org.apache.jackrabbit:jackrabbit-jcr-servlet][Jackrabbit-trunk/org.apache.jackrabbit:jackrabbit-jcr-servlet][relativePath:jackrabbit-jcr-servlet],
hudson.maven.MavenModule@165156e1[Jackrabbit-trunk/org.apache.jackrabbit:jackrabbit-jcr-tests][Jackrabbit-trunk/org.apache.jackrabbit:jackrabbit-jcr-tests][relativePath:jackrabbit-jcr-tests],
hudson.maven.MavenModule@2f17c5aa[Jackrabbit-trunk/org.apache.jackrabbit:jackrabbit-jcr2dav][Jackrabbit-trunk/org.apache.jackrabbit:jackrabbit-jcr2dav][relativePath:jackrabbit-jcr2dav],
hudson.maven.MavenModule@6b9c29fa[Jackrabbit-trunk/org.apache.jackrabbit:jackrabbit-jcr2spi][Jackrabbit-trunk/org.apache.jackrabbit:jackrabbit-jcr2spi][relativePath:jackrabbit-jcr2spi],
hudson.maven.MavenModule@de2d180[Jackrabbit-trunk/org.apache.jackrabbit:jackrabbit-parent][Jackrabbit-trunk/org.apache.jackrabbit:jackrabbit-parent][relativePath:jackrabbit-parent],
hudson.maven.MavenModule@189f4624[Jackrabbit-trunk/org.apache.jackrabbit:jackrabbit-spi][Jackrabbit-trunk/org.apache.jackrabbit:jackrabbit-spi][relativePath:jackrabbit-spi],
hudson.maven.MavenModule@1893df46[Jackrabbit-trunk/org.apache.jackrabbit:jackrabbit-spi-commons][Jackrabbit-trunk/org.apache.jackrabbit:jackrabbit-spi-commons][relativePath:jackrabbit-spi-commons],
hudson.maven.MavenModule@2b3e5e6b[Jackrabbit-trunk/org.apache.jackrabbit:jackrabbit-spi2dav][Jackrabbit-trunk/org.apache.jackrabbit:jackrabbit-spi2dav][relativePath:jackrabbit-spi2dav],
hudson.maven.MavenModule@19ecc230[Jackrabbit-trunk/org.apache.jackrabbit:jackrabbit-spi2jcr][Jackrabbit-trunk/org.apache.jackrabbit:jackrabbit-spi2jcr][relativePath:jackrabbit-spi2jcr],
hudson.maven.MavenModule@33a792d0[Jackrabbit-trunk/org.apache.jackrabbit:jackrabbit-standalone][Jackrabbit-trunk/org.apache.jackrabbit:jackrabbit-standalone][relativePath:jackrabbit-standalone],
hudson.maven.MavenModule@5fde5a95[Jackrabbit-trunk/org.apache.jackrabbit:jackrabbit-webapp][Jackrabbit-trunk/org.apache.jackrabbit:jackrabbit-webapp][relativePath:jackrabbit-webapp],
hudson.maven.MavenModule@d9dc662[Jackrabbit-trunk/org.apache.jackrabbit:jackrabbit-webdav][Jackrabbit-trunk/org.apache.jackrabbit:jackrabbit-webdav][relativePath:jackrabbit-webdav]]
project.getRootModule()=hudson.maven.MavenModule@e78862c[Jackrabbit-trunk/org.apache.jackrabbit:jackrabbit][Jackrabbit-trunk/org.apache.jackrabbit:jackrabbit][relativePath:]
FATAL: hudson.remoting.RequestAbortedException: java.io.UTFDataFormatException
hudson.remoting.RequestAbortedException: hudson.remoting.RequestAbortedException: java.io.UTFDataFormatException
	at hudson.remoting.Request.call(Request.java:137)
	at hudson.remoting.Channel.call(Channel.java:643)
	at hudson.maven.ProcessCache$MavenProcess.call(ProcessCache.java:156)
	at hudson.maven.MavenModuleSetBuild$RunnerImpl.doRun(MavenModuleSetBuild.java:736)
	at hudson.model.AbstractBuild$AbstractRunner.run(AbstractBuild.java:423)
	at hudson.model.Run.run(Run.java:1362)
	at hudson.maven.MavenModuleSetBuild.run(MavenModuleSetBuild.java:467)
	at hudson.model.ResourceController.execute(ResourceController.java:88)
	at hudson.model.Executor.run(Executor.java:145)
Caused by: hudson.remoting.RequestAbortedException: java.io.UTFDataFormatException
	at hudson.remoting.Request.abort(Request.java:257)
	at hudson.remoting.Channel.terminate(Channel.java:694)
	at hudson.slaves.Channels$1.terminate(Channels.java:77)
	at hudson.remoting.Channel$ReaderThread.run(Channel.java:1016)
Caused by: java.io.UTFDataFormatException
	at java.io.ObjectInputStream$BlockDataInputStream.readUTFSpan(ObjectInputStream.java:3081)
	at java.io.ObjectInputStream$BlockDataInputStream.readUTFBody(ObjectInputStream.java:3006)
	at java.io.ObjectInputStream$BlockDataInputStream.readUTF(ObjectInputStream.java:2819)
	at java.io.ObjectInputStream.readUTF(ObjectInputStream.java:1050)
	at java.io.ObjectStreamClass.readNonProxy(ObjectStreamClass.java:616)
	at java.io.ObjectInputStream.readClassDescriptor(ObjectInputStream.java:808)
	at java.io.ObjectInputStream.readNonProxyDesc(ObjectInputStream.java:1564)
	at java.io.ObjectInputStream.readClassDesc(ObjectInputStream.java:1495)
	at java.io.ObjectInputStream.readObject0(ObjectInputStream.java:1315)
	at java.io.ObjectInputStream.readObject(ObjectInputStream.java:350)
	at hudson.remoting.Channel$ReaderThread.run(Channel.java:992)


Mime
View raw message