jackrabbit-dev mailing list archives

Site index · List index
Message view « Date » · « Thread »
Top « Date » · « Thread »
From Apache Hudson Server <hud...@hudson.apache.org>
Subject Build failed in Hudson: Jackrabbit-trunk #1397
Date Fri, 10 Dec 2010 19:25:46 GMT
See <https://hudson.apache.org/hudson/job/Jackrabbit-trunk/1397/changes>

Changes:

[sebastien] Update javadoc link for future releases

------------------------------------------
[...truncated 1940 lines...]
[INFO] [compiler:compile {execution: default-compile}]
[INFO] Compiling 1 source file to <https://hudson.apache.org/hudson/job/Jackrabbit-trunk/ws/trunk/jackrabbit-jcr2dav/target/classes>
[TASKS] Skipping maven reporter: there is already a result available.[INFO] [resources:testResources
{execution: default-testResources}]
[INFO] Using 'UTF-8' encoding to copy filtered resources.
[INFO] Copying 2 resources
[INFO] Copying 3 resources

[TASKS] Skipping maven reporter: there is already a result available.
[INFO] [compiler:testCompile {execution: default-testCompile}]
[INFO] Compiling 2 source files to <https://hudson.apache.org/hudson/job/Jackrabbit-trunk/ws/trunk/jackrabbit-jcr2dav/target/test-classes>
[TASKS] Skipping maven reporter: there is already a result available.
[INFO] [surefire:test {execution: default-test}]
[INFO] Surefire report directory: <https://hudson.apache.org/hudson/job/Jackrabbit-trunk/ws/trunk/jackrabbit-jcr2dav/target/surefire-reports>

-------------------------------------------------------
 T E S T S
-------------------------------------------------------
Running org.apache.jackrabbit.jcr2dav.ConformanceTest
Tests run: 2306, Failures: 0, Errors: 0, Skipped: 0, Time elapsed: 2,424.953 sec

Results :

Tests run: 2306, Failures: 0, Errors: 0, Skipped: 0

[TASKS] Skipping maven reporter: there is already a result available.
[HUDSON] Recording test results
[INFO] [jar:jar {execution: default-jar}]
[INFO] Building jar: <https://hudson.apache.org/hudson/job/Jackrabbit-trunk/ws/trunk/jackrabbit-jcr2dav/target/jackrabbit-jcr2dav-2.3-SNAPSHOT.jar>
[TASKS] Skipping maven reporter: there is already a result available.
[INFO] [apache-rat:check {execution: default}]
[INFO] Exclude: release.properties
[TASKS] Skipping maven reporter: there is already a result available.
[INFO] [install:install {execution: default-install}]
[INFO] Installing <https://hudson.apache.org/hudson/job/Jackrabbit-trunk/ws/trunk/jackrabbit-jcr2dav/target/jackrabbit-jcr2dav-2.3-SNAPSHOT.jar>
to /export/home/hudson/.m2/repository/org/apache/jackrabbit/jackrabbit-jcr2dav/2.3-SNAPSHOT/jackrabbit-jcr2dav-2.3-SNAPSHOT.jar
[TASKS] Skipping maven reporter: there is already a result available.
[INFO] [deploy:deploy {execution: default-deploy}]
[INFO] Retrieving previous build number from apache.snapshots.https
Uploading: https://repository.apache.org/content/repositories/snapshots/org/apache/jackrabbit/jackrabbit-jcr2dav/2.3-SNAPSHOT/jackrabbit-jcr2dav-2.3-20101210.182115-29.jar
10K uploaded  (jackrabbit-jcr2dav-2.3-20101210.182115-29.jar)
[INFO] Retrieving previous metadata from apache.snapshots.https
[INFO] Uploading repository metadata for: 'snapshot org.apache.jackrabbit:jackrabbit-jcr2dav:2.3-SNAPSHOT'
[INFO] Uploading project information for jackrabbit-jcr2dav 2.3-20101210.182115-29
[INFO] Retrieving previous metadata from apache.snapshots.https
[INFO] Uploading repository metadata for: 'artifact org.apache.jackrabbit:jackrabbit-jcr2dav'
[TASKS] Skipping maven reporter: there is already a result available.
[HUDSON] Archiving disabled - not archiving <https://hudson.apache.org/hudson/job/Jackrabbit-trunk/ws/trunk/jackrabbit-jcr2dav/pom.xml>
[HUDSON] Archiving disabled - not archiving <https://hudson.apache.org/hudson/job/Jackrabbit-trunk/ws/trunk/jackrabbit-jcr2dav/target/jackrabbit-jcr2dav-2.3-SNAPSHOT.jar>
[INFO] ------------------------------------------------------------------------
[INFO] Building Jackrabbit JCR Client
[INFO]    task-segment: [clean, deploy]
[INFO] ------------------------------------------------------------------------
[INFO] [clean:clean {execution: default-clean}]
[INFO] Deleting file set: <https://hudson.apache.org/hudson/job/Jackrabbit-trunk/ws/trunk/jackrabbit-jcr-client/target>
(included: [**], excluded: [])
[TASKS] Scanning folder '<https://hudson.apache.org/hudson/job/Jackrabbit-trunk/ws/trunk/jackrabbit-jcr-client/src/main/java'>
for tasks ... 
[TASKS] Found 0.
[TASKS] Scanning folder '<https://hudson.apache.org/hudson/job/Jackrabbit-trunk/ws/trunk/jackrabbit-jcr-client/src/test/java'>
for tasks ... 
[TASKS] Found 0.
[TASKS] Scanning folder '<https://hudson.apache.org/hudson/job/Jackrabbit-trunk/ws/trunk/jackrabbit-jcr-client/src/main/resources'>
for tasks ... 
[TASKS] Found 0.
[TASKS] Skipping non-existent folder '<https://hudson.apache.org/hudson/job/Jackrabbit-trunk/ws/trunk/jackrabbit-jcr-client/src/test/resources'...>
[INFO] [remote-resources:process {execution: default}]
[TASKS] Skipping maven reporter: there is already a result available.
[INFO] [resources:resources {execution: default-resources}]
[INFO] Using 'UTF-8' encoding to copy filtered resources.
[INFO] Copying 1 resource
[INFO] Copying 3 resources
[TASKS] Skipping maven reporter: there is already a result available.
[INFO] [compiler:compile {execution: default-compile}]
[INFO] Compiling 1 source file to <https://hudson.apache.org/hudson/job/Jackrabbit-trunk/ws/trunk/jackrabbit-jcr-client/target/classes>
[TASKS] Skipping maven reporter: there is already a result available.
[INFO] [resources:testResources {execution: default-testResources}]
[INFO] Using 'UTF-8' encoding to copy filtered resources.
[INFO] skip non existing resourceDirectory <https://hudson.apache.org/hudson/job/Jackrabbit-trunk/ws/trunk/jackrabbit-jcr-client/src/test/resources>
[INFO] Copying 3 resources
[TASKS] Skipping maven reporter: there is already a result available.
[INFO] [compiler:testCompile {execution: default-testCompile}]
[INFO] Compiling 2 source files to <https://hudson.apache.org/hudson/job/Jackrabbit-trunk/ws/trunk/jackrabbit-jcr-client/target/test-classes>
[TASKS] Skipping maven reporter: there is already a result available.
[INFO] [surefire:test {execution: default-test}]
[INFO] Tests are skipped.
[TASKS] Skipping maven reporter: there is already a result available.
[INFO] [jar:jar {execution: default-jar}]
[INFO] Building jar: <https://hudson.apache.org/hudson/job/Jackrabbit-trunk/ws/trunk/jackrabbit-jcr-client/target/jackrabbit-jcr-client-2.3-SNAPSHOT.jar>
[TASKS] Skipping maven reporter: there is already a result available.
[INFO] [apache-rat:check {execution: default}]
[INFO] Exclude: repository/**
[INFO] Exclude: repository.xml
[INFO] Exclude: derby.log
[TASKS] Skipping maven reporter: there is already a result available.[INFO] [install:install
{execution: default-install}]

[INFO] Installing <https://hudson.apache.org/hudson/job/Jackrabbit-trunk/ws/trunk/jackrabbit-jcr-client/target/jackrabbit-jcr-client-2.3-SNAPSHOT.jar>
to /export/home/hudson/.m2/repository/org/apache/jackrabbit/jackrabbit-jcr-client/2.3-SNAPSHOT/jackrabbit-jcr-client-2.3-SNAPSHOT.jar
[TASKS] Skipping maven reporter: there is already a result available.[INFO] [deploy:deploy
{execution: default-deploy}]
[INFO] Retrieving previous build number from apache.snapshots.https

Uploading: https://repository.apache.org/content/repositories/snapshots/org/apache/jackrabbit/jackrabbit-jcr-client/2.3-SNAPSHOT/jackrabbit-jcr-client-2.3-20101210.182115-29.jar
9K uploaded  (jackrabbit-jcr-client-2.3-20101210.182115-29.jar)
[INFO] Retrieving previous metadata from apache.snapshots.https
[INFO] Uploading repository metadata for: 'artifact org.apache.jackrabbit:jackrabbit-jcr-client'
[INFO] Retrieving previous metadata from apache.snapshots.https
[INFO] Uploading repository metadata for: 'snapshot org.apache.jackrabbit:jackrabbit-jcr-client:2.3-SNAPSHOT'
[INFO] Uploading project information for jackrabbit-jcr-client 2.3-20101210.182115-29
[TASKS] Skipping maven reporter: there is already a result available.
[HUDSON] Archiving disabled - not archiving <https://hudson.apache.org/hudson/job/Jackrabbit-trunk/ws/trunk/jackrabbit-jcr-client/pom.xml>
[HUDSON] Archiving disabled - not archiving <https://hudson.apache.org/hudson/job/Jackrabbit-trunk/ws/trunk/jackrabbit-jcr-client/target/jackrabbit-jcr-client-2.3-SNAPSHOT.jar>
[INFO] ------------------------------------------------------------------------
[INFO] Building Jackrabbit Standalone
[INFO]    task-segment: [clean, deploy]
[INFO] ------------------------------------------------------------------------
[INFO] [clean:clean {execution: default-clean}]
[INFO] Deleting file set: <https://hudson.apache.org/hudson/job/Jackrabbit-trunk/ws/trunk/jackrabbit-standalone/target>
(included: [**], excluded: [])
[TASKS] Scanning folder '<https://hudson.apache.org/hudson/job/Jackrabbit-trunk/ws/trunk/jackrabbit-standalone/src/main/java'>
for tasks ... 
[TASKS] Found 2.
[TASKS] Skipping non-existent folder '<https://hudson.apache.org/hudson/job/Jackrabbit-trunk/ws/trunk/jackrabbit-standalone/src/test/java'...>
[TASKS] Scanning folder '<https://hudson.apache.org/hudson/job/Jackrabbit-trunk/ws/trunk/jackrabbit-standalone/src/main/resources'>
for tasks ... 
[TASKS] Found 0.
[TASKS] Skipping non-existent folder '<https://hudson.apache.org/hudson/job/Jackrabbit-trunk/ws/trunk/jackrabbit-standalone/src/test/resources'...>
[INFO] snapshot org.apache.jackrabbit:jackrabbit-core:2.3-SNAPSHOT: checking for updates from
apache.snapshots
[INFO] snapshot org.apache.jackrabbit:jackrabbit-jcr-server:2.3-SNAPSHOT: checking for updates
from apache.snapshots
[INFO] snapshot org.apache.jackrabbit:jackrabbit-jcr-servlet:2.3-SNAPSHOT: checking for updates
from apache.snapshots
[INFO] [remote-resources:process {execution: default}]
[TASKS] Skipping maven reporter: there is already a result available.
[INFO] [resources:resources {execution: default-resources}]
[INFO] Using 'UTF-8' encoding to copy filtered resources.
[INFO] Copying 9 resources
[INFO] Copying 3 resources
[TASKS] Skipping maven reporter: there is already a result available.
[INFO] [compiler:compile {execution: default-compile}]
[INFO] Compiling 94 source files to <https://hudson.apache.org/hudson/job/Jackrabbit-trunk/ws/trunk/jackrabbit-standalone/target/classes>
[TASKS] Skipping maven reporter: there is already a result available.
[INFO] [resources:testResources {execution: default-testResources}]
[INFO] Using 'UTF-8' encoding to copy filtered resources.
[INFO] skip non existing resourceDirectory <https://hudson.apache.org/hudson/job/Jackrabbit-trunk/ws/trunk/jackrabbit-standalone/src/test/resources>
[INFO] Copying 3 resources
[TASKS] Skipping maven reporter: there is already a result available.
[INFO] [compiler:testCompile {execution: default-testCompile}]
[INFO] No sources to compile
[TASKS] Skipping maven reporter: there is already a result available.
[INFO] [surefire:test {execution: default-test}]
[INFO] Surefire report directory: <https://hudson.apache.org/hudson/job/Jackrabbit-trunk/ws/trunk/jackrabbit-standalone/target/surefire-reports>

-------------------------------------------------------
 T E S T S
-------------------------------------------------------
There are no tests to run.

Results :

Tests run: 0, Failures: 0, Errors: 0, Skipped: 0

[TASKS] Skipping maven reporter: there is already a result available.
[HUDSON] Recording test results
[INFO] [bundle:bundle {execution: default-bundle}]
Index 560:SourceFile
[TASKS] Skipping maven reporter: there is already a result available.
[INFO] [apache-rat:check {execution: default}]
[INFO] Exclude: release.properties
[TASKS] Skipping maven reporter: there is already a result available.
[INFO] [install:install {execution: default-install}]
[INFO] Installing <https://hudson.apache.org/hudson/job/Jackrabbit-trunk/ws/trunk/jackrabbit-standalone/target/jackrabbit-standalone-2.3-SNAPSHOT.jar>
to /export/home/hudson/.m2/repository/org/apache/jackrabbit/jackrabbit-standalone/2.3-SNAPSHOT/jackrabbit-standalone-2.3-SNAPSHOT.jar
[TASKS] Skipping maven reporter: there is already a result available.
[INFO] [bundle:install {execution: default-install}]
[INFO] Parsing file:/export/home/hudson/.m2/repository/repository.xml
[Fatal Error] :-1:-1: Premature end of file.
org.xml.sax.SAXParseException: Premature end of file.
	at com.sun.org.apache.xerces.internal.parsers.DOMParser.parse(DOMParser.java:264)
	at com.sun.org.apache.xerces.internal.jaxp.DocumentBuilderImpl.parse(DocumentBuilderImpl.java:292)
	at javax.xml.parsers.DocumentBuilder.parse(DocumentBuilder.java:172)
	at org.apache.felix.obrplugin.ObrUpdate.parseFile(ObrUpdate.java:347)
	at org.apache.felix.obrplugin.ObrUpdate.parseRepositoryXml(ObrUpdate.java:324)
	at org.apache.felix.obrplugin.ObrInstall.execute(ObrInstall.java:140)
	at org.apache.maven.plugin.DefaultPluginManager.executeMojo(DefaultPluginManager.java:490)
	at hudson.maven.agent.PluginManagerInterceptor.executeMojo(PluginManagerInterceptor.java:182)
	at org.apache.maven.lifecycle.DefaultLifecycleExecutor.executeGoals(DefaultLifecycleExecutor.java:694)
	at org.apache.maven.lifecycle.DefaultLifecycleExecutor.executeGoalWithLifecycle(DefaultLifecycleExecutor.java:556)
	at org.apache.maven.lifecycle.DefaultLifecycleExecutor.executeGoal(DefaultLifecycleExecutor.java:535)
	at org.apache.maven.lifecycle.DefaultLifecycleExecutor.executeGoalAndHandleFailures(DefaultLifecycleExecutor.java:387)
	at org.apache.maven.lifecycle.DefaultLifecycleExecutor.executeTaskSegments(DefaultLifecycleExecutor.java:348)
	at org.apache.maven.lifecycle.DefaultLifecycleExecutor.execute(DefaultLifecycleExecutor.java:180)
	at org.apache.maven.lifecycle.LifecycleExecutorInterceptor.execute(LifecycleExecutorInterceptor.java:65)
	at org.apache.maven.DefaultMaven.doExecute(DefaultMaven.java:328)
	at org.apache.maven.DefaultMaven.execute(DefaultMaven.java:138)
	at org.apache.maven.cli.MavenCli.main(MavenCli.java:362)
	at sun.reflect.NativeMethodAccessorImpl.invoke0(Native Method)
	at sun.reflect.NativeMethodAccessorImpl.invoke(NativeMethodAccessorImpl.java:39)
	at sun.reflect.DelegatingMethodAccessorImpl.invoke(DelegatingMethodAccessorImpl.java:25)
	at java.lang.reflect.Method.invoke(Method.java:592)
	at org.codehaus.classworlds.Launcher.launchEnhanced(Launcher.java:315)
	at org.codehaus.classworlds.Launcher.launch(Launcher.java:255)
	at hudson.maven.agent.Main.launch(Main.java:165)
	at hudson.maven.MavenBuilder.call(MavenBuilder.java:165)
	at hudson.maven.MavenModuleSetBuild$Builder.call(MavenModuleSetBuild.java:750)
	at hudson.maven.MavenModuleSetBuild$Builder.call(MavenModuleSetBuild.java:694)
	at hudson.remoting.UserRequest.perform(UserRequest.java:114)
	at hudson.remoting.UserRequest.perform(UserRequest.java:48)
	at hudson.remoting.Request$2.run(Request.java:270)
	at java.util.concurrent.Executors$RunnableAdapter.call(Executors.java:417)
	at java.util.concurrent.FutureTask$Sync.innerRun(FutureTask.java:269)
	at java.util.concurrent.FutureTask.run(FutureTask.java:123)
	at java.util.concurrent.ThreadPoolExecutor$Worker.runTask(ThreadPoolExecutor.java:651)
	at java.util.concurrent.ThreadPoolExecutor$Worker.run(ThreadPoolExecutor.java:676)
	at java.lang.Thread.run(Thread.java:595)
[INFO] Writing OBR metadata
[TASKS] Skipping maven reporter: there is already a result available.
[INFO] [deploy:deploy {execution: default-deploy}]
[INFO]  skipping artifact deployement 
[TASKS] Skipping maven reporter: there is already a result available.
[INFO] [bundle:deploy {execution: default-deploy}]
[INFO] Remote OBR update disabled (enable with -DremoteOBR)
[TASKS] Skipping maven reporter: there is already a result available.
[HUDSON] Archiving disabled - not archiving <https://hudson.apache.org/hudson/job/Jackrabbit-trunk/ws/trunk/jackrabbit-standalone/pom.xml>
[HUDSON] Archiving disabled - not archiving <https://hudson.apache.org/hudson/job/Jackrabbit-trunk/ws/trunk/jackrabbit-standalone/target/jackrabbit-standalone-2.3-SNAPSHOT.jar>
[INFO] ------------------------------------------------------------------------
[INFO] Building Apache Jackrabbit
[INFO]    task-segment: [clean, deploy]
[INFO] ------------------------------------------------------------------------
[INFO] [clean:clean {execution: default-clean}]
[INFO] Deleting file set: <https://hudson.apache.org/hudson/job/Jackrabbit-trunk/ws/trunk/target>
(included: [**], excluded: [])
[TASKS] Skipping non-existent folder '<https://hudson.apache.org/hudson/job/Jackrabbit-trunk/ws/trunk/src/main/java'...>
[TASKS] Skipping non-existent folder '<https://hudson.apache.org/hudson/job/Jackrabbit-trunk/ws/trunk/src/test/java'...>
[TASKS] Skipping non-existent folder '<https://hudson.apache.org/hudson/job/Jackrabbit-trunk/ws/trunk/src/main/resources'...>
[TASKS] Skipping non-existent folder '<https://hudson.apache.org/hudson/job/Jackrabbit-trunk/ws/trunk/src/test/resources'...>
[INFO] [remote-resources:process {execution: default}]
[TASKS] Skipping maven reporter: there is already a result available.
[INFO] [site:attach-descriptor {execution: default-attach-descriptor}]
[TASKS] Skipping maven reporter: there is already a result available.
[INFO] [apache-rat:check {execution: default}]
[INFO] Exclude: release.properties
[INFO] Exclude: test/**/target/**
[INFO] Exclude: test/**/.*/**
[INFO] Exclude: test/**/*.log
[INFO] Exclude: .git/**
[TASKS] Skipping maven reporter: there is already a result available.
[HUDSON] Archiving disabled - not archiving <https://hudson.apache.org/hudson/job/Jackrabbit-trunk/ws/trunk/pom.xml>
[INFO] ------------------------------------------------------------------------
[ERROR] BUILD FAILURE
[INFO] ------------------------------------------------------------------------
[INFO] Too many unapproved licenses: 2
[INFO] ------------------------------------------------------------------------
[INFO] For more information, run Maven with the -e switch
[INFO] ------------------------------------------------------------------------
[INFO] Total time: 64 minutes 43 seconds
[INFO] Finished at: Fri Dec 10 14:25:42 EST 2010
[INFO] Final Memory: 83M/408M
[INFO] ------------------------------------------------------------------------
Sending e-mails to: dev@jackrabbit.apache.org
Sending e-mails to: dev@jackrabbit.apache.org
channel stopped
[locks-and-latches] Releasing all the locks
[locks-and-latches] All the locks released


Mime
View raw message