jackrabbit-dev mailing list archives

Site index · List index
Message view « Date » · « Thread »
Top « Date » · « Thread »
From Apache Hudson Server <hud...@hudson.apache.org>
Subject Build failed in Hudson: Jackrabbit-trunk #1381
Date Thu, 02 Dec 2010 17:26:19 GMT
See <https://hudson.apache.org/hudson/job/Jackrabbit-trunk/1381/changes>

Changes:

[mduerig] Fixed error in comment

------------------------------------------
[...truncated 1702 lines...]
	at java.util.concurrent.ThreadPoolExecutor$Worker.run(ThreadPoolExecutor.java:676)
	at java.lang.Thread.run(Thread.java:595)
[INFO] Writing OBR metadata
[TASKS] Skipping maven reporter: there is already a result available.
[INFO] [deploy:deploy {execution: default-deploy}]
[INFO] Retrieving previous build number from apache.snapshots.https
Uploading: https://repository.apache.org/content/repositories/snapshots/org/apache/jackrabbit/jackrabbit-jcr2spi/2.3-SNAPSHOT/jackrabbit-jcr2spi-2.3-20101202.170636-16.jar
388K uploaded  (jackrabbit-jcr2spi-2.3-20101202.170636-16.jar)
[INFO] Uploading project information for jackrabbit-jcr2spi 2.3-20101202.170636-16
[INFO] Retrieving previous metadata from apache.snapshots.https
[INFO] Uploading repository metadata for: 'artifact org.apache.jackrabbit:jackrabbit-jcr2spi'
[INFO] Retrieving previous metadata from apache.snapshots.https
[INFO] Uploading repository metadata for: 'snapshot org.apache.jackrabbit:jackrabbit-jcr2spi:2.3-SNAPSHOT'
[INFO] Retrieving previous build number from apache.snapshots.https
Uploading: https://repository.apache.org/content/repositories/snapshots/org/apache/jackrabbit/jackrabbit-jcr2spi/2.3-SNAPSHOT/jackrabbit-jcr2spi-2.3-20101202.170636-16-tests.jar
160K uploaded  (jackrabbit-jcr2spi-2.3-20101202.170636-16-tests.jar)
[TASKS] Skipping maven reporter: there is already a result available.
[INFO] [bundle:deploy {execution: default-deploy}]
[INFO] Remote OBR update disabled (enable with -DremoteOBR)
[TASKS] Skipping maven reporter: there is already a result available.
[HUDSON] Archiving disabled - not archiving <https://hudson.apache.org/hudson/job/Jackrabbit-trunk/ws/trunk/jackrabbit-jcr2spi/pom.xml>
[HUDSON] Archiving disabled - not archiving <https://hudson.apache.org/hudson/job/Jackrabbit-trunk/ws/trunk/jackrabbit-jcr2spi/target/jackrabbit-jcr2spi-2.3-SNAPSHOT.jar>
[HUDSON] Archiving disabled - not archiving <https://hudson.apache.org/hudson/job/Jackrabbit-trunk/ws/trunk/jackrabbit-jcr2spi/target/jackrabbit-jcr2spi-2.3-SNAPSHOT-tests.jar>
[INFO] ------------------------------------------------------------------------
[INFO] Building Jackrabbit SPI to JCR
[INFO]    task-segment: [clean, deploy]
[INFO] ------------------------------------------------------------------------
[INFO] [clean:clean {execution: default-clean}]
[INFO] Deleting file set: <https://hudson.apache.org/hudson/job/Jackrabbit-trunk/ws/trunk/jackrabbit-spi2jcr/target>
(included: [**], excluded: [])
[TASKS] Scanning folder '<https://hudson.apache.org/hudson/job/Jackrabbit-trunk/ws/trunk/jackrabbit-spi2jcr/src/main/java'>
for tasks ... 
[TASKS] Found 4.
[TASKS] Scanning folder '<https://hudson.apache.org/hudson/job/Jackrabbit-trunk/ws/trunk/jackrabbit-spi2jcr/src/test/java'>
for tasks ... 
[TASKS] Found 1.
[TASKS] Skipping non-existent folder '<https://hudson.apache.org/hudson/job/Jackrabbit-trunk/ws/trunk/jackrabbit-spi2jcr/src/main/resources'...>
[TASKS] Scanning folder '<https://hudson.apache.org/hudson/job/Jackrabbit-trunk/ws/trunk/jackrabbit-spi2jcr/src/test/resources'>
for tasks ... 
[TASKS] Found 0.
[INFO] snapshot org.apache.jackrabbit:jackrabbit-jcr2spi:2.3-SNAPSHOT: checking for updates
from apache.snapshots
[INFO] [remote-resources:process {execution: default}]
[TASKS] Skipping maven reporter: there is already a result available.
[INFO] [resources:resources {execution: default-resources}]
[INFO] Using 'UTF-8' encoding to copy filtered resources.
[INFO] skip non existing resourceDirectory <https://hudson.apache.org/hudson/job/Jackrabbit-trunk/ws/trunk/jackrabbit-spi2jcr/src/main/resources>
[INFO] Copying 3 resources
[TASKS] Skipping maven reporter: there is already a result available.
[INFO] [compiler:compile {execution: default-compile}]
[INFO] Compiling 13 source files to <https://hudson.apache.org/hudson/job/Jackrabbit-trunk/ws/trunk/jackrabbit-spi2jcr/target/classes>
[TASKS] Skipping maven reporter: there is already a result available.
[INFO] [resources:testResources {execution: default-testResources}]
[INFO] Using 'UTF-8' encoding to copy filtered resources.
[INFO] Copying 4 resources
[INFO] Copying 3 resources
[TASKS] Skipping maven reporter: there is already a result available.
[INFO] [compiler:testCompile {execution: default-testCompile}]
[INFO] Compiling 6 source files to <https://hudson.apache.org/hudson/job/Jackrabbit-trunk/ws/trunk/jackrabbit-spi2jcr/target/test-classes>
[TASKS] Skipping maven reporter: there is already a result available.
[INFO] [surefire:test {execution: default-test}]
[INFO] Surefire report directory: <https://hudson.apache.org/hudson/job/Jackrabbit-trunk/ws/trunk/jackrabbit-spi2jcr/target/surefire-reports>

-------------------------------------------------------
 T E S T S
-------------------------------------------------------
Running org.apache.jackrabbit.spi2jcr.spi.TestAll
Tests run: 92, Failures: 0, Errors: 0, Skipped: 0, Time elapsed: 21.001 sec
Running org.apache.jackrabbit.test.TestAll
Tests run: 1897, Failures: 0, Errors: 28, Skipped: 0, Time elapsed: 122.267 sec <<<
FAILURE!
Running org.apache.jackrabbit.spi2jcr.jcr2spi.TestAll
Tests run: 409, Failures: 0, Errors: 1, Skipped: 0, Time elapsed: 10.405 sec <<<
FAILURE!

Results :

Tests in error: 
  testExportSysView_stream_session_skipBinary_recurse(org.apache.jackrabbit.test.api.ExportSysViewTest)
  testExportSysView_stream_session_skipBinary_noRecurse(org.apache.jackrabbit.test.api.ExportSysViewTest)
  testExportSysView_stream_session_saveBinary_noRecurse(org.apache.jackrabbit.test.api.ExportSysViewTest)
  testExportSysView_stream_session_saveBinary_recurse(org.apache.jackrabbit.test.api.ExportSysViewTest)
  testExportSysView_handler_session_skipBinary_recurse(org.apache.jackrabbit.test.api.SerializationTest)
  testExportSysView_handler_session_saveBinary_recurse(org.apache.jackrabbit.test.api.SerializationTest)
  testExportSysView_stream_session_skipBinary_recurse(org.apache.jackrabbit.test.api.SerializationTest)
  testExportSysView_stream_session_saveBinary_recurse(org.apache.jackrabbit.test.api.SerializationTest)
  testSessionImportXml(org.apache.jackrabbit.test.api.SerializationTest)
  testVersioningExceptionFileParentWorkspaceContentHandler(org.apache.jackrabbit.test.api.SerializationTest)
  testVersioningExceptionFileParentSessionContentHandler(org.apache.jackrabbit.test.api.SerializationTest)
  testVersioningExceptionFileParentWorkspace(org.apache.jackrabbit.test.api.SerializationTest)
  testVersioningExceptionFileParentSession(org.apache.jackrabbit.test.api.SerializationTest)
  testVersioningExceptionFileChildWorkspaceContentHandler(org.apache.jackrabbit.test.api.SerializationTest)
  testVersioningExceptionFileChildSessionContentHandler(org.apache.jackrabbit.test.api.SerializationTest)
  testVersioningExceptionFileChildWorkspace(org.apache.jackrabbit.test.api.SerializationTest)
  testVersioningExceptionFileChildSession(org.apache.jackrabbit.test.api.SerializationTest)
  testLockExceptionWorkspaceWithHandler(org.apache.jackrabbit.test.api.SerializationTest)
  testLockExceptionSessionWithHandler(org.apache.jackrabbit.test.api.SerializationTest)
  testLockExceptionWorkspace(org.apache.jackrabbit.test.api.SerializationTest)
  testLockExceptionSession(org.apache.jackrabbit.test.api.SerializationTest)
  testSessionImportXmlExceptions(org.apache.jackrabbit.test.api.SerializationTest)
  testWorkspaceImportXmlExceptions(org.apache.jackrabbit.test.api.SerializationTest)
  testSessionGetContentHandler(org.apache.jackrabbit.test.api.SerializationTest)
  testExportSysView_stream_workspace_skipBinary_recurse(org.apache.jackrabbit.test.api.SerializationTest)
  testExportSysView_stream_workspace_saveBinary_recurse(org.apache.jackrabbit.test.api.SerializationTest)
  testExportSysView_handler_workspace_skipBinary_recurse(org.apache.jackrabbit.test.api.SerializationTest)
  testExportSysView_handler_workspace_saveBinary_recurse(org.apache.jackrabbit.test.api.SerializationTest)
  testStreamBinary(org.apache.jackrabbit.jcr2spi.BinaryTest)

Tests run: 2398, Failures: 0, Errors: 29, Skipped: 0

[ERROR] There are test failures.

Please refer to <https://hudson.apache.org/hudson/job/Jackrabbit-trunk/ws/trunk/jackrabbit-spi2jcr/target/surefire-reports>
for the individual test results.
[TASKS] Skipping maven reporter: there is already a result available.
[HUDSON] Recording test results
[INFO] [jar:jar {execution: default-jar}]
[INFO] Building jar: <https://hudson.apache.org/hudson/job/Jackrabbit-trunk/ws/trunk/jackrabbit-spi2jcr/target/jackrabbit-spi2jcr-2.3-SNAPSHOT.jar>
[TASKS] Skipping maven reporter: there is already a result available.
[INFO] [apache-rat:check {execution: default}]
[INFO] Exclude: src/test/resources/jaas.config
[INFO] Exclude: src/test/resources/testdata.xml
[INFO] Exclude: *.log
[TASKS] Skipping maven reporter: there is already a result available.
[INFO] [install:install {execution: default-install}]
[INFO] Installing <https://hudson.apache.org/hudson/job/Jackrabbit-trunk/ws/trunk/jackrabbit-spi2jcr/target/jackrabbit-spi2jcr-2.3-SNAPSHOT.jar>
to /export/home/hudson/.m2/repository/org/apache/jackrabbit/jackrabbit-spi2jcr/2.3-SNAPSHOT/jackrabbit-spi2jcr-2.3-SNAPSHOT.jar
[TASKS] Skipping maven reporter: there is already a result available.
[INFO] [deploy:deploy {execution: default-deploy}]
[INFO] Retrieving previous build number from apache.snapshots.https
Uploading: https://repository.apache.org/content/repositories/snapshots/org/apache/jackrabbit/jackrabbit-spi2jcr/2.3-SNAPSHOT/jackrabbit-spi2jcr-2.3-20101202.170636-16.jar
91K uploaded  (jackrabbit-spi2jcr-2.3-20101202.170636-16.jar)
[INFO] Retrieving previous metadata from apache.snapshots.https
[INFO] Uploading repository metadata for: 'snapshot org.apache.jackrabbit:jackrabbit-spi2jcr:2.3-SNAPSHOT'
[INFO] Retrieving previous metadata from apache.snapshots.https
[INFO] Uploading repository metadata for: 'artifact org.apache.jackrabbit:jackrabbit-spi2jcr'
[INFO] Uploading project information for jackrabbit-spi2jcr 2.3-20101202.170636-16
[TASKS] Skipping maven reporter: there is already a result available.
[HUDSON] Archiving disabled - not archiving <https://hudson.apache.org/hudson/job/Jackrabbit-trunk/ws/trunk/jackrabbit-spi2jcr/pom.xml>
[HUDSON] Archiving disabled - not archiving <https://hudson.apache.org/hudson/job/Jackrabbit-trunk/ws/trunk/jackrabbit-spi2jcr/target/jackrabbit-spi2jcr-2.3-SNAPSHOT.jar>
[INFO] ------------------------------------------------------------------------
[INFO] Building Jackrabbit SPI to WebDAV
[INFO]    task-segment: [clean, deploy]
[INFO] ------------------------------------------------------------------------
[INFO] [clean:clean {execution: default-clean}]
[INFO] Deleting file set: <https://hudson.apache.org/hudson/job/Jackrabbit-trunk/ws/trunk/jackrabbit-spi2dav/target>
(included: [**], excluded: [])
[TASKS] Scanning folder '<https://hudson.apache.org/hudson/job/Jackrabbit-trunk/ws/trunk/jackrabbit-spi2dav/src/main/java'>
for tasks ... 
[TASKS] Found 50.
[TASKS] Scanning folder '<https://hudson.apache.org/hudson/job/Jackrabbit-trunk/ws/trunk/jackrabbit-spi2dav/src/test/java'>
for tasks ... 
[TASKS] Found 4.
[TASKS] Skipping non-existent folder '<https://hudson.apache.org/hudson/job/Jackrabbit-trunk/ws/trunk/jackrabbit-spi2dav/src/main/resources'...>
[TASKS] Scanning folder '<https://hudson.apache.org/hudson/job/Jackrabbit-trunk/ws/trunk/jackrabbit-spi2dav/src/test/resources'>
for tasks ... 
[TASKS] Found 0.
[INFO] [remote-resources:process {execution: default}]
[TASKS] Skipping maven reporter: there is already a result available.
[INFO] [resources:resources {execution: default-resources}]
[INFO] Using 'UTF-8' encoding to copy filtered resources.
[INFO] skip non existing resourceDirectory <https://hudson.apache.org/hudson/job/Jackrabbit-trunk/ws/trunk/jackrabbit-spi2dav/src/main/resources>
[INFO] Copying 3 resources
[TASKS] Skipping maven reporter: there is already a result available.
[INFO] [compiler:compile {execution: default-compile}]
[INFO] Compiling 34 source files to <https://hudson.apache.org/hudson/job/Jackrabbit-trunk/ws/trunk/jackrabbit-spi2dav/target/classes>
[TASKS] Skipping maven reporter: there is already a result available.
[INFO] [resources:testResources {execution: default-testResources}]
[INFO] Using 'UTF-8' encoding to copy filtered resources.
[INFO] Copying 4 resources
[INFO] Copying 3 resources
[TASKS] Skipping maven reporter: there is already a result available.
[INFO] [compiler:testCompile {execution: default-testCompile}]
[INFO] Compiling 14 source files to <https://hudson.apache.org/hudson/job/Jackrabbit-trunk/ws/trunk/jackrabbit-spi2dav/target/test-classes>
[TASKS] Skipping maven reporter: there is already a result available.
[INFO] [surefire:test {execution: default-test}]
[INFO] Tests are skipped.
[TASKS] Skipping maven reporter: there is already a result available.
[INFO] [jar:jar {execution: default-jar}]
[INFO] Building jar: <https://hudson.apache.org/hudson/job/Jackrabbit-trunk/ws/trunk/jackrabbit-spi2dav/target/jackrabbit-spi2dav-2.3-SNAPSHOT.jar>
[TASKS] Skipping maven reporter: there is already a result available.
[INFO] [assembly:single {execution: default}]
[INFO] Reading assembly descriptor: assembly.xml
[INFO] Building jar: <https://hudson.apache.org/hudson/job/Jackrabbit-trunk/ws/trunk/jackrabbit-spi2dav/target/jackrabbit-spi2dav-2.3-SNAPSHOT-tests.jar>
[TASKS] Skipping maven reporter: there is already a result available.
[INFO] [apache-rat:check {execution: default}]
[INFO] Exclude: release.properties
[TASKS] Skipping maven reporter: there is already a result available.
[INFO] [install:install {execution: default-install}]
[INFO] Installing <https://hudson.apache.org/hudson/job/Jackrabbit-trunk/ws/trunk/jackrabbit-spi2dav/target/jackrabbit-spi2dav-2.3-SNAPSHOT.jar>
to /export/home/hudson/.m2/repository/org/apache/jackrabbit/jackrabbit-spi2dav/2.3-SNAPSHOT/jackrabbit-spi2dav-2.3-SNAPSHOT.jar
[INFO] Installing <https://hudson.apache.org/hudson/job/Jackrabbit-trunk/ws/trunk/jackrabbit-spi2dav/target/jackrabbit-spi2dav-2.3-SNAPSHOT-tests.jar>
to /export/home/hudson/.m2/repository/org/apache/jackrabbit/jackrabbit-spi2dav/2.3-SNAPSHOT/jackrabbit-spi2dav-2.3-SNAPSHOT-tests.jar
[TASKS] Skipping maven reporter: there is already a result available.
[INFO] [deploy:deploy {execution: default-deploy}]
[INFO] Retrieving previous build number from apache.snapshots.https
Uploading: https://repository.apache.org/content/repositories/snapshots/org/apache/jackrabbit/jackrabbit-spi2dav/2.3-SNAPSHOT/jackrabbit-spi2dav-2.3-20101202.170636-16.jar
124K uploaded  (jackrabbit-spi2dav-2.3-20101202.170636-16.jar)
[INFO] Retrieving previous metadata from apache.snapshots.https
[INFO] Uploading repository metadata for: 'snapshot org.apache.jackrabbit:jackrabbit-spi2dav:2.3-SNAPSHOT'
[INFO] Uploading project information for jackrabbit-spi2dav 2.3-20101202.170636-16
[INFO] Retrieving previous metadata from apache.snapshots.https
[INFO] Uploading repository metadata for: 'artifact org.apache.jackrabbit:jackrabbit-spi2dav'
[INFO] Retrieving previous build number from apache.snapshots.https
Uploading: https://repository.apache.org/content/repositories/snapshots/org/apache/jackrabbit/jackrabbit-spi2dav/2.3-SNAPSHOT/jackrabbit-spi2dav-2.3-20101202.170636-16-tests.jar
125K uploaded  (jackrabbit-spi2dav-2.3-20101202.170636-16-tests.jar)
[TASKS] Skipping maven reporter: there is already a result available.
[HUDSON] Archiving disabled - not archiving <https://hudson.apache.org/hudson/job/Jackrabbit-trunk/ws/trunk/jackrabbit-spi2dav/pom.xml>
[HUDSON] Archiving disabled - not archiving <https://hudson.apache.org/hudson/job/Jackrabbit-trunk/ws/trunk/jackrabbit-spi2dav/target/jackrabbit-spi2dav-2.3-SNAPSHOT.jar>
[HUDSON] Archiving disabled - not archiving <https://hudson.apache.org/hudson/job/Jackrabbit-trunk/ws/trunk/jackrabbit-spi2dav/target/jackrabbit-spi2dav-2.3-SNAPSHOT-tests.jar>
[INFO] ------------------------------------------------------------------------
[INFO] Building Jackrabbit JCR to WebDAV
[INFO]    task-segment: [clean, deploy]
[INFO] ------------------------------------------------------------------------
[INFO] [clean:clean {execution: default-clean}]
[INFO] Deleting file set: <https://hudson.apache.org/hudson/job/Jackrabbit-trunk/ws/trunk/jackrabbit-jcr2dav/target>
(included: [**], excluded: [])
[TASKS] Scanning folder '<https://hudson.apache.org/hudson/job/Jackrabbit-trunk/ws/trunk/jackrabbit-jcr2dav/src/main/java'>
for tasks ... 
[TASKS] Found 2.
[TASKS] Scanning folder '<https://hudson.apache.org/hudson/job/Jackrabbit-trunk/ws/trunk/jackrabbit-jcr2dav/src/test/java'>
for tasks ... 
[TASKS] Found 0.
[TASKS] Scanning folder '<https://hudson.apache.org/hudson/job/Jackrabbit-trunk/ws/trunk/jackrabbit-jcr2dav/src/main/resources'>
for tasks ... 
[TASKS] Found 0.
[TASKS] Scanning folder '<https://hudson.apache.org/hudson/job/Jackrabbit-trunk/ws/trunk/jackrabbit-jcr2dav/src/test/resources'>
for tasks ... 
[TASKS] Found 0.
[INFO] [remote-resources:process {execution: default}]
[TASKS] Skipping maven reporter: there is already a result available.
[INFO] [resources:resources {execution: default-resources}]
[INFO] Using 'UTF-8' encoding to copy filtered resources.
[INFO] Copying 1 resource
[INFO] Copying 3 resources
[TASKS] Skipping maven reporter: there is already a result available.
[INFO] [compiler:compile {execution: default-compile}]
[INFO] Compiling 1 source file to <https://hudson.apache.org/hudson/job/Jackrabbit-trunk/ws/trunk/jackrabbit-jcr2dav/target/classes>
[TASKS] Skipping maven reporter: there is already a result available.
[INFO] [resources:testResources {execution: default-testResources}]
[INFO] Using 'UTF-8' encoding to copy filtered resources.
[INFO] Copying 2 resources
[INFO] Copying 3 resources
[TASKS] Skipping maven reporter: there is already a result available.
[INFO] [compiler:testCompile {execution: default-testCompile}]
[INFO] Compiling 2 source files to <https://hudson.apache.org/hudson/job/Jackrabbit-trunk/ws/trunk/jackrabbit-jcr2dav/target/test-classes>
[TASKS] Skipping maven reporter: there is already a result available.
[INFO] [surefire:test {execution: default-test}]
[INFO] Surefire report directory: <https://hudson.apache.org/hudson/job/Jackrabbit-trunk/ws/trunk/jackrabbit-jcr2dav/target/surefire-reports>
[TASKS] Skipping maven reporter: there is already a result available.
[HUDSON] Recording test results
[HUDSON] Archiving disabled - not archiving <https://hudson.apache.org/hudson/job/Jackrabbit-trunk/ws/trunk/jackrabbit-jcr2dav/pom.xml>
[INFO] ------------------------------------------------------------------------
[ERROR] BUILD ERROR
[INFO] ------------------------------------------------------------------------
[INFO] Error creating properties files for forking; nested exception is java.io.IOException:
No space left on device

[INFO] ------------------------------------------------------------------------
[INFO] For more information, run Maven with the -e switch
[INFO] ------------------------------------------------------------------------
[INFO] Total time: 19 minutes 54 seconds
[INFO] Finished at: Thu Dec 02 12:26:17 EST 2010
[INFO] Final Memory: 77M/336M
[INFO] ------------------------------------------------------------------------
Sending e-mails to: dev@jackrabbit.apache.org
Sending e-mails to: dev@jackrabbit.apache.org
channel stopped
[locks-and-latches] Releasing all the locks
[locks-and-latches] All the locks released


Mime
View raw message