jackrabbit-dev mailing list archives

Site index · List index
Message view « Date » · « Thread »
Top « Date » · « Thread »
From Apache Hudson Server <hud...@hudson.apache.org>
Subject Build failed in Hudson: Jackrabbit-trunk #1402
Date Thu, 16 Dec 2010 11:24:03 GMT
See <https://hudson.apache.org/hudson/job/Jackrabbit-trunk/1402/changes>

Changes:

[angela] minor improvement

[angela] javadoc

[angela] minor improvement

[angela] javadoc

[angela] minor improvement

[angela] JCR-2848 :  UserManagerImpl: typo in "compatibleJR16" config option constant

[angela] minor improvement

[angela] javadoc

[angela] type in log output

[angela] javadoc

[angela] javadoc

[angela] JCR-2848 :  UserManagerImpl: typo in "compatibleJR16" config option constant

[angela] javadoc

[angela] javadoc

[angela] javadoc

[angela] javadoc

[angela] javadoc

[angela] javadoc

------------------------------------------
[...truncated 5349 lines...]
	at java.util.concurrent.Executors$RunnableAdapter.call(Executors.java:417)
	at java.util.concurrent.FutureTask$Sync.innerRun(FutureTask.java:269)
	at java.util.concurrent.FutureTask.run(FutureTask.java:123)
	at java.util.concurrent.ThreadPoolExecutor$Worker.runTask(ThreadPoolExecutor.java:651)
	at java.util.concurrent.ThreadPoolExecutor$Worker.run(ThreadPoolExecutor.java:676)
	at java.lang.Thread.run(Thread.java:595)
[INFO] Writing OBR metadata

[TASKS] Skipping maven reporter: there is already a result available.[INFO] [deploy:deploy
{execution: default-deploy}]
[INFO] Retrieving previous build number from apache.snapshots.https

Uploading: https://repository.apache.org/content/repositories/snapshots/org/apache/jackrabbit/jackrabbit-jcr-rmi/2.3-SNAPSHOT/jackrabbit-jcr-rmi-2.3-20101216.110908-36.jar
400K uploaded  (jackrabbit-jcr-rmi-2.3-20101216.110908-36.jar)
[INFO] Retrieving previous metadata from apache.snapshots.https
[INFO] Uploading repository metadata for: 'artifact org.apache.jackrabbit:jackrabbit-jcr-rmi'
[INFO] Retrieving previous metadata from apache.snapshots.https
[INFO] Uploading repository metadata for: 'snapshot org.apache.jackrabbit:jackrabbit-jcr-rmi:2.3-SNAPSHOT'
[INFO] Uploading project information for jackrabbit-jcr-rmi 2.3-20101216.110908-36
[TASKS] Skipping maven reporter: there is already a result available.[INFO] [bundle:deploy
{execution: default-deploy}]
[INFO] Remote OBR update disabled (enable with -DremoteOBR)

[TASKS] Skipping maven reporter: there is already a result available.
[HUDSON] Archiving disabled - not archiving <https://hudson.apache.org/hudson/job/Jackrabbit-trunk/ws/trunk/jackrabbit-jcr-rmi/pom.xml>
[HUDSON] Archiving disabled - not archiving <https://hudson.apache.org/hudson/job/Jackrabbit-trunk/ws/trunk/jackrabbit-jcr-rmi/target/jackrabbit-jcr-rmi-2.3-SNAPSHOT.jar>
[INFO] ------------------------------------------------------------------------
[INFO] Building Jackrabbit JCR Servlets
[INFO]    task-segment: [clean, deploy]
[INFO] ------------------------------------------------------------------------
[INFO] [clean:clean {execution: default-clean}]
[TASKS] Scanning folder '<https://hudson.apache.org/hudson/job/Jackrabbit-trunk/ws/trunk/jackrabbit-jcr-servlet/src/main/java'>
for tasks ... 
[TASKS] Found 2.
[TASKS] Skipping non-existent folder '<https://hudson.apache.org/hudson/job/Jackrabbit-trunk/ws/trunk/jackrabbit-jcr-servlet/src/test/java'...>
[TASKS] Skipping non-existent folder '<https://hudson.apache.org/hudson/job/Jackrabbit-trunk/ws/trunk/jackrabbit-jcr-servlet/src/main/resources'...>
[TASKS] Skipping non-existent folder '<https://hudson.apache.org/hudson/job/Jackrabbit-trunk/ws/trunk/jackrabbit-jcr-servlet/src/test/resources'...>
[INFO] snapshot org.apache.jackrabbit:jackrabbit-jcr-rmi:2.3-SNAPSHOT: checking for updates
from apache.snapshots
[INFO] [remote-resources:process {execution: default}]
[TASKS] Skipping maven reporter: there is already a result available.
[INFO] [resources:resources {execution: default-resources}]
[INFO] Using 'UTF-8' encoding to copy filtered resources.
[INFO] skip non existing resourceDirectory <https://hudson.apache.org/hudson/job/Jackrabbit-trunk/ws/trunk/jackrabbit-jcr-servlet/src/main/resources>
[INFO] Copying 3 resources
[TASKS] Skipping maven reporter: there is already a result available.[INFO] [compiler:compile
{execution: default-compile}]
[INFO] Compiling 20 source files to <https://hudson.apache.org/hudson/job/Jackrabbit-trunk/ws/trunk/jackrabbit-jcr-servlet/target/classes>

[TASKS] Skipping maven reporter: there is already a result available.[INFO] [resources:testResources
{execution: default-testResources}]
[INFO] Using 'UTF-8' encoding to copy filtered resources.
[INFO] skip non existing resourceDirectory <https://hudson.apache.org/hudson/job/Jackrabbit-trunk/ws/trunk/jackrabbit-jcr-servlet/src/test/resources>
[INFO] Copying 3 resources

[TASKS] Skipping maven reporter: there is already a result available.[INFO] [compiler:testCompile
{execution: default-testCompile}]
[INFO] No sources to compile

[TASKS] Skipping maven reporter: there is already a result available.
[INFO] [surefire:test {execution: default-test}]
[INFO] Surefire report directory: <https://hudson.apache.org/hudson/job/Jackrabbit-trunk/ws/trunk/jackrabbit-jcr-servlet/target/surefire-reports>

-------------------------------------------------------
 T E S T S
-------------------------------------------------------
There are no tests to run.

Results :

Tests run: 0, Failures: 0, Errors: 0, Skipped: 0

[TASKS] Skipping maven reporter: there is already a result available.
[HUDSON] Recording test results
[INFO] [jar:jar {execution: default-jar}]
[INFO] Building jar: <https://hudson.apache.org/hudson/job/Jackrabbit-trunk/ws/trunk/jackrabbit-jcr-servlet/target/jackrabbit-jcr-servlet-2.3-SNAPSHOT.jar>
[TASKS] Skipping maven reporter: there is already a result available.[INFO] [apache-rat:check
{execution: default}]
[INFO] Exclude: release.properties

[TASKS] Skipping maven reporter: there is already a result available.[INFO] [install:install
{execution: default-install}]
[INFO] Installing <https://hudson.apache.org/hudson/job/Jackrabbit-trunk/ws/trunk/jackrabbit-jcr-servlet/target/jackrabbit-jcr-servlet-2.3-SNAPSHOT.jar>
to /home/hudson/.m2/repository/org/apache/jackrabbit/jackrabbit-jcr-servlet/2.3-SNAPSHOT/jackrabbit-jcr-servlet-2.3-SNAPSHOT.jar

[TASKS] Skipping maven reporter: there is already a result available.[INFO] [deploy:deploy
{execution: default-deploy}]
[INFO] Retrieving previous build number from apache.snapshots.https

Uploading: https://repository.apache.org/content/repositories/snapshots/org/apache/jackrabbit/jackrabbit-jcr-servlet/2.3-SNAPSHOT/jackrabbit-jcr-servlet-2.3-20101216.110908-36.jar
32K uploaded  (jackrabbit-jcr-servlet-2.3-20101216.110908-36.jar)
[INFO] Retrieving previous metadata from apache.snapshots.https
[INFO] Uploading repository metadata for: 'snapshot org.apache.jackrabbit:jackrabbit-jcr-servlet:2.3-SNAPSHOT'
[INFO] Retrieving previous metadata from apache.snapshots.https
[INFO] Uploading repository metadata for: 'artifact org.apache.jackrabbit:jackrabbit-jcr-servlet'
[INFO] Uploading project information for jackrabbit-jcr-servlet 2.3-20101216.110908-36
[TASKS] Skipping maven reporter: there is already a result available.
[HUDSON] Archiving disabled - not archiving <https://hudson.apache.org/hudson/job/Jackrabbit-trunk/ws/trunk/jackrabbit-jcr-servlet/pom.xml>
[HUDSON] Archiving disabled - not archiving <https://hudson.apache.org/hudson/job/Jackrabbit-trunk/ws/trunk/jackrabbit-jcr-servlet/target/jackrabbit-jcr-servlet-2.3-SNAPSHOT.jar>
[INFO] ------------------------------------------------------------------------
[INFO] Building Jackrabbit Web Application
[INFO]    task-segment: [clean, deploy]
[INFO] ------------------------------------------------------------------------
Downloading: http://repo1.maven.org/maven2/org/apache/maven/plugins/maven-failsafe-plugin/2.6/maven-failsafe-plugin-2.6.pom

Downloading: http://repo1.maven.org/maven2/org/apache/maven/plugins/maven-failsafe-plugin/2.6/maven-failsafe-plugin-2.6.jar

[INFO] [clean:clean {execution: default-clean}]
[TASKS] Scanning folder '<https://hudson.apache.org/hudson/job/Jackrabbit-trunk/ws/trunk/jackrabbit-webapp/src/main/java'>
for tasks ... 
[TASKS] Found 2.
[TASKS] Scanning folder '<https://hudson.apache.org/hudson/job/Jackrabbit-trunk/ws/trunk/jackrabbit-webapp/src/test/java'>
for tasks ... 
[TASKS] Found 0.
[TASKS] Scanning folder '<https://hudson.apache.org/hudson/job/Jackrabbit-trunk/ws/trunk/jackrabbit-webapp/src/main/resources'>
for tasks ... 
[TASKS] Found 0.
[TASKS] Scanning folder '<https://hudson.apache.org/hudson/job/Jackrabbit-trunk/ws/trunk/jackrabbit-webapp/src/test/resources'>
for tasks ... 
[TASKS] Found 0.
Downloading: http://repo1.maven.org/maven2/org/apache/tomcat/servlet-api/6.0.29/servlet-api-6.0.29.pom

Downloading: http://repo1.maven.org/maven2/org/apache/tomcat/catalina/6.0.29/catalina-6.0.29.pom

Downloading: http://repo1.maven.org/maven2/org/apache/tomcat/juli/6.0.29/juli-6.0.29.pom

Downloading: http://repo1.maven.org/maven2/org/apache/tomcat/annotations-api/6.0.29/annotations-api-6.0.29.pom

Downloading: http://repo1.maven.org/maven2/org/apache/tomcat/coyote/6.0.29/coyote-6.0.29.pom

Downloading: http://repo1.maven.org/maven2/org/apache/tomcat/jasper/6.0.29/jasper-6.0.29.pom

Downloading: http://repo1.maven.org/maven2/org/apache/tomcat/jsp-api/6.0.29/jsp-api-6.0.29.pom

Downloading: http://repo1.maven.org/maven2/org/apache/tomcat/jasper-jdt/6.0.29/jasper-jdt-6.0.29.pom

Downloading: http://repo1.maven.org/maven2/org/slf4j/jul-to-slf4j/1.5.11/jul-to-slf4j-1.5.11.pom

Downloading: http://repo1.maven.org/maven2/org/apache/tomcat/servlet-api/6.0.29/servlet-api-6.0.29.jar
Downloading: http://repo1.maven.org/maven2/org/slf4j/jul-to-slf4j/1.5.11/jul-to-slf4j-1.5.11.jar


Downloading: http://repo1.maven.org/maven2/org/apache/tomcat/catalina/6.0.29/catalina-6.0.29.jar

Downloading: http://repo1.maven.org/maven2/org/apache/tomcat/juli/6.0.29/juli-6.0.29.jar

Downloading: http://repo1.maven.org/maven2/org/apache/tomcat/annotations-api/6.0.29/annotations-api-6.0.29.jar

Downloading: http://repo1.maven.org/maven2/org/apache/tomcat/coyote/6.0.29/coyote-6.0.29.jar

Downloading: http://repo1.maven.org/maven2/org/apache/tomcat/jasper/6.0.29/jasper-6.0.29.jar

Downloading: http://repo1.maven.org/maven2/org/apache/tomcat/jsp-api/6.0.29/jsp-api-6.0.29.jar

Downloading: http://repo1.maven.org/maven2/org/apache/tomcat/jasper-jdt/6.0.29/jasper-jdt-6.0.29.jar

[INFO] [remote-resources:process {execution: default}]
[TASKS] Skipping maven reporter: there is already a result available.
[INFO] [resources:resources {execution: default-resources}]
[INFO] Using 'UTF-8' encoding to copy filtered resources.
[INFO] Copying 1 resource
[INFO] Copying 3 resources
[TASKS] Skipping maven reporter: there is already a result available.
[INFO] [compiler:compile {execution: default-compile}]
[INFO] Compiling 12 source files to <https://hudson.apache.org/hudson/job/Jackrabbit-trunk/ws/trunk/jackrabbit-webapp/target/classes>
[TASKS] Skipping maven reporter: there is already a result available.[INFO] [resources:testResources
{execution: default-testResources}]
[INFO] Using 'UTF-8' encoding to copy filtered resources.
[INFO] Copying 2 resources
[INFO] Copying 3 resources

[TASKS] Skipping maven reporter: there is already a result available.[INFO] [compiler:testCompile
{execution: default-testCompile}]
[INFO] Compiling 1 source file to <https://hudson.apache.org/hudson/job/Jackrabbit-trunk/ws/trunk/jackrabbit-webapp/target/test-classes>

[TASKS] Skipping maven reporter: there is already a result available.
[INFO] [surefire:test {execution: default-test}]
[INFO] Surefire report directory: <https://hudson.apache.org/hudson/job/Jackrabbit-trunk/ws/trunk/jackrabbit-webapp/target/surefire-reports>

-------------------------------------------------------
 T E S T S
-------------------------------------------------------
There are no tests to run.

Results :

Tests run: 0, Failures: 0, Errors: 0, Skipped: 0

[TASKS] Skipping maven reporter: there is already a result available.
[HUDSON] Recording test results
[INFO] [war:war {execution: default-war}]
[INFO] Exploding webapp...
[INFO] Assembling webapp jackrabbit-webapp in <https://hudson.apache.org/hudson/job/Jackrabbit-trunk/ws/trunk/jackrabbit-webapp/target/jackrabbit-webapp-2.3-SNAPSHOT>
[INFO] Copy webapp webResources to <https://hudson.apache.org/hudson/job/Jackrabbit-trunk/ws/trunk/jackrabbit-webapp/target/jackrabbit-webapp-2.3-SNAPSHOT>
[INFO] Generating war <https://hudson.apache.org/hudson/job/Jackrabbit-trunk/ws/trunk/jackrabbit-webapp/target/jackrabbit-webapp-2.3-SNAPSHOT.war>
[INFO] Building war: <https://hudson.apache.org/hudson/job/Jackrabbit-trunk/ws/trunk/jackrabbit-webapp/target/jackrabbit-webapp-2.3-SNAPSHOT.war>
[TASKS] Skipping maven reporter: there is already a result available.
[INFO] [build-helper:attach-artifact {execution: attach-artifacts}]
[TASKS] Skipping maven reporter: there is already a result available.
[INFO] [antrun:run {execution: default}]
[INFO] Executing tasks
      [jar] Building jar: <https://hudson.apache.org/hudson/job/Jackrabbit-trunk/ws/trunk/jackrabbit-webapp/target/jackrabbit-webapp-2.3-SNAPSHOT.jar>
[INFO] Executed tasks
[TASKS] Skipping maven reporter: there is already a result available.
[INFO] [failsafe:integration-test {execution: default}]
[INFO] Failsafe report directory: <https://hudson.apache.org/hudson/job/Jackrabbit-trunk/ws/trunk/jackrabbit-webapp/target/failsafe-reports>

-------------------------------------------------------
 T E S T S
-------------------------------------------------------
Running org.apache.jackrabbit.j2ee.TomcatIT
Dec 16, 2010 11:23:35 AM org.apache.catalina.startup.Embedded start
INFO: Starting tomcat server
Dec 16, 2010 11:23:35 AM org.apache.catalina.core.StandardEngine start
INFO: Starting Servlet Engine: Apache Tomcat/6.0.29
Dec 16, 2010 11:23:36 AM org.apache.coyote.http11.Http11Protocol init
INFO: Initializing Coyote HTTP/1.1 on http-localhost%2F127.0.0.1-12856
Dec 16, 2010 11:23:37 AM org.apache.coyote.http11.Http11Protocol start
INFO: Starting Coyote HTTP/1.1 on http-localhost%2F127.0.0.1-12856
Dec 16, 2010 11:23:57 AM org.apache.coyote.http11.Http11Protocol destroy
INFO: Stopping Coyote HTTP/1.1 on http-localhost%2F127.0.0.1-12856
Dec 16, 2010 11:23:57 AM org.apache.catalina.loader.WebappClassLoader clearReferencesThreads
SEVERE: The web application [] appears to have started a thread named [Timer-1] but has failed
to stop it. This is very likely to create a memory leak.
Dec 16, 2010 11:23:57 AM org.apache.catalina.loader.WebappClassLoader clearReferencesThreads
SEVERE: The web application [] appears to have started a thread named [DynamicPooledExecutor]
but has failed to stop it. This is very likely to create a memory leak.
Dec 16, 2010 11:23:57 AM org.apache.catalina.loader.WebappClassLoader clearReferencesThreads
SEVERE: The web application [] appears to have started a thread named [Timer-2] but has failed
to stop it. This is very likely to create a memory leak.
Tests run: 1, Failures: 1, Errors: 0, Skipped: 0, Time elapsed: 22.685 sec <<< FAILURE!

Results :

Failed tests: 
  testTomcat(org.apache.jackrabbit.j2ee.TomcatIT)

Tests run: 1, Failures: 1, Errors: 0, Skipped: 0

[WARNING] File encoding has not been set, using platform encoding UTF-8, i.e. build is platform
dependent!
[TASKS] Skipping maven reporter: there is already a result available.
[HUDSON] Recording test results
[INFO] [apache-rat:check {execution: default}]
[INFO] Exclude: src/main/webapp/WEB-INF/log4j.dtd
[TASKS] Skipping maven reporter: there is already a result available.[INFO] [failsafe:verify
{execution: default}]
[INFO] Failsafe report directory: <https://hudson.apache.org/hudson/job/Jackrabbit-trunk/ws/trunk/jackrabbit-webapp/target/failsafe-reports>
[WARNING] File encoding has not been set, using platform encoding UTF-8, i.e. build is platform
dependent!

[TASKS] Skipping maven reporter: there is already a result available.
[HUDSON] Archiving disabled - not archiving <https://hudson.apache.org/hudson/job/Jackrabbit-trunk/ws/trunk/jackrabbit-webapp/pom.xml>
[HUDSON] Archiving disabled - not archiving <https://hudson.apache.org/hudson/job/Jackrabbit-trunk/ws/trunk/jackrabbit-webapp/target/jackrabbit-webapp-2.3-SNAPSHOT.war>
[HUDSON] Archiving disabled - not archiving <https://hudson.apache.org/hudson/job/Jackrabbit-trunk/ws/trunk/jackrabbit-webapp/target/jackrabbit-webapp-2.3-SNAPSHOT.jar>
[INFO] ------------------------------------------------------------------------
[ERROR] BUILD FAILURE
[INFO] ------------------------------------------------------------------------
[INFO] There are test failures.

Please refer to <https://hudson.apache.org/hudson/job/Jackrabbit-trunk/ws/trunk/jackrabbit-webapp/target/failsafe-reports>
for the individual test results.
[INFO] ------------------------------------------------------------------------
[INFO] For more information, run Maven with the -e switch
[INFO] ------------------------------------------------------------------------
[INFO] Total time: 15 minutes 9 seconds
[INFO] Finished at: Thu Dec 16 11:24:01 UTC 2010
[INFO] Final Memory: 86M/297M
[INFO] ------------------------------------------------------------------------
Sending e-mails to: dev@jackrabbit.apache.org
channel stopped
[locks-and-latches] Releasing all the locks
[locks-and-latches] All the locks released


Mime
View raw message