jackrabbit-dev mailing list archives

Site index · List index
Message view « Date » · « Thread »
Top « Date » · « Thread »
From Apache Hudson Server <hud...@hudson.apache.org>
Subject Build failed in Hudson: Jackrabbit-trunk #1363
Date Tue, 23 Nov 2010 22:22:40 GMT
See <https://hudson.apache.org/hudson/job/Jackrabbit-trunk/1363/>

------------------------------------------
[...truncated 200 lines...]
Tests run: 2, Failures: 0, Errors: 0, Skipped: 0, Time elapsed: 0.098 sec
Running org.apache.jackrabbit.commons.iterator.FilteredRangeIteratorTest
Tests run: 3, Failures: 0, Errors: 0, Skipped: 0, Time elapsed: 0.005 sec
Running org.apache.jackrabbit.util.TextTest
Tests run: 6, Failures: 0, Errors: 0, Skipped: 0, Time elapsed: 0.006 sec
Running org.apache.jackrabbit.commons.json.JsonParserTest
Tests run: 20, Failures: 0, Errors: 0, Skipped: 0, Time elapsed: 0.014 sec
Running org.apache.jackrabbit.value.BinaryValueTest
Tests run: 1, Failures: 0, Errors: 0, Skipped: 0, Time elapsed: 0.011 sec
Running org.apache.jackrabbit.commons.xml.XmlnsContentHandlerTest
Tests run: 1, Failures: 0, Errors: 0, Skipped: 0, Time elapsed: 0.086 sec

Results :

Tests run: 86, Failures: 0, Errors: 0, Skipped: 0

[TASKS] Skipping maven reporter: there is already a result available.
[HUDSON] Recording test results
[INFO] [bundle:bundle {execution: default-bundle}]
[INFO] [apache-rat:check {execution: default}]
[INFO] Exclude: release.properties
[TASKS] Skipping maven reporter: there is already a result available.
[TASKS] Skipping maven reporter: there is already a result available.[INFO] [install:install
{execution: default-install}]
[INFO] Installing <https://hudson.apache.org/hudson/job/Jackrabbit-trunk/ws/trunk/jackrabbit-jcr-commons/target/jackrabbit-jcr-commons-2.2-SNAPSHOT.jar>
to /export/home/hudson/.m2/repository/org/apache/jackrabbit/jackrabbit-jcr-commons/2.2-SNAPSHOT/jackrabbit-jcr-commons-2.2-SNAPSHOT.jar

[TASKS] Skipping maven reporter: there is already a result available.[INFO] [bundle:install
{execution: default-install}]
[INFO] Parsing file:/export/home/hudson/.m2/repository/repository.xml

[INFO] Installing org/apache/jackrabbit/jackrabbit-jcr-commons/2.2-SNAPSHOT/jackrabbit-jcr-commons-2.2-SNAPSHOT.jar
[INFO] Writing OBR metadata
[INFO] [deploy:deploy {execution: default-deploy}]
[INFO] Retrieving previous build number from apache.snapshots.https
[TASKS] Skipping maven reporter: there is already a result available.
Uploading: https://repository.apache.org/content/repositories/snapshots/org/apache/jackrabbit/jackrabbit-jcr-commons/2.2-SNAPSHOT/jackrabbit-jcr-commons-2.2-20101123.152214-205.jar
279K uploaded  (jackrabbit-jcr-commons-2.2-20101123.152214-205.jar)
[INFO] Uploading project information for jackrabbit-jcr-commons 2.2-20101123.152214-205
[INFO] Retrieving previous metadata from apache.snapshots.https
[INFO] Uploading repository metadata for: 'artifact org.apache.jackrabbit:jackrabbit-jcr-commons'
[INFO] Retrieving previous metadata from apache.snapshots.https
[INFO] Uploading repository metadata for: 'snapshot org.apache.jackrabbit:jackrabbit-jcr-commons:2.2-SNAPSHOT'
[INFO] [bundle:deploy {execution: default-deploy}]
[INFO] Remote OBR update disabled (enable with -DremoteOBR)
[TASKS] Skipping maven reporter: there is already a result available.
[TASKS] Skipping maven reporter: there is already a result available.
[HUDSON] Archiving <https://hudson.apache.org/hudson/job/Jackrabbit-trunk/ws/trunk/jackrabbit-jcr-commons/pom.xml>
to /home/hudson/hudson/jobs/Jackrabbit-trunk/modules/org.apache.jackrabbit$jackrabbit-jcr-commons/builds/2010-11-23_15-16-30/archive/org.apache.jackrabbit/jackrabbit-jcr-commons/2.2-SNAPSHOT/pom.xml
[HUDSON] Archiving <https://hudson.apache.org/hudson/job/Jackrabbit-trunk/ws/trunk/jackrabbit-jcr-commons/target/jackrabbit-jcr-commons-2.2-SNAPSHOT.jar>
to /home/hudson/hudson/jobs/Jackrabbit-trunk/modules/org.apache.jackrabbit$jackrabbit-jcr-commons/builds/2010-11-23_15-16-30/archive/org.apache.jackrabbit/jackrabbit-jcr-commons/2.2-20101123.152214-205/jackrabbit-jcr-commons-2.2-SNAPSHOT.jar
[INFO] ------------------------------------------------------------------------
[INFO] Building Jackrabbit JCR Tests
[INFO]    task-segment: [clean, deploy]
[INFO] ------------------------------------------------------------------------
[INFO] [clean:clean {execution: default-clean}]
[INFO] Deleting file set: <https://hudson.apache.org/hudson/job/Jackrabbit-trunk/ws/trunk/jackrabbit-jcr-tests/target>
(included: [**], excluded: [])
[TASKS] Scanning folder '<https://hudson.apache.org/hudson/job/Jackrabbit-trunk/ws/trunk/jackrabbit-jcr-tests/src/main/java'>
for tasks ... 
[TASKS] Found 38.
[TASKS] Skipping non-existent folder '<https://hudson.apache.org/hudson/job/Jackrabbit-trunk/ws/trunk/jackrabbit-jcr-tests/src/test/java'...>
[TASKS] Scanning folder '<https://hudson.apache.org/hudson/job/Jackrabbit-trunk/ws/trunk/jackrabbit-jcr-tests/src/main/resources'>
for tasks ... 
[TASKS] Found 0.
[TASKS] Skipping non-existent folder '<https://hudson.apache.org/hudson/job/Jackrabbit-trunk/ws/trunk/jackrabbit-jcr-tests/src/test/resources'...>
[INFO] [remote-resources:process {execution: default}]
[TASKS] Skipping maven reporter: there is already a result available.[INFO] [resources:resources
{execution: default-resources}]
[INFO] Using 'UTF-8' encoding to copy filtered resources.
[INFO] Copying 31 resources

[INFO] Copying 3 resources
[INFO] [compiler:compile {execution: default-compile}]
[TASKS] Skipping maven reporter: there is already a result available.[INFO] Compiling 312
source files to <https://hudson.apache.org/hudson/job/Jackrabbit-trunk/ws/trunk/jackrabbit-jcr-tests/target/classes>

[INFO] [resources:testResources {execution: default-testResources}]
[INFO] Using 'UTF-8' encoding to copy filtered resources.
[INFO] skip non existing resourceDirectory <https://hudson.apache.org/hudson/job/Jackrabbit-trunk/ws/trunk/jackrabbit-jcr-tests/src/test/resources>
[INFO] Copying 3 resources
[TASKS] Skipping maven reporter: there is already a result available.
[INFO] [compiler:testCompile {execution: default-testCompile}]
[TASKS] Skipping maven reporter: there is already a result available.[INFO] No sources to
compile

[TASKS] Skipping maven reporter: there is already a result available.[INFO] [surefire:test
{execution: default-test}]
[INFO] Surefire report directory: <https://hudson.apache.org/hudson/job/Jackrabbit-trunk/ws/trunk/jackrabbit-jcr-tests/target/surefire-reports>


-------------------------------------------------------
 T E S T S
-------------------------------------------------------
There are no tests to run.

Results :

Tests run: 0, Failures: 0, Errors: 0, Skipped: 0

[TASKS] Skipping maven reporter: there is already a result available.
[HUDSON] Recording test results
[INFO] [jar:jar {execution: default-jar}]
[INFO] Building jar: <https://hudson.apache.org/hudson/job/Jackrabbit-trunk/ws/trunk/jackrabbit-jcr-tests/target/jackrabbit-jcr-tests-2.2-SNAPSHOT.jar>
[TASKS] Skipping maven reporter: there is already a result available.[INFO] [apache-rat:check
{execution: default}]
[INFO] Exclude: **/nodetype/spec/*.txt
[INFO] Exclude: *.log
[INFO] Exclude: .checkstyle

[TASKS] Skipping maven reporter: there is already a result available.[INFO] [install:install
{execution: default-install}]
[INFO] Installing <https://hudson.apache.org/hudson/job/Jackrabbit-trunk/ws/trunk/jackrabbit-jcr-tests/target/jackrabbit-jcr-tests-2.2-SNAPSHOT.jar>
to /export/home/hudson/.m2/repository/org/apache/jackrabbit/jackrabbit-jcr-tests/2.2-SNAPSHOT/jackrabbit-jcr-tests-2.2-SNAPSHOT.jar

[TASKS] Skipping maven reporter: there is already a result available.[INFO] [deploy:deploy
{execution: default-deploy}]
[INFO] Retrieving previous build number from apache.snapshots.https

Uploading: https://repository.apache.org/content/repositories/snapshots/org/apache/jackrabbit/jackrabbit-jcr-tests/2.2-SNAPSHOT/jackrabbit-jcr-tests-2.2-20101123.152214-203.jar
798K uploaded  (jackrabbit-jcr-tests-2.2-20101123.152214-203.jar)
[INFO] Uploading project information for jackrabbit-jcr-tests 2.2-20101123.152214-203
[INFO] Retrieving previous metadata from apache.snapshots.https
[INFO] Uploading repository metadata for: 'snapshot org.apache.jackrabbit:jackrabbit-jcr-tests:2.2-SNAPSHOT'
[INFO] Retrieving previous metadata from apache.snapshots.https
[INFO] Uploading repository metadata for: 'artifact org.apache.jackrabbit:jackrabbit-jcr-tests'
[TASKS] Skipping maven reporter: there is already a result available.
[HUDSON] Archiving <https://hudson.apache.org/hudson/job/Jackrabbit-trunk/ws/trunk/jackrabbit-jcr-tests/pom.xml>
to /home/hudson/hudson/jobs/Jackrabbit-trunk/modules/org.apache.jackrabbit$jackrabbit-jcr-tests/builds/2010-11-23_15-16-30/archive/org.apache.jackrabbit/jackrabbit-jcr-tests/2.2-SNAPSHOT/pom.xml
[HUDSON] Archiving <https://hudson.apache.org/hudson/job/Jackrabbit-trunk/ws/trunk/jackrabbit-jcr-tests/target/jackrabbit-jcr-tests-2.2-SNAPSHOT.jar>
to /home/hudson/hudson/jobs/Jackrabbit-trunk/modules/org.apache.jackrabbit$jackrabbit-jcr-tests/builds/2010-11-23_15-16-30/archive/org.apache.jackrabbit/jackrabbit-jcr-tests/2.2-20101123.152214-203/jackrabbit-jcr-tests-2.2-SNAPSHOT.jar
[INFO] ------------------------------------------------------------------------
[INFO] Building Jackrabbit SPI
[INFO]    task-segment: [clean, deploy]
[INFO] ------------------------------------------------------------------------
[INFO] [clean:clean {execution: default-clean}]
[INFO] Deleting file set: <https://hudson.apache.org/hudson/job/Jackrabbit-trunk/ws/trunk/jackrabbit-spi/target>
(included: [**], excluded: [])
[TASKS] Scanning folder '<https://hudson.apache.org/hudson/job/Jackrabbit-trunk/ws/trunk/jackrabbit-spi/src/main/java'>
for tasks ... 
[TASKS] Found 1.
[TASKS] Scanning folder '<https://hudson.apache.org/hudson/job/Jackrabbit-trunk/ws/trunk/jackrabbit-spi/src/test/java'>
for tasks ... 
[TASKS] Found 2.
[TASKS] Skipping non-existent folder '<https://hudson.apache.org/hudson/job/Jackrabbit-trunk/ws/trunk/jackrabbit-spi/src/main/resources'...>
[TASKS] Skipping non-existent folder '<https://hudson.apache.org/hudson/job/Jackrabbit-trunk/ws/trunk/jackrabbit-spi/src/test/resources'...>
[INFO] [remote-resources:process {execution: default}]
[TASKS] Skipping maven reporter: there is already a result available.[INFO] [resources:resources
{execution: default-resources}]
[INFO] Using 'UTF-8' encoding to copy filtered resources.
[INFO] skip non existing resourceDirectory <https://hudson.apache.org/hudson/job/Jackrabbit-trunk/ws/trunk/jackrabbit-spi/src/main/resources>
[INFO] Copying 3 resources

[TASKS] Skipping maven reporter: there is already a result available.[INFO] [compiler:compile
{execution: default-compile}]
[INFO] Compiling 32 source files to <https://hudson.apache.org/hudson/job/Jackrabbit-trunk/ws/trunk/jackrabbit-spi/target/classes>

[TASKS] Skipping maven reporter: there is already a result available.[INFO] [resources:testResources
{execution: default-testResources}]
[INFO] Using 'UTF-8' encoding to copy filtered resources.
[INFO] skip non existing resourceDirectory <https://hudson.apache.org/hudson/job/Jackrabbit-trunk/ws/trunk/jackrabbit-spi/src/test/resources>
[INFO] Copying 3 resources

[TASKS] Skipping maven reporter: there is already a result available.[INFO] [compiler:testCompile
{execution: default-testCompile}]
[INFO] Compiling 8 source files to <https://hudson.apache.org/hudson/job/Jackrabbit-trunk/ws/trunk/jackrabbit-spi/target/test-classes>

[TASKS] Skipping maven reporter: there is already a result available.[INFO] [surefire:test
{execution: default-test}]
[INFO] Tests are skipped.

[TASKS] Skipping maven reporter: there is already a result available.[INFO] [bundle:bundle
{execution: default-bundle}]

[TASKS] Skipping maven reporter: there is already a result available.
[INFO] [assembly:single {execution: default}]
[INFO] Reading assembly descriptor: assembly.xml
[INFO] Building jar: <https://hudson.apache.org/hudson/job/Jackrabbit-trunk/ws/trunk/jackrabbit-spi/target/jackrabbit-spi-2.2-SNAPSHOT-tests.jar>
[TASKS] Skipping maven reporter: there is already a result available.[INFO] [apache-rat:check
{execution: default}]
[INFO] Exclude: release.properties

[TASKS] Skipping maven reporter: there is already a result available.[INFO] [install:install
{execution: default-install}]
[INFO] Installing <https://hudson.apache.org/hudson/job/Jackrabbit-trunk/ws/trunk/jackrabbit-spi/target/jackrabbit-spi-2.2-SNAPSHOT.jar>
to /export/home/hudson/.m2/repository/org/apache/jackrabbit/jackrabbit-spi/2.2-SNAPSHOT/jackrabbit-spi-2.2-SNAPSHOT.jar
[INFO] Installing <https://hudson.apache.org/hudson/job/Jackrabbit-trunk/ws/trunk/jackrabbit-spi/target/jackrabbit-spi-2.2-SNAPSHOT-tests.jar>
to /export/home/hudson/.m2/repository/org/apache/jackrabbit/jackrabbit-spi/2.2-SNAPSHOT/jackrabbit-spi-2.2-SNAPSHOT-tests.jar

[TASKS] Skipping maven reporter: there is already a result available.[INFO] [bundle:install
{execution: default-install}]
[INFO] Parsing file:/export/home/hudson/.m2/repository/repository.xml
[INFO] Installing org/apache/jackrabbit/jackrabbit-spi/2.2-SNAPSHOT/jackrabbit-spi-2.2-SNAPSHOT.jar
[INFO] Installing org/apache/jackrabbit/jackrabbit-spi/2.2-SNAPSHOT/jackrabbit-spi-2.2-SNAPSHOT-tests.jar
[INFO] Writing OBR metadata

[TASKS] Skipping maven reporter: there is already a result available.[INFO] [deploy:deploy
{execution: default-deploy}]
[INFO] Retrieving previous build number from apache.snapshots.https

Uploading: https://repository.apache.org/content/repositories/snapshots/org/apache/jackrabbit/jackrabbit-spi/2.2-SNAPSHOT/jackrabbit-spi-2.2-20101123.152214-203.jar
26K uploaded  (jackrabbit-spi-2.2-20101123.152214-203.jar)
[INFO] Retrieving previous metadata from apache.snapshots.https
[INFO] Uploading repository metadata for: 'artifact org.apache.jackrabbit:jackrabbit-spi'
[INFO] Retrieving previous metadata from apache.snapshots.https
[INFO] Uploading repository metadata for: 'snapshot org.apache.jackrabbit:jackrabbit-spi:2.2-SNAPSHOT'
[INFO] Uploading project information for jackrabbit-spi 2.2-20101123.152214-203
[INFO] Retrieving previous build number from apache.snapshots.https
Uploading: https://repository.apache.org/content/repositories/snapshots/org/apache/jackrabbit/jackrabbit-spi/2.2-SNAPSHOT/jackrabbit-spi-2.2-20101123.152214-203-tests.jar
23K uploaded  (jackrabbit-spi-2.2-20101123.152214-203-tests.jar)
[TASKS] Skipping maven reporter: there is already a result available.[INFO] [bundle:deploy
{execution: default-deploy}]
[INFO] Remote OBR update disabled (enable with -DremoteOBR)

[TASKS] Skipping maven reporter: there is already a result available.
[HUDSON] Archiving <https://hudson.apache.org/hudson/job/Jackrabbit-trunk/ws/trunk/jackrabbit-spi/pom.xml>
to /home/hudson/hudson/jobs/Jackrabbit-trunk/modules/org.apache.jackrabbit$jackrabbit-spi/builds/2010-11-23_15-16-30/archive/org.apache.jackrabbit/jackrabbit-spi/2.2-SNAPSHOT/pom.xml
[HUDSON] Archiving <https://hudson.apache.org/hudson/job/Jackrabbit-trunk/ws/trunk/jackrabbit-spi/target/jackrabbit-spi-2.2-SNAPSHOT.jar>
to /home/hudson/hudson/jobs/Jackrabbit-trunk/modules/org.apache.jackrabbit$jackrabbit-spi/builds/2010-11-23_15-16-30/archive/org.apache.jackrabbit/jackrabbit-spi/2.2-20101123.152214-203/jackrabbit-spi-2.2-SNAPSHOT.jar
[HUDSON] Archiving <https://hudson.apache.org/hudson/job/Jackrabbit-trunk/ws/trunk/jackrabbit-spi/target/jackrabbit-spi-2.2-SNAPSHOT-tests.jar>
to /home/hudson/hudson/jobs/Jackrabbit-trunk/modules/org.apache.jackrabbit$jackrabbit-spi/builds/2010-11-23_15-16-30/archive/org.apache.jackrabbit/jackrabbit-spi/2.2-20101123.152214-203/jackrabbit-spi-2.2-SNAPSHOT-tests.jar
[INFO] ------------------------------------------------------------------------
[INFO] Building Jackrabbit SPI Commons
[INFO]    task-segment: [clean, deploy]
[INFO] ------------------------------------------------------------------------
[INFO] [clean:clean {execution: default-clean}]
[INFO] Deleting file set: <https://hudson.apache.org/hudson/job/Jackrabbit-trunk/ws/trunk/jackrabbit-spi-commons/target>
(included: [**], excluded: [])
[TASKS] Scanning folder '<https://hudson.apache.org/hudson/job/Jackrabbit-trunk/ws/trunk/jackrabbit-spi-commons/src/main/java'>
for tasks ... 
[TASKS] Found 34.
[TASKS] Scanning folder '<https://hudson.apache.org/hudson/job/Jackrabbit-trunk/ws/trunk/jackrabbit-spi-commons/src/test/java'>
for tasks ... 
[TASKS] Found 6.
[TASKS] Scanning folder '<https://hudson.apache.org/hudson/job/Jackrabbit-trunk/ws/trunk/jackrabbit-spi-commons/src/main/resources'>
for tasks ... 
[TASKS] Found 0.
[TASKS] Scanning folder '<https://hudson.apache.org/hudson/job/Jackrabbit-trunk/ws/trunk/jackrabbit-spi-commons/src/test/resources'>
for tasks ... 
[TASKS] Found 0.
Build timed out. Aborting
[locks-and-latches] Releasing all the locks
[locks-and-latches] All the locks released
ERROR: Failed to parse POMs
hudson.remoting.ChannelClosedException: channel is already closed
	at hudson.remoting.Channel.send(Channel.java:467)
	at hudson.remoting.ProxyOutputStream._write(ProxyOutputStream.java:123)
	at hudson.remoting.ProxyOutputStream.write(ProxyOutputStream.java:103)
	at hudson.remoting.RemoteOutputStream.write(RemoteOutputStream.java:110)
	at java.io.BufferedOutputStream.flushBuffer(BufferedOutputStream.java:65)
	at java.io.BufferedOutputStream.flush(BufferedOutputStream.java:123)
	at java.io.BufferedOutputStream.flush(BufferedOutputStream.java:124)
	at java.io.ObjectOutputStream$BlockDataOutputStream.flush(ObjectOutputStream.java:1793)
	at java.io.ObjectOutputStream.flush(ObjectOutputStream.java:699)
	at hudson.remoting.Channel.send(Channel.java:473)
	at hudson.remoting.Request.call(Request.java:149)
	at hudson.remoting.Channel.call(Channel.java:630)
	at hudson.maven.ProcessCache$MavenProcess.call(ProcessCache.java:156)
	at hudson.maven.MavenModuleSetBuild$RunnerImpl.doRun(MavenModuleSetBuild.java:536)
	at hudson.model.AbstractBuild$AbstractRunner.run(AbstractBuild.java:416)
	at hudson.model.Run.run(Run.java:1324)
	at hudson.maven.MavenModuleSetBuild.run(MavenModuleSetBuild.java:349)
	at hudson.model.ResourceController.execute(ResourceController.java:88)
	at hudson.model.Executor.run(Executor.java:139)
Caused by: java.io.StreamCorruptedException: invalid type code: 00
	at java.io.ObjectInputStream.readObject0(ObjectInputStream.java:1355)
	at java.io.ObjectInputStream.defaultReadFields(ObjectInputStream.java:1946)
	at java.io.ObjectInputStream.readSerialData(ObjectInputStream.java:1870)
	at java.io.ObjectInputStream.readOrdinaryObject(ObjectInputStream.java:1752)
	at java.io.ObjectInputStream.readObject0(ObjectInputStream.java:1328)
	at java.io.ObjectInputStream.readObject(ObjectInputStream.java:350)
	at hudson.remoting.Channel$ReaderThread.run(Channel.java:948)
FATAL: channel is already closed
hudson.remoting.ChannelClosedException: channel is already closed
	at hudson.remoting.Channel.send(Channel.java:467)
	at hudson.remoting.Request.call(Request.java:105)
	at hudson.remoting.Channel.call(Channel.java:630)
	at hudson.Launcher$RemoteLauncher.kill(Launcher.java:744)
	at hudson.model.AbstractBuild$AbstractRunner.run(AbstractBuild.java:421)
	at hudson.model.Run.run(Run.java:1324)
	at hudson.maven.MavenModuleSetBuild.run(MavenModuleSetBuild.java:349)
	at hudson.model.ResourceController.execute(ResourceController.java:88)
	at hudson.model.Executor.run(Executor.java:139)
Caused by: java.io.StreamCorruptedException: invalid type code: 00
	at java.io.ObjectInputStream.readObject0(ObjectInputStream.java:1355)
	at java.io.ObjectInputStream.defaultReadFields(ObjectInputStream.java:1946)
	at java.io.ObjectInputStream.readSerialData(ObjectInputStream.java:1870)
	at java.io.ObjectInputStream.readOrdinaryObject(ObjectInputStream.java:1752)
	at java.io.ObjectInputStream.readObject0(ObjectInputStream.java:1328)
	at java.io.ObjectInputStream.readObject(ObjectInputStream.java:350)
	at hudson.remoting.Channel$ReaderThread.run(Channel.java:948)


Mime
View raw message