jackrabbit-dev mailing list archives

Site index · List index
Message view « Date » · « Thread »
Top « Date » · « Thread »
From Apache Hudson Server <hud...@hudson.apache.org>
Subject Build failed in Hudson: Jackrabbit-trunk #1244
Date Mon, 23 Aug 2010 16:09:48 GMT
See <https://hudson.apache.org/hudson/job/Jackrabbit-trunk/1244/changes>

Changes:

[mduerig] JCR-2724: Wrong argument check in BTreeManager constructor

[stefan] reverting some accidentally committed changes

[jukka] JCR-2722: Add a filtered RangeIterator

Add a few predicate utilities

[stefan] JCR-2490: jackrabbit wrongly think nodetype is changed on nodetype re-registration

[jukka] JCR-2722: Add a filtered RangeIterator

Add convenience constructors to allow the use of predicates with all the RangeIteratorAdapter
subclasses.

Use generics in declarations.

------------------------------------------
Started by an SCM change
Building remotely on vesta.apache.org (Ubuntu)
Updating http://svn.apache.org/repos/asf/jackrabbit/trunk
U         jackrabbit-jcr-commons/src/main/java/org/apache/jackrabbit/commons/flat/BTreeManager.java
U         jackrabbit-jcr-commons/src/main/java/org/apache/jackrabbit/commons/iterator/PropertyIteratorAdapter.java
U         jackrabbit-jcr-commons/src/main/java/org/apache/jackrabbit/commons/iterator/VersionIteratorAdapter.java
U         jackrabbit-jcr-commons/src/main/java/org/apache/jackrabbit/commons/iterator/NodeIteratorAdapter.java
U         jackrabbit-jcr-commons/src/main/java/org/apache/jackrabbit/commons/iterator/EventListenerIteratorAdapter.java
U         jackrabbit-jcr-commons/src/main/java/org/apache/jackrabbit/commons/iterator/NodeTypeIteratorAdapter.java
U         jackrabbit-jcr-commons/src/main/java/org/apache/jackrabbit/commons/iterator/RangeIteratorAdapter.java
U         jackrabbit-jcr-commons/src/main/java/org/apache/jackrabbit/commons/iterator/RowIteratorAdapter.java
U         jackrabbit-jcr-commons/src/main/java/org/apache/jackrabbit/commons/iterator/FilteredRangeIterator.java
U         jackrabbit-jcr-commons/src/main/java/org/apache/jackrabbit/commons/iterator/EventIteratorAdapter.java
U         jackrabbit-jcr-commons/src/main/java/org/apache/jackrabbit/commons/iterator/AccessControlPolicyIteratorAdapter.java
AU        jackrabbit-jcr-commons/src/main/java/org/apache/jackrabbit/commons/predicate/Predicates.java
AU        jackrabbit-jcr-commons/src/main/java/org/apache/jackrabbit/commons/predicate/RowPredicate.java
U         jackrabbit-core/src/test/java/org/apache/jackrabbit/core/ConcurrentRenameTest.java
U         jackrabbit-core/src/test/java/org/apache/jackrabbit/core/ConcurrencyTest3.java
U         jackrabbit-core/src/main/java/org/apache/jackrabbit/core/nodetype/NodeTypeRegistry.java
U         jackrabbit-core/src/main/java/org/apache/jackrabbit/core/NodeTypeInstanceHandler.java
U         jackrabbit-core/src/main/resources/org/apache/jackrabbit/core/JackrabbitRepositoryStub.properties
U         jackrabbit-spi-commons/src/main/java/org/apache/jackrabbit/spi/commons/QPropertyDefinitionImpl.java
U         jackrabbit-spi-commons/src/main/java/org/apache/jackrabbit/spi/commons/QNodeDefinitionImpl.java
U         jackrabbit-spi-commons/src/main/java/org/apache/jackrabbit/spi/commons/QNodeTypeDefinitionImpl.java
U         jackrabbit-spi-commons/src/main/java/org/apache/jackrabbit/spi/commons/nodetype/NodeTypeDefDiff.java
U         jackrabbit-spi-commons/src/main/java/org/apache/jackrabbit/spi/commons/QItemDefinitionImpl.java
U         jackrabbit-jcr-tests/src/main/java/org/apache/jackrabbit/test/api/WorkspaceManagementTest.java
At revision 988167
[locks-and-latches] Checking to see if we really have the locks
[locks-and-latches] Have all the locks, build can start
Parsing POMs
[trunk] $ /home/hudson/tools/java/latest1.5/bin/java -cp /home/hudson/hudson-slave/maven-agent.jar:/home/hudson/tools/maven/apache-maven-2.0.9/boot/classworlds-1.1.jar
hudson.maven.agent.Main /home/hudson/tools/maven/apache-maven-2.0.9 /home/hudson/hudson-slave/slave.jar
/home/hudson/hudson-slave/maven-interceptor.jar 46681
channel started<===[HU
DSON REMOTING CAPACITY]===>   Executing Maven:  -B -f <https://hudson.apache.org/hudson/job/Jackrabbit-trunk/ws/trunk/pom.xml>
clean deploy -Ppedantic,integrationTesting -Dlitmus=/home/hudson/tools/litmus/latest/bin/litmus
[INFO] Scanning for projects...
[INFO] Reactor build order: 
[INFO]   Jackrabbit Parent POM
[INFO]   Apache Jackrabbit API
[INFO]   Jackrabbit JCR Commons
[INFO]   Jackrabbit JCR Tests
[INFO]   Jackrabbit SPI
[INFO]   Jackrabbit SPI Commons
[INFO]   Jackrabbit Core
[INFO]   Jackrabbit WebDAV Library
[INFO]   Jackrabbit JCR Server
[INFO]   Jackrabbit JCR-RMI
[INFO]   Jackrabbit JCR Servlets
[INFO]   Jackrabbit Web Application
[INFO]   Jackrabbit JCA Resource Adapter
[INFO]   Jackrabbit JCR to SPI
[INFO]   Jackrabbit SPI to JCR
[INFO]   Jackrabbit SPI to WebDAV
[INFO]   Jackrabbit JCR to WebDAV
[INFO]   Jackrabbit JCR Client
[INFO]   Jackrabbit Standalone
[INFO]   Apache Jackrabbit
[INFO] ------------------------------------------------------------------------
[INFO] Building Jackrabbit Parent POM
[INFO]    task-segment: [clean, deploy]
[INFO] ------------------------------------------------------------------------
[INFO] [clean:clean]
[INFO] Deleting file set: <https://hudson.apache.org/hudson/job/Jackrabbit-trunk/ws/trunk/jackrabbit-parent/target>
(included: [**], excluded: [])
[TASKS] Skipping non-existent folder '<https://hudson.apache.org/hudson/job/Jackrabbit-trunk/ws/trunk/jackrabbit-parent/src/main/java'...>
[TASKS] Skipping non-existent folder '<https://hudson.apache.org/hudson/job/Jackrabbit-trunk/ws/trunk/jackrabbit-parent/src/test/java'...>
[TASKS] Skipping non-existent folder '<https://hudson.apache.org/hudson/job/Jackrabbit-trunk/ws/trunk/jackrabbit-parent/src/main/resources'...>
[TASKS] Skipping non-existent folder '<https://hudson.apache.org/hudson/job/Jackrabbit-trunk/ws/trunk/jackrabbit-parent/src/test/resources'...>
[INFO] Setting property: classpath.resource.loader.class => 'org.codehaus.plexus.velocity.ContextClassLoaderResourceLoader'.
[INFO] Setting property: velocimacro.messages.on => 'false'.
[INFO] Setting property: resource.loader => 'classpath'.
[INFO] Setting property: resource.manager.logwhenfound => 'false'.
[INFO] [remote-resources:process {execution: default}]
[TASKS] Skipping maven reporter: there is already a result available.
[INFO] [site:attach-descriptor]
[TASKS] Skipping maven reporter: there is already a result available.
[INFO] [apache-rat:check {execution: default}]
[INFO] Exclude: release.properties
[TASKS] Skipping maven reporter: there is already a result available.
[INFO] [install:install]
[INFO] Installing <https://hudson.apache.org/hudson/job/Jackrabbit-trunk/ws/trunk/jackrabbit-parent/pom.xml>
to /home/hudson/.m2/repository/org/apache/jackrabbit/jackrabbit-parent/2.2-SNAPSHOT/jackrabbit-parent-2.2-SNAPSHOT.pom
[TASKS] Skipping maven reporter: there is already a result available.
[INFO] [deploy:deploy]
[INFO] Retrieving previous build number from apache.snapshots.https
Uploading: https://repository.apache.org/content/repositories/snapshots/org/apache/jackrabbit/jackrabbit-parent/2.2-SNAPSHOT/jackrabbit-parent-2.2-20100823.160907-136.pom
10K uploaded
[INFO] Retrieving previous metadata from apache.snapshots.https
[INFO] Uploading repository metadata for: 'artifact org.apache.jackrabbit:jackrabbit-parent'
[INFO] Retrieving previous metadata from apache.snapshots.https
[INFO] Uploading repository metadata for: 'snapshot org.apache.jackrabbit:jackrabbit-parent:2.2-SNAPSHOT'
[TASKS] Skipping maven reporter: there is already a result available.
[HUDSON] Archiving <https://hudson.apache.org/hudson/job/Jackrabbit-trunk/ws/trunk/jackrabbit-parent/pom.xml>
to /home/hudson/hudson/jobs/Jackrabbit-trunk/modules/org.apache.jackrabbit$jackrabbit-parent/builds/2010-08-23_16-08-39/archive/org.apache.jackrabbit/jackrabbit-parent/2.2-SNAPSHOT/pom.xml
[INFO] ------------------------------------------------------------------------
[INFO] Building Apache Jackrabbit API
[INFO]    task-segment: [clean, deploy]
[INFO] ------------------------------------------------------------------------
[INFO] [clean:clean]
[INFO] Deleting file set: <https://hudson.apache.org/hudson/job/Jackrabbit-trunk/ws/trunk/jackrabbit-api/target>
(included: [**], excluded: [])
[TASKS] Scanning folder '<https://hudson.apache.org/hudson/job/Jackrabbit-trunk/ws/trunk/jackrabbit-api/src/main/java'>
for tasks ... 
[TASKS] Found 4.
[TASKS] Skipping non-existent folder '<https://hudson.apache.org/hudson/job/Jackrabbit-trunk/ws/trunk/jackrabbit-api/src/test/java'...>
[TASKS] Skipping non-existent folder '<https://hudson.apache.org/hudson/job/Jackrabbit-trunk/ws/trunk/jackrabbit-api/src/main/resources'...>
[TASKS] Skipping non-existent folder '<https://hudson.apache.org/hudson/job/Jackrabbit-trunk/ws/trunk/jackrabbit-api/src/test/resources'...>
[INFO] [remote-resources:process {execution: default}]
[TASKS] Skipping maven reporter: there is already a result available.
[INFO] [resources:resources]
[INFO] Using 'UTF-8' encoding to copy filtered resources.
[INFO] skip non existing resourceDirectory <https://hudson.apache.org/hudson/job/Jackrabbit-trunk/ws/trunk/jackrabbit-api/src/main/resources>
[INFO] Copying 3 resources
[TASKS] Skipping maven reporter: there is already a result available.
[INFO] [compiler:compile]
[INFO] Compiling 26 source files to <https://hudson.apache.org/hudson/job/Jackrabbit-trunk/ws/trunk/jackrabbit-api/target/classes>
[TASKS] Skipping maven reporter: there is already a result available.[INFO] [resources:testResources]
[INFO] Using 'UTF-8' encoding to copy filtered resources.
[INFO] skip non existing resourceDirectory <https://hudson.apache.org/hudson/job/Jackrabbit-trunk/ws/trunk/jackrabbit-api/src/test/resources>
[INFO] Copying 3 resources

[TASKS] Skipping maven reporter: there is already a result available.[INFO] [compiler:testCompile]
[INFO] No sources to compile

[TASKS] Skipping maven reporter: there is already a result available.
[INFO] [surefire:test]
[INFO] Surefire report directory: <https://hudson.apache.org/hudson/job/Jackrabbit-trunk/ws/trunk/jackrabbit-api/target/surefire-reports>

-------------------------------------------------------
 T E S T S
-------------------------------------------------------
There are no tests to run.

Results :

Tests run: 0, Failures: 0, Errors: 0, Skipped: 0

[TASKS] Skipping maven reporter: there is already a result available.
[HUDSON] Recording test results
[INFO] [bundle:bundle]
[TASKS] Skipping maven reporter: there is already a result available.[INFO] [apache-rat:check
{execution: default}]
[INFO] Exclude: .checkstyle

[TASKS] Skipping maven reporter: there is already a result available.[INFO] [install:install]
[INFO] Installing <https://hudson.apache.org/hudson/job/Jackrabbit-trunk/ws/trunk/jackrabbit-api/target/jackrabbit-api-2.2-SNAPSHOT.jar>
to /home/hudson/.m2/repository/org/apache/jackrabbit/jackrabbit-api/2.2-SNAPSHOT/jackrabbit-api-2.2-SNAPSHOT.jar

[TASKS] Skipping maven reporter: there is already a result available.[INFO] [bundle:install]
[INFO] Parsing file:/home/hudson/.m2/repository/repository.xml
[Fatal Error] :-1:-1: Premature end of file.
org.xml.sax.SAXParseException: Premature end of file.
	at com.sun.org.apache.xerces.internal.parsers.DOMParser.parse(DOMParser.java:264)
	at com.sun.org.apache.xerces.internal.jaxp.DocumentBuilderImpl.parse(DocumentBuilderImpl.java:292)
	at javax.xml.parsers.DocumentBuilder.parse(DocumentBuilder.java:172)
	at org.apache.felix.obrplugin.ObrUpdate.parseFile(ObrUpdate.java:347)
	at org.apache.felix.obrplugin.ObrUpdate.parseRepositoryXml(ObrUpdate.java:324)
	at org.apache.felix.obrplugin.ObrInstall.execute(ObrInstall.java:140)
	at org.apache.maven.plugin.DefaultPluginManager.executeMojo(DefaultPluginManager.java:451)
	at hudson.maven.agent.PluginManagerInterceptor.executeMojo(PluginManagerInterceptor.java:182)
	at org.apache.maven.lifecycle.DefaultLifecycleExecutor.executeGoals(DefaultLifecycleExecutor.java:558)
	at org.apache.maven.lifecycle.DefaultLifecycleExecutor.executeGoalWithLifecycle(DefaultLifecycleExecutor.java:499)
	at org.apache.maven.lifecycle.DefaultLifecycleExecutor.executeGoal(DefaultLifecycleExecutor.java:478)
	at org.apache.maven.lifecycle.DefaultLifecycleExecutor.executeGoalAndHandleFailures(DefaultLifecycleExecutor.java:330)
	at org.apache.maven.lifecycle.DefaultLifecycleExecutor.executeTaskSegments(DefaultLifecycleExecutor.java:291)
	at org.apache.maven.lifecycle.DefaultLifecycleExecutor.execute(DefaultLifecycleExecutor.java:142)
	at org.apache.maven.lifecycle.LifecycleExecutorInterceptor.execute(LifecycleExecutorInterceptor.java:65)
	at org.apache.maven.DefaultMaven.doExecute(DefaultMaven.java:336)
	at org.apache.maven.DefaultMaven.execute(DefaultMaven.java:129)
	at org.apache.maven.cli.MavenCli.main(MavenCli.java:287)
	at sun.reflect.NativeMethodAccessorImpl.invoke0(Native Method)
	at sun.reflect.NativeMethodAccessorImpl.invoke(NativeMethodAccessorImpl.java:39)
	at sun.reflect.DelegatingMethodAccessorImpl.invoke(DelegatingMethodAccessorImpl.java:25)
	at java.lang.reflect.Method.invoke(Method.java:592)
	at org.codehaus.classworlds.Launcher.launchEnhanced(Launcher.java:315)
	at org.codehaus.classworlds.Launcher.launch(Launcher.java:255)
	at hudson.maven.agent.Main.launch(Main.java:165)
	at hudson.maven.MavenBuilder.call(MavenBuilder.java:165)
	at hudson.maven.MavenModuleSetBuild$Builder.call(MavenModuleSetBuild.java:708)
	at hudson.maven.MavenModuleSetBuild$Builder.call(MavenModuleSetBuild.java:652)
	at hudson.remoting.UserRequest.perform(UserRequest.java:114)
	at hudson.remoting.UserRequest.perform(UserRequest.java:48)
	at hudson.remoting.Request$2.run(Request.java:270)
	at java.util.concurrent.Executors$RunnableAdapter.call(Executors.java:417)
	at java.util.concurrent.FutureTask$Sync.innerRun(FutureTask.java:269)
	at java.util.concurrent.FutureTask.run(FutureTask.java:123)
	at java.util.concurrent.ThreadPoolExecutor$Worker.runTask(ThreadPoolExecutor.java:651)
	at java.util.concurrent.ThreadPoolExecutor$Worker.run(ThreadPoolExecutor.java:676)
	at java.lang.Thread.run(Thread.java:595)
[INFO] Writing OBR metadata

[TASKS] Skipping maven reporter: there is already a result available.[INFO] [deploy:deploy]
[INFO] Retrieving previous build number from apache.snapshots.https

Uploading: https://repository.apache.org/content/repositories/snapshots/org/apache/jackrabbit/jackrabbit-api/2.2-SNAPSHOT/jackrabbit-api-2.2-20100823.160907-135.jar
21K uploaded
[INFO] Uploading project information for jackrabbit-api 2.2-20100823.160907-135
[INFO] Retrieving previous metadata from apache.snapshots.https
[INFO] Uploading repository metadata for: 'snapshot org.apache.jackrabbit:jackrabbit-api:2.2-SNAPSHOT'
[INFO] Retrieving previous metadata from apache.snapshots.https
[INFO] Uploading repository metadata for: 'artifact org.apache.jackrabbit:jackrabbit-api'
[INFO] [bundle:deploy]
[INFO] Remote OBR update disabled (enable with -DremoteOBR)
[TASKS] Skipping maven reporter: there is already a result available.
[TASKS] Skipping maven reporter: there is already a result available.
[HUDSON] Archiving <https://hudson.apache.org/hudson/job/Jackrabbit-trunk/ws/trunk/jackrabbit-api/pom.xml>
to /home/hudson/hudson/jobs/Jackrabbit-trunk/modules/org.apache.jackrabbit$jackrabbit-api/builds/2010-08-23_16-08-39/archive/org.apache.jackrabbit/jackrabbit-api/2.2-SNAPSHOT/pom.xml
[HUDSON] Archiving <https://hudson.apache.org/hudson/job/Jackrabbit-trunk/ws/trunk/jackrabbit-api/target/jackrabbit-api-2.2-SNAPSHOT.jar>
to /home/hudson/hudson/jobs/Jackrabbit-trunk/modules/org.apache.jackrabbit$jackrabbit-api/builds/2010-08-23_16-08-39/archive/org.apache.jackrabbit/jackrabbit-api/2.2-20100823.160907-135/jackrabbit-api-2.2-SNAPSHOT.jar
[INFO] ------------------------------------------------------------------------
[INFO] Building Jackrabbit JCR Commons
[INFO]    task-segment: [clean, deploy]
[INFO] ------------------------------------------------------------------------
[INFO] [clean:clean]
[INFO] Deleting file set: <https://hudson.apache.org/hudson/job/Jackrabbit-trunk/ws/trunk/jackrabbit-jcr-commons/target>
(included: [**], excluded: [])
[TASKS] Scanning folder '<https://hudson.apache.org/hudson/job/Jackrabbit-trunk/ws/trunk/jackrabbit-jcr-commons/src/main/java'>
for tasks ... 
[TASKS] Found 6.
[TASKS] Scanning folder '<https://hudson.apache.org/hudson/job/Jackrabbit-trunk/ws/trunk/jackrabbit-jcr-commons/src/test/java'>
for tasks ... 
[TASKS] Found 5.
[TASKS] Scanning folder '<https://hudson.apache.org/hudson/job/Jackrabbit-trunk/ws/trunk/jackrabbit-jcr-commons/src/main/resources'>
for tasks ... 
[TASKS] Found 0.
[TASKS] Skipping non-existent folder '<https://hudson.apache.org/hudson/job/Jackrabbit-trunk/ws/trunk/jackrabbit-jcr-commons/src/test/resources'...>
[INFO] [remote-resources:process {execution: default}]
[TASKS] Skipping maven reporter: there is already a result available.
[INFO] [resources:resources]
[INFO] Using 'UTF-8' encoding to copy filtered resources.
[INFO] Copying 2 resources
[INFO] Copying 3 resources
[TASKS] Skipping maven reporter: there is already a result available.[INFO] [compiler:compile]

[INFO] Compiling 115 source files to <https://hudson.apache.org/hudson/job/Jackrabbit-trunk/ws/trunk/jackrabbit-jcr-commons/target/classes>
[TASKS] Skipping maven reporter: there is already a result available.
[HUDSON] Archiving <https://hudson.apache.org/hudson/job/Jackrabbit-trunk/ws/trunk/jackrabbit-jcr-commons/pom.xml>
to /home/hudson/hudson/jobs/Jackrabbit-trunk/modules/org.apache.jackrabbit$jackrabbit-jcr-commons/builds/2010-08-23_16-08-39/archive/org.apache.jackrabbit/jackrabbit-jcr-commons/2.2-SNAPSHOT/pom.xml
[INFO] ------------------------------------------------------------------------
[ERROR] BUILD FAILURE
[INFO] ------------------------------------------------------------------------
[INFO] Compilation failure

<https://hudson.apache.org/hudson/job/Jackrabbit-trunk/ws/trunk/jackrabbit-jcr-commons/src/main/java/org/apache/jackrabbit/commons/iterator/RowIteratorAdapter.java>:[40,8]
reference to RowIteratorAdapter is ambiguous, both method RowIteratorAdapter(javax.jcr.RangeIterator)
in org.apache.jackrabbit.commons.iterator.RowIteratorAdapter and method RowIteratorAdapter(java.util.Iterator<?>)
in org.apache.jackrabbit.commons.iterator.RowIteratorAdapter match

<https://hudson.apache.org/hudson/job/Jackrabbit-trunk/ws/trunk/jackrabbit-jcr-commons/src/main/java/org/apache/jackrabbit/commons/query/GQL.java>:[1119,12]
reference to RowIteratorAdapter is ambiguous, both method RowIteratorAdapter(javax.jcr.RangeIterator)
in org.apache.jackrabbit.commons.iterator.RowIteratorAdapter and method RowIteratorAdapter(java.util.Iterator<?>)
in org.apache.jackrabbit.commons.iterator.RowIteratorAdapter match


[INFO] ------------------------------------------------------------------------
[INFO] For more information, run Maven with the -e switch
[INFO] ------------------------------------------------------------------------
[INFO] Total time: 58 seconds
[INFO] Finished at: Mon Aug 23 16:09:46 UTC 2010
[INFO] Final Memory: 39M/217M
[INFO] ------------------------------------------------------------------------
Sending e-mails to: dev@jackrabbit.apache.org
channel stopped
[locks-and-latches] Releasing all the locks
[locks-and-latches] All the locks released


Mime
View raw message