jackrabbit-dev mailing list archives

Site index · List index
Message view « Date » · « Thread »
Top « Date » · « Thread »
From Apache Hudson Server <hud...@hudson.zones.apache.org>
Subject Build failed in Hudson: Jackrabbit-trunk #1205
Date Thu, 05 Aug 2010 10:49:49 GMT
See <http://hudson.zones.apache.org/hudson/job/Jackrabbit-trunk/1205/changes>

Changes:

[Jukka Zitting] JCR-890: concurrent read-only access to a session

Turn addMixin() and removeMixin() into SessionOperations

[Jukka Zitting] JCR-890: concurrent read-only access to a session

Turn Node.addNode() into a SessionOperation

------------------------------------------
[...truncated 1377 lines...]
Uploading: https://repository.apache.org/content/repositories/snapshots/org/apache/jackrabbit/jackrabbit-jcr-servlet/2.2-SNAPSHOT/jackrabbit-jcr-servlet-2.2-20100805.101406-88.jar
32K uploaded
[INFO] Retrieving previous metadata from apache.snapshots.https
[INFO] Uploading repository metadata for: 'snapshot org.apache.jackrabbit:jackrabbit-jcr-servlet:2.2-SNAPSHOT'
[INFO] Retrieving previous metadata from apache.snapshots.https
[INFO] Uploading repository metadata for: 'artifact org.apache.jackrabbit:jackrabbit-jcr-servlet'
[INFO] Uploading project information for jackrabbit-jcr-servlet 2.2-20100805.101406-88
[TASKS] Skipping maven reporter: there is already a result available.
[HUDSON] Archiving <http://hudson.zones.apache.org/hudson/job/Jackrabbit-trunk/ws/trunk/jackrabbit-jcr-servlet/pom.xml>
to /export/home/hudson/hudson/jobs/Jackrabbit-trunk/modules/org.apache.jackrabbit$jackrabbit-jcr-servlet/builds/2010-08-05_10-13-37/archive/org.apache.jackrabbit/jackrabbit-jcr-servlet/2.2-SNAPSHOT/pom.xml
[HUDSON] Archiving <http://hudson.zones.apache.org/hudson/job/Jackrabbit-trunk/ws/trunk/jackrabbit-jcr-servlet/target/jackrabbit-jcr-servlet-2.2-SNAPSHOT.jar>
to /export/home/hudson/hudson/jobs/Jackrabbit-trunk/modules/org.apache.jackrabbit$jackrabbit-jcr-servlet/builds/2010-08-05_10-13-37/archive/org.apache.jackrabbit/jackrabbit-jcr-servlet/2.2-20100805.101406-88/jackrabbit-jcr-servlet-2.2-SNAPSHOT.jar
[INFO] ------------------------------------------------------------------------
[INFO] Building Jackrabbit Web Application
[INFO]    task-segment: [clean, deploy]
[INFO] ------------------------------------------------------------------------
[INFO] [clean:clean]
[INFO] Deleting file set: <http://hudson.zones.apache.org/hudson/job/Jackrabbit-trunk/ws/trunk/jackrabbit-webapp/target>
(included: [**], excluded: [])
[TASKS] Scanning folder '<http://hudson.zones.apache.org/hudson/job/Jackrabbit-trunk/ws/trunk/jackrabbit-webapp/src/main/java'>
for tasks ... 
[TASKS] Found 2.
[TASKS] Skipping non-existent folder '<http://hudson.zones.apache.org/hudson/job/Jackrabbit-trunk/ws/trunk/jackrabbit-webapp/src/test/java'...>
[TASKS] Scanning folder '<http://hudson.zones.apache.org/hudson/job/Jackrabbit-trunk/ws/trunk/jackrabbit-webapp/src/main/resources'>
for tasks ... 
[TASKS] Found 0.
[TASKS] Skipping non-existent folder '<http://hudson.zones.apache.org/hudson/job/Jackrabbit-trunk/ws/trunk/jackrabbit-webapp/src/test/resources'...>
[INFO] [remote-resources:process {execution: default}]
[TASKS] Skipping maven reporter: there is already a result available.
[INFO] [resources:resources]
[INFO] Using 'UTF-8' encoding to copy filtered resources.
[INFO] Copying 1 resource
[INFO] Copying 3 resources
[TASKS] Skipping maven reporter: there is already a result available.
[INFO] [compiler:compile]
[INFO] Compiling 12 source files to <http://hudson.zones.apache.org/hudson/job/Jackrabbit-trunk/ws/trunk/jackrabbit-webapp/target/classes>
[TASKS] Skipping maven reporter: there is already a result available.[INFO] [resources:testResources]
[INFO] Using 'UTF-8' encoding to copy filtered resources.
[INFO] skip non existing resourceDirectory <http://hudson.zones.apache.org/hudson/job/Jackrabbit-trunk/ws/trunk/jackrabbit-webapp/src/test/resources>
[INFO] Copying 3 resources

[TASKS] Skipping maven reporter: there is already a result available.
[INFO] [compiler:testCompile]
[INFO] No sources to compile
[TASKS] Skipping maven reporter: there is already a result available.
[INFO] [surefire:test]
[INFO] Surefire report directory: <http://hudson.zones.apache.org/hudson/job/Jackrabbit-trunk/ws/trunk/jackrabbit-webapp/target/surefire-reports>

-------------------------------------------------------
 T E S T S
-------------------------------------------------------
There are no tests to run.

Results :

Tests run: 0, Failures: 0, Errors: 0, Skipped: 0

[TASKS] Skipping maven reporter: there is already a result available.
[HUDSON] Recording test results
[INFO] [war:war]
[INFO] Exploding webapp...
[INFO] Assembling webapp jackrabbit-webapp in <http://hudson.zones.apache.org/hudson/job/Jackrabbit-trunk/ws/trunk/jackrabbit-webapp/target/jackrabbit-webapp-2.2-SNAPSHOT>
[INFO] Copy webapp webResources to <http://hudson.zones.apache.org/hudson/job/Jackrabbit-trunk/ws/trunk/jackrabbit-webapp/target/jackrabbit-webapp-2.2-SNAPSHOT>
[INFO] Generating war <http://hudson.zones.apache.org/hudson/job/Jackrabbit-trunk/ws/trunk/jackrabbit-webapp/target/jackrabbit-webapp-2.2-SNAPSHOT.war>
[INFO] Building war: <http://hudson.zones.apache.org/hudson/job/Jackrabbit-trunk/ws/trunk/jackrabbit-webapp/target/jackrabbit-webapp-2.2-SNAPSHOT.war>
[TASKS] Skipping maven reporter: there is already a result available.
[INFO] [build-helper:attach-artifact {execution: attach-artifacts}]
[TASKS] Skipping maven reporter: there is already a result available.
[INFO] [antrun:run {execution: default}]
[INFO] Executing tasks
      [jar] Building jar: <http://hudson.zones.apache.org/hudson/job/Jackrabbit-trunk/ws/trunk/jackrabbit-webapp/target/jackrabbit-webapp-2.2-SNAPSHOT.jar>
[INFO] Executed tasks
[TASKS] Skipping maven reporter: there is already a result available.[INFO] [apache-rat:check
{execution: default}]
[INFO] Exclude: src/main/webapp/WEB-INF/log4j.dtd

[TASKS] Skipping maven reporter: there is already a result available.[INFO] [install:install]
[INFO] Installing <http://hudson.zones.apache.org/hudson/job/Jackrabbit-trunk/ws/trunk/jackrabbit-webapp/target/jackrabbit-webapp-2.2-SNAPSHOT.war>
to /home/hudson/.m2/repository/org/apache/jackrabbit/jackrabbit-webapp/2.2-SNAPSHOT/jackrabbit-webapp-2.2-SNAPSHOT.war

[INFO] Installing <http://hudson.zones.apache.org/hudson/job/Jackrabbit-trunk/ws/trunk/jackrabbit-webapp/target/jackrabbit-webapp-2.2-SNAPSHOT.jar>
to /home/hudson/.m2/repository/org/apache/jackrabbit/jackrabbit-webapp/2.2-SNAPSHOT/jackrabbit-webapp-2.2-SNAPSHOT.jar
[TASKS] Skipping maven reporter: there is already a result available.[INFO] [deploy:deploy]
[INFO] Retrieving previous build number from apache.snapshots.https

Uploading: https://repository.apache.org/content/repositories/snapshots/org/apache/jackrabbit/jackrabbit-webapp/2.2-SNAPSHOT/jackrabbit-webapp-2.2-20100805.101406-88.war
23244K uploaded
[INFO] Retrieving previous metadata from apache.snapshots.https
[INFO] Uploading repository metadata for: 'artifact org.apache.jackrabbit:jackrabbit-webapp'
[INFO] Uploading project information for jackrabbit-webapp 2.2-20100805.101406-88
[INFO] Retrieving previous metadata from apache.snapshots.https
[INFO] Uploading repository metadata for: 'snapshot org.apache.jackrabbit:jackrabbit-webapp:2.2-SNAPSHOT'
[INFO] Retrieving previous build number from apache.snapshots.https
Uploading: https://repository.apache.org/content/repositories/snapshots/org/apache/jackrabbit/jackrabbit-webapp/2.2-SNAPSHOT/jackrabbit-webapp-2.2-20100805.101406-88.jar
33K uploaded
[TASKS] Skipping maven reporter: there is already a result available.
[HUDSON] Archiving <http://hudson.zones.apache.org/hudson/job/Jackrabbit-trunk/ws/trunk/jackrabbit-webapp/pom.xml>
to /export/home/hudson/hudson/jobs/Jackrabbit-trunk/modules/org.apache.jackrabbit$jackrabbit-webapp/builds/2010-08-05_10-13-37/archive/org.apache.jackrabbit/jackrabbit-webapp/2.2-SNAPSHOT/pom.xml
[HUDSON] Archiving <http://hudson.zones.apache.org/hudson/job/Jackrabbit-trunk/ws/trunk/jackrabbit-webapp/target/jackrabbit-webapp-2.2-SNAPSHOT.war>
to /export/home/hudson/hudson/jobs/Jackrabbit-trunk/modules/org.apache.jackrabbit$jackrabbit-webapp/builds/2010-08-05_10-13-37/archive/org.apache.jackrabbit/jackrabbit-webapp/2.2-20100805.101406-88/jackrabbit-webapp-2.2-SNAPSHOT.war
[HUDSON] Archiving <http://hudson.zones.apache.org/hudson/job/Jackrabbit-trunk/ws/trunk/jackrabbit-webapp/target/jackrabbit-webapp-2.2-SNAPSHOT.jar>
to /export/home/hudson/hudson/jobs/Jackrabbit-trunk/modules/org.apache.jackrabbit$jackrabbit-webapp/builds/2010-08-05_10-13-37/archive/org.apache.jackrabbit/jackrabbit-webapp/2.2-20100805.101406-88/jackrabbit-webapp-2.2-SNAPSHOT.jar
[INFO] ------------------------------------------------------------------------
[INFO] Building Jackrabbit JCA Resource Adapter
[INFO]    task-segment: [clean, deploy]
[INFO] ------------------------------------------------------------------------
[INFO] [clean:clean]
[INFO] Deleting file set: <http://hudson.zones.apache.org/hudson/job/Jackrabbit-trunk/ws/trunk/jackrabbit-jca/target>
(included: [**], excluded: [])
[TASKS] Scanning folder '<http://hudson.zones.apache.org/hudson/job/Jackrabbit-trunk/ws/trunk/jackrabbit-jca/src/main/java'>
for tasks ... 
[TASKS] Found 0.
[TASKS] Scanning folder '<http://hudson.zones.apache.org/hudson/job/Jackrabbit-trunk/ws/trunk/jackrabbit-jca/src/test/java'>
for tasks ... 
[TASKS] Found 0.
[TASKS] Scanning folder '<http://hudson.zones.apache.org/hudson/job/Jackrabbit-trunk/ws/trunk/jackrabbit-jca/src/main/resources'>
for tasks ... 
[TASKS] Found 0.
[TASKS] Scanning folder '<http://hudson.zones.apache.org/hudson/job/Jackrabbit-trunk/ws/trunk/jackrabbit-jca/src/test/resources'>
for tasks ... 
[TASKS] Found 0.
[INFO] [remote-resources:process {execution: default}]
[TASKS] Skipping maven reporter: there is already a result available.
[INFO] [resources:resources]
[INFO] Using 'UTF-8' encoding to copy filtered resources.
[INFO] Copying 1 resource
[INFO] Copying 3 resources
[TASKS] Skipping maven reporter: there is already a result available.[INFO] [compiler:compile]
[INFO] Compiling 10 source files to <http://hudson.zones.apache.org/hudson/job/Jackrabbit-trunk/ws/trunk/jackrabbit-jca/target/classes>

[INFO] [resources:testResources][TASKS] Skipping maven reporter: there is already a result
available.
[INFO] Using 'UTF-8' encoding to copy filtered resources.
[INFO] Copying 1 resource
[INFO] Copying 3 resources

[TASKS] Skipping maven reporter: there is already a result available.[INFO] [compiler:testCompile]
[INFO] Compiling 3 source files to <http://hudson.zones.apache.org/hudson/job/Jackrabbit-trunk/ws/trunk/jackrabbit-jca/target/test-classes>

[TASKS] Skipping maven reporter: there is already a result available.[INFO] [surefire:test]
[INFO] Surefire report directory: <http://hudson.zones.apache.org/hudson/job/Jackrabbit-trunk/ws/trunk/jackrabbit-jca/target/surefire-reports>


-------------------------------------------------------
 T E S T S
-------------------------------------------------------
Running org.apache.jackrabbit.jca.test.ConnectionFactoryTest
Tests run: 5, Failures: 0, Errors: 0, Skipped: 0, Time elapsed: 7.375 sec
Running org.apache.jackrabbit.jca.test.ConnectionRequestInfoTest
Tests run: 3, Failures: 0, Errors: 0, Skipped: 0, Time elapsed: 0.006 sec

Results :

Tests run: 8, Failures: 0, Errors: 0, Skipped: 0

[TASKS] Skipping maven reporter: there is already a result available.
[HUDSON] Recording test results
[INFO] [jar:jar {execution: package-jca-jar}]
[INFO] Building jar: <http://hudson.zones.apache.org/hudson/job/Jackrabbit-trunk/ws/trunk/jackrabbit-jca/target/jackrabbit-jca-2.2-SNAPSHOT.jar>
[TASKS] Skipping maven reporter: there is already a result available.
[INFO] [rar:rar]
[INFO] Including generated jar file[jackrabbit-jca-2.2-SNAPSHOT.jar]
[INFO] Copying artifact[org.apache.jackrabbit, org.apache.jackrabbit:jackrabbit-core:jar:2.2-SNAPSHOT,
compile]
[INFO] Copying artifact[concurrent, concurrent:concurrent:jar:1.3.4, compile]
[INFO] Copying artifact[commons-collections, commons-collections:commons-collections:jar:3.2.1,
compile]
[INFO] Copying artifact[commons-io, commons-io:commons-io:jar:1.4, compile]
[INFO] Copying artifact[commons-dbcp, commons-dbcp:commons-dbcp:jar:1.2.2, compile]
[INFO] Copying artifact[commons-pool, commons-pool:commons-pool:jar:1.3, compile]
[INFO] Copying artifact[org.apache.jackrabbit, org.apache.jackrabbit:jackrabbit-api:jar:2.2-SNAPSHOT,
compile]
[INFO] Copying artifact[org.apache.jackrabbit, org.apache.jackrabbit:jackrabbit-jcr-commons:jar:2.2-SNAPSHOT,
compile]
[INFO] Copying artifact[org.apache.jackrabbit, org.apache.jackrabbit:jackrabbit-spi-commons:jar:2.2-SNAPSHOT,
compile]
[INFO] Copying artifact[org.apache.jackrabbit, org.apache.jackrabbit:jackrabbit-spi:jar:2.2-SNAPSHOT,
compile]
[INFO] Copying artifact[org.slf4j, org.slf4j:slf4j-api:jar:1.5.11, compile]
[INFO] Copying artifact[org.apache.tika, org.apache.tika:tika-parsers:jar:0.7, compile]
[INFO] Copying artifact[org.apache.tika, org.apache.tika:tika-core:jar:0.7, compile]
[INFO] Copying artifact[org.apache.commons, org.apache.commons:commons-compress:jar:1.0, compile]
[INFO] Copying artifact[org.apache.pdfbox, org.apache.pdfbox:pdfbox:jar:1.0.0, compile]
[INFO] Copying artifact[org.apache.pdfbox, org.apache.pdfbox:fontbox:jar:1.0.0, compile]
[INFO] Copying artifact[org.apache.pdfbox, org.apache.pdfbox:jempbox:jar:1.0.0, compile]
[INFO] Copying artifact[org.bouncycastle, org.bouncycastle:bcmail-jdk15:jar:1.45, compile]
[INFO] Copying artifact[org.bouncycastle, org.bouncycastle:bcprov-jdk15:jar:1.45, compile]
[INFO] Copying artifact[org.apache.poi, org.apache.poi:poi:jar:3.6, compile]
[INFO] Copying artifact[log4j, log4j:log4j:jar:1.2.14, compile]
[INFO] Copying artifact[org.apache.poi, org.apache.poi:poi-scratchpad:jar:3.6, compile]
[INFO] Copying artifact[org.apache.poi, org.apache.poi:poi-ooxml:jar:3.6, compile]
[INFO] Copying artifact[org.apache.poi, org.apache.poi:poi-ooxml-schemas:jar:3.6, compile]
[INFO] Copying artifact[org.apache.xmlbeans, org.apache.xmlbeans:xmlbeans:jar:2.3.0, compile]
[INFO] Copying artifact[org.apache.geronimo.specs, org.apache.geronimo.specs:geronimo-stax-api_1.0_spec:jar:1.0.1,
compile]
[INFO] Copying artifact[dom4j, dom4j:dom4j:jar:1.6.1, compile]
[INFO] Copying artifact[org.ccil.cowan.tagsoup, org.ccil.cowan.tagsoup:tagsoup:jar:1.2, compile]
[INFO] Copying artifact[asm, asm:asm:jar:3.1, compile]
[INFO] Copying artifact[com.drewnoakes, com.drewnoakes:metadata-extractor:jar:2.4.0-beta-1,
compile]
[INFO] Copying artifact[org.slf4j, org.slf4j:jcl-over-slf4j:jar:1.5.11, compile]
[INFO] Copying artifact[org.apache.lucene, org.apache.lucene:lucene-core:jar:2.4.1, compile]
[INFO] Copying artifact[org.apache.derby, org.apache.derby:derby:jar:10.5.3.0_1, compile]
[INFO] Copying artifact[ch.qos.logback, ch.qos.logback:logback-classic:jar:0.9.20, compile]
[INFO] Copying artifact[ch.qos.logback, ch.qos.logback:logback-core:jar:0.9.20, compile]
[INFO] Copy rar resources to <http://hudson.zones.apache.org/hudson/job/Jackrabbit-trunk/ws/trunk/jackrabbit-jca/target/jackrabbit-jca-2.2-SNAPSHOT>
[INFO] Using ra.xml <http://hudson.zones.apache.org/hudson/job/Jackrabbit-trunk/ws/trunk/jackrabbit-jca/src/main/rar/META-INF/ra.xml>
[INFO] Could not find manifest file: <http://hudson.zones.apache.org/hudson/job/Jackrabbit-trunk/ws/trunk/jackrabbit-jca/src/main/rar/META-INF/MANIFEST.MF>
- Generating one
[INFO] Building jar: <http://hudson.zones.apache.org/hudson/job/Jackrabbit-trunk/ws/trunk/jackrabbit-jca/target/jackrabbit-jca-2.2-SNAPSHOT.rar>
[TASKS] Skipping maven reporter: there is already a result available.
[INFO] [build-helper:attach-artifact {execution: attach-artifacts}]
[INFO] [TASKS] Skipping maven reporter: there is already a result available.[apache-rat:check
{execution: default}]
[INFO] Exclude: release.properties

[TASKS] Skipping maven reporter: there is already a result available.[INFO] [install:install]
[INFO] Installing <http://hudson.zones.apache.org/hudson/job/Jackrabbit-trunk/ws/trunk/jackrabbit-jca/target/jackrabbit-jca-2.2-SNAPSHOT.rar>
to /home/hudson/.m2/repository/org/apache/jackrabbit/jackrabbit-jca/2.2-SNAPSHOT/jackrabbit-jca-2.2-SNAPSHOT.rar

[INFO] Installing <http://hudson.zones.apache.org/hudson/job/Jackrabbit-trunk/ws/trunk/jackrabbit-jca/target/jackrabbit-jca-2.2-SNAPSHOT.jar>
to /home/hudson/.m2/repository/org/apache/jackrabbit/jackrabbit-jca/2.2-SNAPSHOT/jackrabbit-jca-2.2-SNAPSHOT.jar
[TASKS] Skipping maven reporter: there is already a result available.[INFO] [deploy:deploy]
[INFO] Retrieving previous build number from apache.snapshots.https

Uploading: https://repository.apache.org/content/repositories/snapshots/org/apache/jackrabbit/jackrabbit-jca/2.2-SNAPSHOT/jackrabbit-jca-2.2-20100805.101406-83.rar
22243K uploaded
[INFO] Retrieving previous metadata from apache.snapshots.https
[INFO] Uploading repository metadata for: 'artifact org.apache.jackrabbit:jackrabbit-jca'
[INFO] Retrieving previous metadata from apache.snapshots.https
[INFO] Uploading repository metadata for: 'snapshot org.apache.jackrabbit:jackrabbit-jca:2.2-SNAPSHOT'
[INFO] Uploading project information for jackrabbit-jca 2.2-20100805.101406-83
[INFO] Retrieving previous build number from apache.snapshots.https
Uploading: https://repository.apache.org/content/repositories/snapshots/org/apache/jackrabbit/jackrabbit-jca/2.2-SNAPSHOT/jackrabbit-jca-2.2-20100805.101406-83.jar
28K uploaded
[TASKS] Skipping maven reporter: there is already a result available.
[HUDSON] Archiving <http://hudson.zones.apache.org/hudson/job/Jackrabbit-trunk/ws/trunk/jackrabbit-jca/pom.xml>
to /export/home/hudson/hudson/jobs/Jackrabbit-trunk/modules/org.apache.jackrabbit$jackrabbit-jca/builds/2010-08-05_10-13-37/archive/org.apache.jackrabbit/jackrabbit-jca/2.2-SNAPSHOT/pom.xml
[HUDSON] Archiving <http://hudson.zones.apache.org/hudson/job/Jackrabbit-trunk/ws/trunk/jackrabbit-jca/target/jackrabbit-jca-2.2-SNAPSHOT.rar>
to /export/home/hudson/hudson/jobs/Jackrabbit-trunk/modules/org.apache.jackrabbit$jackrabbit-jca/builds/2010-08-05_10-13-37/archive/org.apache.jackrabbit/jackrabbit-jca/2.2-20100805.101406-83/jackrabbit-jca-2.2-SNAPSHOT.rar
[locks-and-latches] Releasing all the locks
[locks-and-latches] All the locks released
ERROR: Failed to parse POMs
hudson.util.IOException2: Failed to join the process
	at hudson.Proc$RemoteProc.join(Proc.java:355)
	at hudson.maven.ProcessCache$MavenProcess.call(ProcessCache.java:164)
	at hudson.maven.MavenModuleSetBuild$RunnerImpl.doRun(MavenModuleSetBuild.java:483)
	at hudson.model.AbstractBuild$AbstractRunner.run(AbstractBuild.java:416)
	at hudson.model.Run.run(Run.java:1257)
	at hudson.maven.MavenModuleSetBuild.run(MavenModuleSetBuild.java:306)
	at hudson.model.ResourceController.execute(ResourceController.java:88)
	at hudson.model.Executor.run(Executor.java:127)
Caused by: java.util.concurrent.ExecutionException: hudson.remoting.RequestAbortedException:
java.io.IOException: Unexpected termination of the channel
	at hudson.remoting.Request$1.get(Request.java:218)
	at hudson.remoting.Request$1.get(Request.java:172)
	at hudson.remoting.FutureAdapter.get(FutureAdapter.java:55)
	at hudson.Proc$RemoteProc.join(Proc.java:347)
	... 7 more
Caused by: hudson.remoting.RequestAbortedException: java.io.IOException: Unexpected termination
of the channel
	at hudson.remoting.Request.abort(Request.java:257)
	at hudson.remoting.Channel.terminate(Channel.java:602)
	at hudson.remoting.Channel$ReaderThread.run(Channel.java:893)
Caused by: java.io.IOException: Unexpected termination of the channel
	at hudson.remoting.Channel$ReaderThread.run(Channel.java:875)
Caused by: java.io.EOFException
	at java.io.ObjectInputStream$BlockDataInputStream.peekByte(ObjectInputStream.java:2554)
	at java.io.ObjectInputStream.readObject0(ObjectInputStream.java:1297)
	at java.io.ObjectInputStream.readObject(ObjectInputStream.java:351)
	at hudson.remoting.Channel$ReaderThread.run(Channel.java:869)
FATAL: channel is already closed
hudson.remoting.ChannelClosedException: channel is already closed
	at hudson.remoting.Channel.send(Channel.java:412)
	at hudson.remoting.Request.call(Request.java:105)
	at hudson.remoting.Channel.call(Channel.java:555)
	at hudson.Launcher$RemoteLauncher.kill(Launcher.java:744)
	at hudson.model.AbstractBuild$AbstractRunner.run(AbstractBuild.java:421)
	at hudson.model.Run.run(Run.java:1257)
	at hudson.maven.MavenModuleSetBuild.run(MavenModuleSetBuild.java:306)
	at hudson.model.ResourceController.execute(ResourceController.java:88)
	at hudson.model.Executor.run(Executor.java:127)


Mime
View raw message