jackrabbit-dev mailing list archives

Site index · List index
Message view « Date » · « Thread »
Top « Date » · « Thread »
From Apache Hudson Server <hud...@hudson.zones.apache.org>
Subject Build failed in Hudson: Jackrabbit-trunk #1142
Date Fri, 14 May 2010 17:17:36 GMT
See <http://hudson.zones.apache.org/hudson/job/Jackrabbit-trunk/1142/changes>

Changes:

[stefan] javadoc

[stefan] JCR-2627 System-view export/import of multi-value property does not respect JCR 2.0

[Jukka Zitting] JCR-2503: inconsistent session and persistent state after ReferentialIntegrityException

Added a test case based on code by Bram de Kruijff.

------------------------------------------
[...truncated 544 lines...]

[INFO] [install:install]
[TASKS] Skipping maven reporter: there is already a result available.[INFO] Installing <http://hudson.zones.apache.org/hudson/job/Jackrabbit-trunk/ws/trunk/jackrabbit-spi-commons/target/jackrabbit-spi-commons-2.2-SNAPSHOT.jar>
to /export/home/hudson/.m2/repository/org/apache/jackrabbit/jackrabbit-spi-commons/2.2-SNAPSHOT/jackrabbit-spi-commons-2.2-SNAPSHOT.jar

[TASKS] Skipping maven reporter: there is already a result available.[INFO] [bundle:install]
[INFO] Parsing file:/export/home/hudson/.m2/repository/repository.xml
[INFO] Installing org/apache/jackrabbit/jackrabbit-spi-commons/2.2-SNAPSHOT/jackrabbit-spi-commons-2.2-SNAPSHOT.jar
[INFO] Writing OBR metadata

[INFO] [deploy:deploy]
[TASKS] Skipping maven reporter: there is already a result available.[INFO] Retrieving previous
build number from apache.snapshots.https

Uploading: https://repository.apache.org/content/repositories/snapshots/org/apache/jackrabbit/jackrabbit-spi-commons/2.2-SNAPSHOT/jackrabbit-spi-commons-2.2-20100514.165956-38.jar
707K uploaded
[INFO] Retrieving previous metadata from apache.snapshots.https
[INFO] Uploading repository metadata for: 'artifact org.apache.jackrabbit:jackrabbit-spi-commons'
[INFO] Retrieving previous metadata from apache.snapshots.https
[INFO] Uploading repository metadata for: 'snapshot org.apache.jackrabbit:jackrabbit-spi-commons:2.2-SNAPSHOT'
[INFO] Uploading project information for jackrabbit-spi-commons 2.2-20100514.165956-38
[TASKS] Skipping maven reporter: there is already a result available.[INFO] [bundle:deploy]
[INFO] Remote OBR update disabled (enable with -DremoteOBR)

[TASKS] Skipping maven reporter: there is already a result available.
[HUDSON] Archiving <http://hudson.zones.apache.org/hudson/job/Jackrabbit-trunk/ws/trunk/jackrabbit-spi-commons/pom.xml>
to /export/home/hudson/hudson/jobs/Jackrabbit-trunk/modules/org.apache.jackrabbit$jackrabbit-spi-commons/builds/2010-05-14_16-56-37/archive/org.apache.jackrabbit/jackrabbit-spi-commons/2.2-SNAPSHOT/pom.xml
[HUDSON] Archiving <http://hudson.zones.apache.org/hudson/job/Jackrabbit-trunk/ws/trunk/jackrabbit-spi-commons/target/jackrabbit-spi-commons-2.2-SNAPSHOT.jar>
to /export/home/hudson/hudson/jobs/Jackrabbit-trunk/modules/org.apache.jackrabbit$jackrabbit-spi-commons/builds/2010-05-14_16-56-37/archive/org.apache.jackrabbit/jackrabbit-spi-commons/2.2-20100514.165956-38/jackrabbit-spi-commons-2.2-SNAPSHOT.jar
[INFO] ------------------------------------------------------------------------
[INFO] Building Jackrabbit Core
[INFO]    task-segment: [clean, deploy]
[INFO] ------------------------------------------------------------------------
[INFO] [clean:clean]
[INFO] Deleting file set: <http://hudson.zones.apache.org/hudson/job/Jackrabbit-trunk/ws/trunk/jackrabbit-core/target>
(included: [**], excluded: [])
[TASKS] Scanning folder '<http://hudson.zones.apache.org/hudson/job/Jackrabbit-trunk/ws/trunk/jackrabbit-core/src/main/java'>
for tasks ... 
[TASKS] Found 193.
[TASKS] Scanning folder '<http://hudson.zones.apache.org/hudson/job/Jackrabbit-trunk/ws/trunk/jackrabbit-core/src/test/java'>
for tasks ... 
[TASKS] Found 25.
[TASKS] Scanning folder '<http://hudson.zones.apache.org/hudson/job/Jackrabbit-trunk/ws/trunk/jackrabbit-core/src/main/resources'>
for tasks ... 
[TASKS] Found 0.
[TASKS] Scanning folder '<http://hudson.zones.apache.org/hudson/job/Jackrabbit-trunk/ws/trunk/jackrabbit-core/src/main/resources-filtered'>
for tasks ... 
[TASKS] Found 0.
[TASKS] Scanning folder '<http://hudson.zones.apache.org/hudson/job/Jackrabbit-trunk/ws/trunk/jackrabbit-core/src/test/resources'>
for tasks ... 
[TASKS] Found 0.
[INFO] [remote-resources:process {execution: default}]
[TASKS] Skipping maven reporter: there is already a result available.
[INFO] [resources:resources]
[INFO] Using 'UTF-8' encoding to copy filtered resources.
[INFO] Copying 72 resources
[INFO] Copying 1 resource
[INFO] Copying 3 resources
[INFO] [compiler:compile]
[INFO] Compiling 676 source files to <http://hudson.zones.apache.org/hudson/job/Jackrabbit-trunk/ws/trunk/jackrabbit-core/target/classes>
[TASKS] Skipping maven reporter: there is already a result available.
[TASKS] Skipping maven reporter: there is already a result available.[INFO] [resources:testResources]
[INFO] Using 'UTF-8' encoding to copy filtered resources.
[INFO] Copying 20 resources

[INFO] Copying 3 resources
[TASKS] Skipping maven reporter: there is already a result available.[INFO] [antrun:run {execution:
process-test-resources}]
[INFO] Executing tasks

     [copy] Copying 34 files to <http://hudson.zones.apache.org/hudson/job/Jackrabbit-trunk/ws/trunk/jackrabbit-core/target/repository>
     [copy] Copying 34 files to <http://hudson.zones.apache.org/hudson/job/Jackrabbit-trunk/ws/trunk/jackrabbit-core/target/repository-2>
[INFO] Executed tasks
[TASKS] Skipping maven reporter: there is already a result available.[INFO] [compiler:testCompile]
[INFO] Compiling 284 source files to <http://hudson.zones.apache.org/hudson/job/Jackrabbit-trunk/ws/trunk/jackrabbit-core/target/test-classes>

[TASKS] Skipping maven reporter: there is already a result available.
[HUDSON] Archiving <http://hudson.zones.apache.org/hudson/job/Jackrabbit-trunk/ws/trunk/jackrabbit-core/pom.xml>
to /export/home/hudson/hudson/jobs/Jackrabbit-trunk/modules/org.apache.jackrabbit$jackrabbit-core/builds/2010-05-14_16-56-37/archive/org.apache.jackrabbit/jackrabbit-core/2.2-SNAPSHOT/pom.xml
[INFO] ------------------------------------------------------------------------
[ERROR] BUILD FAILURE
[INFO] ------------------------------------------------------------------------
[INFO] Compilation failure
Failure executing javac, but could not parse the error:
An exception has occurred in the compiler (1.5.0_14). Please file a bug at the Java Developer
Connection (http://java.sun.com/webapps/bugreport)  after checking the Bug Parade for duplicates.
Include your program and the following diagnostic in your report.  Thank you.
java.lang.AssertionError: {unused}
	at com.sun.tools.javac.tree.TreeMaker$AnnotationBuilder.visitArray(TreeMaker.java:634)
	at com.sun.tools.javac.code.Attribute$Array.accept(Attribute.java:124)
	at com.sun.tools.javac.tree.TreeMaker$AnnotationBuilder.translate(TreeMaker.java:637)
	at com.sun.tools.javac.tree.TreeMaker$AnnotationBuilder.visitCompoundInternal(TreeMaker.java:628)
	at com.sun.tools.javac.tree.TreeMaker$AnnotationBuilder.translate(TreeMaker.java:641)
	at com.sun.tools.javac.tree.TreeMaker.Annotation(TreeMaker.java:649)
	at com.sun.tools.javac.tree.TreeMaker.Annotations(TreeMaker.java:570)
	at com.sun.tools.javac.tree.TreeMaker.VarDef(TreeMaker.java:554)
	at com.sun.tools.javac.comp.Lower.visitIterableForeachLoop(Lower.java:2892)
	at com.sun.tools.javac.comp.Lower.visitForeachLoop(Lower.java:2755)
	at com.sun.tools.javac.tree.Tree$ForeachLoop.accept(Tree.java:597)
	at com.sun.tools.javac.comp.Lower.translate(Lower.java:1881)
	at com.sun.tools.javac.tree.TreeTranslator.translate(TreeTranslator.java:54)
	at com.sun.tools.javac.tree.TreeTranslator.visitBlock(TreeTranslator.java:145)
	at com.sun.tools.javac.comp.Lower.visitBlock(Lower.java:2927)
	at com.sun.tools.javac.tree.Tree$Block.accept(Tree.java:535)
	at com.sun.tools.javac.comp.Lower.translate(Lower.java:1881)
	at com.sun.tools.javac.tree.TreeTranslator.visitTry(TreeTranslator.java:200)
	at com.sun.tools.javac.tree.Tree$Try.accept(Tree.java:669)
	at com.sun.tools.javac.comp.Lower.translate(Lower.java:1881)
	at com.sun.tools.javac.tree.TreeTranslator.translate(TreeTranslator.java:54)
	at com.sun.tools.javac.tree.TreeTranslator.visitBlock(TreeTranslator.java:145)
	at com.sun.tools.javac.comp.Lower.visitBlock(Lower.java:2927)
	at com.sun.tools.javac.tree.Tree$Block.accept(Tree.java:535)
	at com.sun.tools.javac.comp.Lower.translate(Lower.java:1881)
	at com.sun.tools.javac.tree.TreeTranslator.visitMethodDef(TreeTranslator.java:129)
	at com.sun.tools.javac.comp.Lower.visitMethodDefInternal(Lower.java:2267)
	at com.sun.tools.javac.comp.Lower.visitMethodDef(Lower.java:2186)
	at com.sun.tools.javac.tree.Tree$MethodDef.accept(Tree.java:478)
	at com.sun.tools.javac.comp.Lower.translate(Lower.java:1881)
	at com.sun.tools.javac.comp.Lower.visitClassDef(Lower.java:1989)
	at com.sun.tools.javac.tree.Tree$ClassDef.accept(Tree.java:434)
	at com.sun.tools.javac.comp.Lower.translate(Lower.java:1881)
	at com.sun.tools.javac.comp.Lower.translate(Lower.java:1901)
	at com.sun.tools.javac.comp.Lower.translateTopLevelClass(Lower.java:3064)
	at com.sun.tools.javac.main.JavaCompiler.compile(JavaCompiler.java:487)
	at com.sun.tools.javac.main.Main.compile(Main.java:592)
	at com.sun.tools.javac.main.Main.compile(Main.java:544)
	at com.sun.tools.javac.Main.compile(Main.java:85)
	at sun.reflect.NativeMethodAccessorImpl.invoke0(Native Method)
	at sun.reflect.NativeMethodAccessorImpl.invoke(NativeMethodAccessorImpl.java:39)
	at sun.reflect.DelegatingMethodAccessorImpl.invoke(DelegatingMethodAccessorImpl.java:25)
	at java.lang.reflect.Method.invoke(Method.java:585)
	at org.codehaus.plexus.compiler.javac.JavacCompiler.compileInProcess(JavacCompiler.java:420)
	at org.codehaus.plexus.compiler.javac.JavacCompiler.compile(JavacCompiler.java:141)
	at org.apache.maven.plugin.AbstractCompilerMojo.execute(AbstractCompilerMojo.java:493)
	at org.apache.maven.plugin.TestCompilerMojo.execute(TestCompilerMojo.java:102)
	at org.apache.maven.plugin.DefaultPluginManager.executeMojo(DefaultPluginManager.java:451)
	at hudson.maven.agent.PluginManagerInterceptor.executeMojo(PluginManagerInterceptor.java:182)
	at org.apache.maven.lifecycle.DefaultLifecycleExecutor.executeGoals(DefaultLifecycleExecutor.java:558)
	at org.apache.maven.lifecycle.DefaultLifecycleExecutor.executeGoalWithLifecycle(DefaultLifecycleExecutor.java:499)
	at org.apache.maven.lifecycle.DefaultLifecycleExecutor.executeGoal(DefaultLifecycleExecutor.java:478)
	at org.apache.maven.lifecycle.DefaultLifecycleExecutor.executeGoalAndHandleFailures(DefaultLifecycleExecutor.java:330)
	at org.apache.maven.lifecycle.DefaultLifecycleExecutor.executeTaskSegments(DefaultLifecycleExecutor.java:291)
	at org.apache.maven.lifecycle.DefaultLifecycleExecutor.execute(DefaultLifecycleExecutor.java:142)
	at org.apache.maven.lifecycle.LifecycleExecutorInterceptor.execute(LifecycleExecutorInterceptor.java:65)
	at org.apache.maven.DefaultMaven.doExecute(DefaultMaven.java:336)
	at org.apache.maven.DefaultMaven.execute(DefaultMaven.java:129)
	at org.apache.maven.cli.MavenCli.main(MavenCli.java:287)
	at sun.reflect.NativeMethodAccessorImpl.invoke0(Native Method)
	at sun.reflect.NativeMethodAccessorImpl.invoke(NativeMethodAccessorImpl.java:39)
	at sun.reflect.DelegatingMethodAccessorImpl.invoke(DelegatingMethodAccessorImpl.java:25)
	at java.lang.reflect.Method.invoke(Method.java:585)
	at org.codehaus.classworlds.Launcher.launchEnhanced(Launcher.java:315)
	at org.codehaus.classworlds.Launcher.launch(Launcher.java:255)
	at hudson.maven.agent.Main.launch(Main.java:165)
	at hudson.maven.MavenBuilder.call(MavenBuilder.java:159)
	at hudson.maven.MavenModuleSetBuild$Builder.call(MavenModuleSetBuild.java:688)
	at hudson.maven.MavenModuleSetBuild$Builder.call(MavenModuleSetBuild.java:632)
	at hudson.remoting.UserRequest.perform(UserRequest.java:114)
	at hudson.remoting.UserRequest.perform(UserRequest.java:48)
	at hudson.remoting.Request$2.run(Request.java:270)
	at java.util.concurrent.Executors$RunnableAdapter.call(Executors.java:417)
	at java.util.concurrent.FutureTask$Sync.innerRun(FutureTask.java:269)
	at java.util.concurrent.FutureTask.run(FutureTask.java:123)
	at java.util.concurrent.ThreadPoolExecutor$Worker.runTask(ThreadPoolExecutor.java:650)
	at java.util.concurrent.ThreadPoolExecutor$Worker.run(ThreadPoolExecutor.java:675)
	at java.lang.Thread.run(Thread.java:595)



Failure executing javac, but could not parse the error:
An exception has occurred in the compiler (1.5.0_14). Please file a bug at the Java Developer
Connection (http://java.sun.com/webapps/bugreport)  after checking the Bug Parade for duplicates.
Include your program and the following diagnostic in your report.  Thank you.
java.lang.AssertionError: {unused}
	at com.sun.tools.javac.tree.TreeMaker$AnnotationBuilder.visitArray(TreeMaker.java:634)
	at com.sun.tools.javac.code.Attribute$Array.accept(Attribute.java:124)
	at com.sun.tools.javac.tree.TreeMaker$AnnotationBuilder.translate(TreeMaker.java:637)
	at com.sun.tools.javac.tree.TreeMaker$AnnotationBuilder.visitCompoundInternal(TreeMaker.java:628)
	at com.sun.tools.javac.tree.TreeMaker$AnnotationBuilder.translate(TreeMaker.java:641)
	at com.sun.tools.javac.tree.TreeMaker.Annotation(TreeMaker.java:649)
	at com.sun.tools.javac.tree.TreeMaker.Annotations(TreeMaker.java:570)
	at com.sun.tools.javac.tree.TreeMaker.VarDef(TreeMaker.java:554)
	at com.sun.tools.javac.comp.Lower.visitIterableForeachLoop(Lower.java:2892)
	at com.sun.tools.javac.comp.Lower.visitForeachLoop(Lower.java:2755)
	at com.sun.tools.javac.tree.Tree$ForeachLoop.accept(Tree.java:597)
	at com.sun.tools.javac.comp.Lower.translate(Lower.java:1881)
	at com.sun.tools.javac.tree.TreeTranslator.translate(TreeTranslator.java:54)
	at com.sun.tools.javac.tree.TreeTranslator.visitBlock(TreeTranslator.java:145)
	at com.sun.tools.javac.comp.Lower.visitBlock(Lower.java:2927)
	at com.sun.tools.javac.tree.Tree$Block.accept(Tree.java:535)
	at com.sun.tools.javac.comp.Lower.translate(Lower.java:1881)
	at com.sun.tools.javac.tree.TreeTranslator.visitTry(TreeTranslator.java:200)
	at com.sun.tools.javac.tree.Tree$Try.accept(Tree.java:669)
	at com.sun.tools.javac.comp.Lower.translate(Lower.java:1881)
	at com.sun.tools.javac.tree.TreeTranslator.translate(TreeTranslator.java:54)
	at com.sun.tools.javac.tree.TreeTranslator.visitBlock(TreeTranslator.java:145)
	at com.sun.tools.javac.comp.Lower.visitBlock(Lower.java:2927)
	at com.sun.tools.javac.tree.Tree$Block.accept(Tree.java:535)
	at com.sun.tools.javac.comp.Lower.translate(Lower.java:1881)
	at com.sun.tools.javac.tree.TreeTranslator.visitMethodDef(TreeTranslator.java:129)
	at com.sun.tools.javac.comp.Lower.visitMethodDefInternal(Lower.java:2267)
	at com.sun.tools.javac.comp.Lower.visitMethodDef(Lower.java:2186)
	at com.sun.tools.javac.tree.Tree$MethodDef.accept(Tree.java:478)
	at com.sun.tools.javac.comp.Lower.translate(Lower.java:1881)
	at com.sun.tools.javac.comp.Lower.visitClassDef(Lower.java:1989)
	at com.sun.tools.javac.tree.Tree$ClassDef.accept(Tree.java:434)
	at com.sun.tools.javac.comp.Lower.translate(Lower.java:1881)
	at com.sun.tools.javac.comp.Lower.translate(Lower.java:1901)
	at com.sun.tools.javac.comp.Lower.translateTopLevelClass(Lower.java:3064)
	at com.sun.tools.javac.main.JavaCompiler.compile(JavaCompiler.java:487)
	at com.sun.tools.javac.main.Main.compile(Main.java:592)
	at com.sun.tools.javac.main.Main.compile(Main.java:544)
	at com.sun.tools.javac.Main.compile(Main.java:85)
	at sun.reflect.NativeMethodAccessorImpl.invoke0(Native Method)
	at sun.reflect.NativeMethodAccessorImpl.invoke(NativeMethodAccessorImpl.java:39)
	at sun.reflect.DelegatingMethodAccessorImpl.invoke(DelegatingMethodAccessorImpl.java:25)
	at java.lang.reflect.Method.invoke(Method.java:585)
	at org.codehaus.plexus.compiler.javac.JavacCompiler.compileInProcess(JavacCompiler.java:420)
	at org.codehaus.plexus.compiler.javac.JavacCompiler.compile(JavacCompiler.java:141)
	at org.apache.maven.plugin.AbstractCompilerMojo.execute(AbstractCompilerMojo.java:493)
	at org.apache.maven.plugin.TestCompilerMojo.execute(TestCompilerMojo.java:102)
	at org.apache.maven.plugin.DefaultPluginManager.executeMojo(DefaultPluginManager.java:451)
	at hudson.maven.agent.PluginManagerInterceptor.executeMojo(PluginManagerInterceptor.java:182)
	at org.apache.maven.lifecycle.DefaultLifecycleExecutor.executeGoals(DefaultLifecycleExecutor.java:558)
	at org.apache.maven.lifecycle.DefaultLifecycleExecutor.executeGoalWithLifecycle(DefaultLifecycleExecutor.java:499)
	at org.apache.maven.lifecycle.DefaultLifecycleExecutor.executeGoal(DefaultLifecycleExecutor.java:478)
	at org.apache.maven.lifecycle.DefaultLifecycleExecutor.executeGoalAndHandleFailures(DefaultLifecycleExecutor.java:330)
	at org.apache.maven.lifecycle.DefaultLifecycleExecutor.executeTaskSegments(DefaultLifecycleExecutor.java:291)
	at org.apache.maven.lifecycle.DefaultLifecycleExecutor.execute(DefaultLifecycleExecutor.java:142)
	at org.apache.maven.lifecycle.LifecycleExecutorInterceptor.execute(LifecycleExecutorInterceptor.java:65)
	at org.apache.maven.DefaultMaven.doExecute(DefaultMaven.java:336)
	at org.apache.maven.DefaultMaven.execute(DefaultMaven.java:129)
	at org.apache.maven.cli.MavenCli.main(MavenCli.java:287)
	at sun.reflect.NativeMethodAccessorImpl.invoke0(Native Method)
	at sun.reflect.NativeMethodAccessorImpl.invoke(NativeMethodAccessorImpl.java:39)
	at sun.reflect.DelegatingMethodAccessorImpl.invoke(DelegatingMethodAccessorImpl.java:25)
	at java.lang.reflect.Method.invoke(Method.java:585)
	at org.codehaus.classworlds.Launcher.launchEnhanced(Launcher.java:315)
	at org.codehaus.classworlds.Launcher.launch(Launcher.java:255)
	at hudson.maven.agent.Main.launch(Main.java:165)
	at hudson.maven.MavenBuilder.call(MavenBuilder.java:159)
	at hudson.maven.MavenModuleSetBuild$Builder.call(MavenModuleSetBuild.java:688)
	at hudson.maven.MavenModuleSetBuild$Builder.call(MavenModuleSetBuild.java:632)
	at hudson.remoting.UserRequest.perform(UserRequest.java:114)
	at hudson.remoting.UserRequest.perform(UserRequest.java:48)
	at hudson.remoting.Request$2.run(Request.java:270)
	at java.util.concurrent.Executors$RunnableAdapter.call(Executors.java:417)
	at java.util.concurrent.FutureTask$Sync.innerRun(FutureTask.java:269)
	at java.util.concurrent.FutureTask.run(FutureTask.java:123)
	at java.util.concurrent.ThreadPoolExecutor$Worker.runTask(ThreadPoolExecutor.java:650)
	at java.util.concurrent.ThreadPoolExecutor$Worker.run(ThreadPoolExecutor.java:675)
	at java.lang.Thread.run(Thread.java:595)


[INFO] ------------------------------------------------------------------------
[INFO] For more information, run Maven with the -e switch
[INFO] ------------------------------------------------------------------------
[INFO] Total time: 19 minutes 19 seconds
[INFO] Finished at: Fri May 14 17:17:50 GMT+00:00 2010
[INFO] Final Memory: 67M/312M
[INFO] ------------------------------------------------------------------------
Sending e-mails to: dev@jackrabbit.apache.org
channel stopped
[locks-and-latches] Releasing all the locks
[locks-and-latches] All the locks released


Mime
View raw message