jackrabbit-dev mailing list archives

Site index · List index
Message view « Date » · « Thread »
Top « Date » · « Thread »
From Apache Hudson Server <hud...@hudson.zones.apache.org>
Subject Build failed in Hudson: Jackrabbit-trunk-tests-java14 #436
Date Tue, 13 Apr 2010 15:44:16 GMT
See <http://hudson.zones.apache.org/hudson/job/Jackrabbit-trunk-tests-java14/436/>

------------------------------------------
[...truncated 212 lines...]
AU        src/main/java/org/apache/jackrabbit/test/api/SessionTest.java
AU        src/main/java/org/apache/jackrabbit/test/api/SetValueDoubleTest.java
AU        src/main/java/org/apache/jackrabbit/test/api/AbstractWorkspaceReferenceableTest.java
AU        src/main/java/org/apache/jackrabbit/test/api/NamePropertyTest.java
AU        src/main/java/org/apache/jackrabbit/test/api/WorkspaceMoveTest.java
AU        src/main/java/org/apache/jackrabbit/test/api/ImpersonateTest.java
AU        src/main/java/org/apache/jackrabbit/test/api/SetPropertyStringTest.java
AU        src/main/java/org/apache/jackrabbit/test/api/SetValueBooleanTest.java
AU        src/main/java/org/apache/jackrabbit/test/api/WorkspaceCopyTest.java
AU        src/main/java/org/apache/jackrabbit/test/api/SetPropertyInputStreamTest.java
AU        src/main/java/org/apache/jackrabbit/test/api/ShareableNodeTest.java
AU        src/main/java/org/apache/jackrabbit/test/api/EscapeJCRUtil.java
AU        src/main/java/org/apache/jackrabbit/test/api/SetPropertyValueTest.java
AU        src/main/java/org/apache/jackrabbit/test/api/NodeIteratorTest.java
AU        src/main/java/org/apache/jackrabbit/test/api/WorkspaceCopyBetweenWorkspacesVersionableTest.java
AU        src/main/java/org/apache/jackrabbit/test/api/PropertyItemIsModifiedTest.java
AU        src/main/java/org/apache/jackrabbit/test/api/SysViewContentHandler.java
AU        src/main/java/org/apache/jackrabbit/test/api/SessionReadMethodsTest.java
AU        src/main/java/org/apache/jackrabbit/test/api/NodeReadMethodsTest.java
AU        src/main/java/org/apache/jackrabbit/test/api/NamespaceRegistryReadMethodsTest.java
A         src/main/java/org/apache/jackrabbit/test/api/version
AU        src/main/java/org/apache/jackrabbit/test/api/version/SessionMoveVersionExceptionTest.java
AU        src/main/java/org/apache/jackrabbit/test/api/version/GetPredecessorsTest.java
AU        src/main/java/org/apache/jackrabbit/test/api/version/ActivitiesTest.java
AU        src/main/java/org/apache/jackrabbit/test/api/version/MergeNodeTest.java
AU        src/main/java/org/apache/jackrabbit/test/api/version/CheckoutTest.java
AU        src/main/java/org/apache/jackrabbit/test/api/version/GetCreatedTest.java
AU        src/main/java/org/apache/jackrabbit/test/api/version/VersionGraphTest.java
AU        src/main/java/org/apache/jackrabbit/test/api/version/TestAll.java
AU        src/main/java/org/apache/jackrabbit/test/api/version/FrozenNodeTest.java
A         src/main/java/org/apache/jackrabbit/test/api/version/simple
AU        src/main/java/org/apache/jackrabbit/test/api/version/simple/BasicTest.java
AU        src/main/java/org/apache/jackrabbit/test/api/version/simple/RestoreTest.java
AU        src/main/java/org/apache/jackrabbit/test/api/version/simple/CheckinTest.java
AU        src/main/java/org/apache/jackrabbit/test/api/version/simple/CheckoutTest.java
AU        src/main/java/org/apache/jackrabbit/test/api/version/simple/TestAll.java
AU        src/main/java/org/apache/jackrabbit/test/api/version/simple/AbstractVersionTest.java
AU        src/main/java/org/apache/jackrabbit/test/api/version/simple/FrozenNodeTest.java
AU        src/main/java/org/apache/jackrabbit/test/api/version/simple/CopyTest.java
AU        src/main/java/org/apache/jackrabbit/test/api/version/MergeActivityTest.java
AU        src/main/java/org/apache/jackrabbit/test/api/version/OnParentVersionInitializeTest.java
AU        src/main/java/org/apache/jackrabbit/test/api/version/MergeCheckedoutSubNodeTest.java
AU        src/main/java/org/apache/jackrabbit/test/api/version/MergeSubNodeTest.java
AU        src/main/java/org/apache/jackrabbit/test/api/version/MergeNodeIteratorTest.java
AU        src/main/java/org/apache/jackrabbit/test/api/version/AbstractMergeTest.java
AU        src/main/java/org/apache/jackrabbit/test/api/version/RestoreTest.java
AU        src/main/java/org/apache/jackrabbit/test/api/version/VersionTest.java
AU        src/main/java/org/apache/jackrabbit/test/api/version/OnParentVersionComputeTest.java
AU        src/main/java/org/apache/jackrabbit/test/api/version/ConfigurationsTest.java
AU        src/main/java/org/apache/jackrabbit/test/api/version/GetVersionableUUIDTest.java
AU        src/main/java/org/apache/jackrabbit/test/api/version/OnParentVersionIgnoreTest.java
AU        src/main/java/org/apache/jackrabbit/test/api/version/WorkspaceRestoreTest.java
AU        src/main/java/org/apache/jackrabbit/test/api/version/RemoveVersionTest.java
AU        src/main/java/org/apache/jackrabbit/test/api/version/CheckinTest.java
AU        src/main/java/org/apache/jackrabbit/test/api/version/VersionHistoryTest.java
AU        src/main/java/org/apache/jackrabbit/test/api/version/AbstractVersionTest.java
AU        src/main/java/org/apache/jackrabbit/test/api/version/WorkspaceMoveVersionExceptionTest.java
AU        src/main/java/org/apache/jackrabbit/test/api/version/VersionStorageTest.java
AU        src/main/java/org/apache/jackrabbit/test/api/version/CopyTest.java
AU        src/main/java/org/apache/jackrabbit/test/api/version/GetContainingHistoryTest.java
AU        src/main/java/org/apache/jackrabbit/test/api/version/AbstractOnParentVersionTest.java
AU        src/main/java/org/apache/jackrabbit/test/api/version/OnParentVersionAbortTest.java
AU        src/main/java/org/apache/jackrabbit/test/api/version/MergeNonVersionableSubNodeTest.java
AU        src/main/java/org/apache/jackrabbit/test/api/version/MergeDoneMergeTest.java
AU        src/main/java/org/apache/jackrabbit/test/api/version/MergeCancelMergeTest.java
AU        src/main/java/org/apache/jackrabbit/test/api/version/VersionLabelTest.java
AU        src/main/java/org/apache/jackrabbit/test/api/version/OnParentVersionCopyTest.java
AU        src/main/java/org/apache/jackrabbit/test/api/version/GetReferencesNodeTest.java
AU        src/main/java/org/apache/jackrabbit/test/api/version/MergeShallowTest.java
AU        src/main/java/org/apache/jackrabbit/test/api/SetPropertyNodeTest.java
AU        src/main/java/org/apache/jackrabbit/test/api/RepositoryFactoryTest.java
AU        src/main/java/org/apache/jackrabbit/test/api/AbstractPropertyTest.java
AU        src/main/java/org/apache/jackrabbit/test/api/PropertyItemIsNewTest.java
AU        src/main/java/org/apache/jackrabbit/test/api/WorkspaceCloneVersionableTest.java
A         src/main/java/org/apache/jackrabbit/test/api/observation
AU        src/main/java/org/apache/jackrabbit/test/api/observation/AddEventListenerTest.java
AU        src/main/java/org/apache/jackrabbit/test/api/observation/PropertyRemovedTest.java
AU        src/main/java/org/apache/jackrabbit/test/api/observation/PropertyAddedTest.java
AU        src/main/java/org/apache/jackrabbit/test/api/observation/NodeAddedTest.java
AU        src/main/java/org/apache/jackrabbit/test/api/observation/NodeRemovedTest.java
AU        src/main/java/org/apache/jackrabbit/test/api/observation/TestAll.java
AU        src/main/java/org/apache/jackrabbit/test/api/observation/GetUserDataTest.java
AU        src/main/java/org/apache/jackrabbit/test/api/observation/NodeReorderTest.java
AU        src/main/java/org/apache/jackrabbit/test/api/observation/EventJournalTest.java
AU        src/main/java/org/apache/jackrabbit/test/api/observation/GetDateTest.java
AU        src/main/java/org/apache/jackrabbit/test/api/observation/WorkspaceOperationTest.java
AU        src/main/java/org/apache/jackrabbit/test/api/observation/AbstractObservationTest.java
AU        src/main/java/org/apache/jackrabbit/test/api/observation/EventResult.java
AU        src/main/java/org/apache/jackrabbit/test/api/observation/NodeMovedTest.java
AU        src/main/java/org/apache/jackrabbit/test/api/observation/EventTest.java
AU        src/main/java/org/apache/jackrabbit/test/api/observation/GetIdentifierTest.java
AU        src/main/java/org/apache/jackrabbit/test/api/observation/LockingTest.java
AU        src/main/java/org/apache/jackrabbit/test/api/observation/GetRegisteredEventListenersTest.java
AU        src/main/java/org/apache/jackrabbit/test/api/observation/GetInfoTest.java
AU        src/main/java/org/apache/jackrabbit/test/api/observation/EventIteratorTest.java
AU        src/main/java/org/apache/jackrabbit/test/api/observation/PropertyChangedTest.java
AU        src/main/java/org/apache/jackrabbit/test/api/NodeUUIDTest.java
AU        src/main/java/org/apache/jackrabbit/test/api/AbstractWorkspaceVersionableTest.java
AU        src/main/java/org/apache/jackrabbit/test/api/RepositoryDescriptorTest.java
AU        src/main/java/org/apache/jackrabbit/test/api/SetPropertyDecimalTest.java
AU        src/main/java/org/apache/jackrabbit/test/api/WorkspaceCloneTest.java
AU        src/main/java/org/apache/jackrabbit/test/api/SerializationContext.java
AU        src/main/java/org/apache/jackrabbit/test/api/Base64.java
AU        src/main/java/org/apache/jackrabbit/test/api/SetValueDateTest.java
AU        src/main/java/org/apache/jackrabbit/test/api/TreeComparator.java
A         src/main/java/org/apache/jackrabbit/test/api/retention
AU        src/main/java/org/apache/jackrabbit/test/api/retention/HoldEffectTest.java
AU        src/main/java/org/apache/jackrabbit/test/api/retention/RetentionPolicyEffectTest.java
AU        src/main/java/org/apache/jackrabbit/test/api/retention/HoldTest.java
AU        src/main/java/org/apache/jackrabbit/test/api/retention/RetentionPolicyTest.java
AU        src/main/java/org/apache/jackrabbit/test/api/retention/TestAll.java
AU        src/main/java/org/apache/jackrabbit/test/api/retention/AbstractRetentionTest.java
AU        src/main/java/org/apache/jackrabbit/test/api/SetPropertyDoubleTest.java
AU        src/main/java/org/apache/jackrabbit/test/api/WorkspaceCopyBetweenWorkspacesSameNameSibsTest.java
AU        src/main/java/org/apache/jackrabbit/test/api/AddNodeTest.java
AU        src/main/java/org/apache/jackrabbit/test/api/WorkspaceTest.java
AU        src/main/java/org/apache/jackrabbit/test/JUnitTest.java
AU        src/main/java/org/apache/jackrabbit/test/LogPrintWriter.java
AU        src/main/java/org/apache/jackrabbit/test/RepositoryHelperPoolImpl.java
AU        src/main/java/org/apache/jackrabbit/test/ConcurrentTestSuite.java
AU        src/main/java/org/apache/jackrabbit/test/RepositoryStubException.java
AU        src/main/java/org/apache/jackrabbit/test/XMLChar.java
A         src/main/appended-resources
A         src/main/appended-resources/META-INF
AU        src/main/appended-resources/META-INF/NOTICE
A         src/main/resources
A         src/main/resources/org
A         src/main/resources/org/apache
A         src/main/resources/org/apache/jackrabbit
A         src/main/resources/org/apache/jackrabbit/test
A         src/main/resources/org/apache/jackrabbit/test/api
A         src/main/resources/org/apache/jackrabbit/test/api/nodetype
A         src/main/resources/org/apache/jackrabbit/test/api/nodetype/spec
AU        src/main/resources/org/apache/jackrabbit/test/api/nodetype/spec/mix-created.txt
AU        src/main/resources/org/apache/jackrabbit/test/api/nodetype/spec/nt-hierarchyNode.txt
AU        src/main/resources/org/apache/jackrabbit/test/api/nodetype/spec/nt-version.txt
AU        src/main/resources/org/apache/jackrabbit/test/api/nodetype/spec/mix-versionable.txt
AU        src/main/resources/org/apache/jackrabbit/test/api/nodetype/spec/nt-address.txt
AU        src/main/resources/org/apache/jackrabbit/test/api/nodetype/spec/nt-resource.txt
AU        src/main/resources/org/apache/jackrabbit/test/api/nodetype/spec/nt-nodeType.txt
AU        src/main/resources/org/apache/jackrabbit/test/api/nodetype/spec/mix-lockable.txt
AU        src/main/resources/org/apache/jackrabbit/test/api/nodetype/spec/mix-etag.txt
AU        src/main/resources/org/apache/jackrabbit/test/api/nodetype/spec/nt-activity.txt
AU        src/main/resources/org/apache/jackrabbit/test/api/nodetype/spec/nt-propertyDefinition.txt
AU        src/main/resources/org/apache/jackrabbit/test/api/nodetype/spec/mix-title.txt
AU        src/main/resources/org/apache/jackrabbit/test/api/nodetype/spec/mix-referenceable.txt
AU        src/main/resources/org/apache/jackrabbit/test/api/nodetype/spec/mix-language.txt
AU        src/main/resources/org/apache/jackrabbit/test/api/nodetype/spec/mix-simpleVersionable.txt
AU        src/main/resources/org/apache/jackrabbit/test/api/nodetype/spec/nt-childNodeDefinition.txt
AU        src/main/resources/org/apache/jackrabbit/test/api/nodetype/spec/mix-shareable.txt
AU        src/main/resources/org/apache/jackrabbit/test/api/nodetype/spec/nt-versionedChild.txt
AU        src/main/resources/org/apache/jackrabbit/test/api/nodetype/spec/mix-mimeType.txt
AU        src/main/resources/org/apache/jackrabbit/test/api/nodetype/spec/nt-query.txt
AU        src/main/resources/org/apache/jackrabbit/test/api/nodetype/spec/nt-linkedFile.txt
AU        src/main/resources/org/apache/jackrabbit/test/api/nodetype/spec/nt-configuration.txt
AU        src/main/resources/org/apache/jackrabbit/test/api/nodetype/spec/nt-unstructured.txt
AU        src/main/resources/org/apache/jackrabbit/test/api/nodetype/spec/nt-versionHistory.txt
AU        src/main/resources/org/apache/jackrabbit/test/api/nodetype/spec/nt-versionLabels.txt
AU        src/main/resources/org/apache/jackrabbit/test/api/nodetype/spec/nt-frozenNode.txt
AU        src/main/resources/org/apache/jackrabbit/test/api/nodetype/spec/nt-base.txt
AU        src/main/resources/org/apache/jackrabbit/test/api/nodetype/spec/mix-lifecycle.txt
AU        src/main/resources/org/apache/jackrabbit/test/api/nodetype/spec/nt-folder.txt
AU        src/main/resources/org/apache/jackrabbit/test/api/nodetype/spec/nt-file.txt
AU        src/main/resources/org/apache/jackrabbit/test/api/nodetype/spec/mix-lastModified.txt
AU        pom.xml
AU        README.txt
 U        .
At revision 933686
no change for http://svn.apache.org/repos/asf/jackrabbit/trunk/jackrabbit-jcr-tests since
the previous build
[locks-and-latches] Checking to see if we really have the locks
[locks-and-latches] Have all the locks, build can start
[Jackrabbit-trunk-tests-java14] $ /bin/bash -xe /tmp/hudson5609329069352087638.sh
+ cd jackrabbit-jcr-tests
+ MAVEN_OPTS=-Xmx128m
+ /home/hudson/tools/maven/apache-maven-2.0.9/bin/mvn clean install
[INFO] Scanning for projects...
[INFO] ------------------------------------------------------------------------
[ERROR] FATAL ERROR
[INFO] ------------------------------------------------------------------------
[INFO] Failed to resolve artifact.

GroupId: org.apache.jackrabbit
ArtifactId: jackrabbit-parent
Version: 2.2-SNAPSHOT

Reason: Unable to download the artifact from any repository

  org.apache.jackrabbit:jackrabbit-parent:pom:2.2-SNAPSHOT

from the specified remote repositories:
  central (http://repo1.maven.org/maven2)


[INFO] ------------------------------------------------------------------------
[INFO] Trace
org.apache.maven.reactor.MavenExecutionException: Cannot find parent: org.apache.jackrabbit:jackrabbit-parent
for project: null:jackrabbit-jcr-tests:jar:null for project null:jackrabbit-jcr-tests:jar:null
	at org.apache.maven.DefaultMaven.getProjects(DefaultMaven.java:378)
	at org.apache.maven.DefaultMaven.doExecute(DefaultMaven.java:292)
	at org.apache.maven.DefaultMaven.execute(DefaultMaven.java:129)
	at org.apache.maven.cli.MavenCli.main(MavenCli.java:287)
	at sun.reflect.NativeMethodAccessorImpl.invoke0(Native Method)
	at sun.reflect.NativeMethodAccessorImpl.invoke(NativeMethodAccessorImpl.java:39)
	at sun.reflect.DelegatingMethodAccessorImpl.invoke(DelegatingMethodAccessorImpl.java:25)
	at java.lang.reflect.Method.invoke(Method.java:324)
	at org.codehaus.classworlds.Launcher.launchEnhanced(Launcher.java:315)
	at org.codehaus.classworlds.Launcher.launch(Launcher.java:255)
	at org.codehaus.classworlds.Launcher.mainWithExitCode(Launcher.java:430)
	at org.codehaus.classworlds.Launcher.main(Launcher.java:375)
Caused by: org.apache.maven.project.ProjectBuildingException: Cannot find parent: org.apache.jackrabbit:jackrabbit-parent
for project: null:jackrabbit-jcr-tests:jar:null for project null:jackrabbit-jcr-tests:jar:null
	at org.apache.maven.project.DefaultMavenProjectBuilder.assembleLineage(DefaultMavenProjectBuilder.java:1370)
	at org.apache.maven.project.DefaultMavenProjectBuilder.buildInternal(DefaultMavenProjectBuilder.java:821)
	at org.apache.maven.project.DefaultMavenProjectBuilder.buildFromSourceFileInternal(DefaultMavenProjectBuilder.java:506)
	at org.apache.maven.project.DefaultMavenProjectBuilder.build(DefaultMavenProjectBuilder.java:198)
	at org.apache.maven.DefaultMaven.getProject(DefaultMaven.java:583)
	at org.apache.maven.DefaultMaven.collectProjects(DefaultMaven.java:461)
	at org.apache.maven.DefaultMaven.getProjects(DefaultMaven.java:365)
	... 11 more
Caused by: org.apache.maven.project.ProjectBuildingException: POM 'org.apache.jackrabbit:jackrabbit-parent'
not found in repository: Unable to download the artifact from any repository

  org.apache.jackrabbit:jackrabbit-parent:pom:2.2-SNAPSHOT

from the specified remote repositories:
  central (http://repo1.maven.org/maven2)
 for project org.apache.jackrabbit:jackrabbit-parent
	at org.apache.maven.project.DefaultMavenProjectBuilder.findModelFromRepository(DefaultMavenProjectBuilder.java:603)
	at org.apache.maven.project.DefaultMavenProjectBuilder.assembleLineage(DefaultMavenProjectBuilder.java:1366)
	... 17 more
Caused by: org.apache.maven.artifact.resolver.ArtifactNotFoundException: Unable to download
the artifact from any repository

  org.apache.jackrabbit:jackrabbit-parent:pom:2.2-SNAPSHOT

from the specified remote repositories:
  central (http://repo1.maven.org/maven2)

	at org.apache.maven.artifact.resolver.DefaultArtifactResolver.resolve(DefaultArtifactResolver.java:212)
	at org.apache.maven.artifact.resolver.DefaultArtifactResolver.resolve(DefaultArtifactResolver.java:74)
	at org.apache.maven.project.DefaultMavenProjectBuilder.findModelFromRepository(DefaultMavenProjectBuilder.java:556)
	... 18 more
Caused by: org.apache.maven.wagon.ResourceDoesNotExistException: Unable to download the artifact
from any repository
	at org.apache.maven.artifact.manager.DefaultWagonManager.getArtifact(DefaultWagonManager.java:331)
	at org.apache.maven.artifact.resolver.DefaultArtifactResolver.resolve(DefaultArtifactResolver.java:200)
	... 20 more
[INFO] ------------------------------------------------------------------------
[INFO] Total time: < 1 second
[INFO] Finished at: Tue Apr 13 15:44:15 UTC 2010
[INFO] Final Memory: 1M/2M
[INFO] ------------------------------------------------------------------------
[locks-and-latches] Releasing all the locks
[locks-and-latches] All the locks released


Mime
View raw message