jackrabbit-dev mailing list archives

Site index · List index
Message view « Date » · « Thread »
Top « Date » · « Thread »
From Apache Hudson Server <hud...@hudson.zones.apache.org>
Subject Build failed in Hudson: Jackrabbit-trunk-tests-java14 #339
Date Thu, 17 Dec 2009 09:21:09 GMT
See <http://hudson.zones.apache.org/hudson/job/Jackrabbit-trunk-tests-java14/339/changes>

Changes:

[jukka] Upgrade trunk version to 2.1-SNAPSHOT.

------------------------------------------
Started by upstream project "Jackrabbit-trunk" build number 970
Building remotely on minerva.apache.org (Ubuntu)
Updating http://svn.apache.org/repos/asf/jackrabbit/trunk/jackrabbit-jcr-tests
U         pom.xml
At revision 891596
[locks-and-latches] Checking to see if we really have the locks
[locks-and-latches] Have all the locks, build can start
+ cd jackrabbit-jcr-tests
+ MAVEN_OPTS=-Xmx128m
+ /home/hudson/tools/maven/apache-maven-2.0.9/bin/mvn clean install
[INFO] Scanning for projects...
[INFO] ------------------------------------------------------------------------
[ERROR] FATAL ERROR
[INFO] ------------------------------------------------------------------------
[INFO] Failed to resolve artifact.

GroupId: org.apache.jackrabbit
ArtifactId: jackrabbit-parent
Version: 2.1-SNAPSHOT

Reason: Unable to download the artifact from any repository

  org.apache.jackrabbit:jackrabbit-parent:pom:2.1-SNAPSHOT

from the specified remote repositories:
  central (http://repo1.maven.org/maven2)


[INFO] ------------------------------------------------------------------------
[INFO] Trace
org.apache.maven.reactor.MavenExecutionException: Cannot find parent: org.apache.jackrabbit:jackrabbit-parent
for project: null:jackrabbit-jcr-tests:jar:null for project null:jackrabbit-jcr-tests:jar:null
	at org.apache.maven.DefaultMaven.getProjects(DefaultMaven.java:378)
	at org.apache.maven.DefaultMaven.doExecute(DefaultMaven.java:292)
	at org.apache.maven.DefaultMaven.execute(DefaultMaven.java:129)
	at org.apache.maven.cli.MavenCli.main(MavenCli.java:287)
	at sun.reflect.NativeMethodAccessorImpl.invoke0(Native Method)
	at sun.reflect.NativeMethodAccessorImpl.invoke(NativeMethodAccessorImpl.java:39)
	at sun.reflect.DelegatingMethodAccessorImpl.invoke(DelegatingMethodAccessorImpl.java:25)
	at java.lang.reflect.Method.invoke(Method.java:324)
	at org.codehaus.classworlds.Launcher.launchEnhanced(Launcher.java:315)
	at org.codehaus.classworlds.Launcher.launch(Launcher.java:255)
	at org.codehaus.classworlds.Launcher.mainWithExitCode(Launcher.java:430)
	at org.codehaus.classworlds.Launcher.main(Launcher.java:375)
Caused by: org.apache.maven.project.ProjectBuildingException: Cannot find parent: org.apache.jackrabbit:jackrabbit-parent
for project: null:jackrabbit-jcr-tests:jar:null for project null:jackrabbit-jcr-tests:jar:null
	at org.apache.maven.project.DefaultMavenProjectBuilder.assembleLineage(DefaultMavenProjectBuilder.java:1370)
	at org.apache.maven.project.DefaultMavenProjectBuilder.buildInternal(DefaultMavenProjectBuilder.java:821)
	at org.apache.maven.project.DefaultMavenProjectBuilder.buildFromSourceFileInternal(DefaultMavenProjectBuilder.java:506)
	at org.apache.maven.project.DefaultMavenProjectBuilder.build(DefaultMavenProjectBuilder.java:198)
	at org.apache.maven.DefaultMaven.getProject(DefaultMaven.java:583)
	at org.apache.maven.DefaultMaven.collectProjects(DefaultMaven.java:461)
	at org.apache.maven.DefaultMaven.getProjects(DefaultMaven.java:365)
	... 11 more
Caused by: org.apache.maven.project.ProjectBuildingException: POM 'org.apache.jackrabbit:jackrabbit-parent'
not found in repository: Unable to download the artifact from any repository

  org.apache.jackrabbit:jackrabbit-parent:pom:2.1-SNAPSHOT

from the specified remote repositories:
  central (http://repo1.maven.org/maven2)
 for project org.apache.jackrabbit:jackrabbit-parent
	at org.apache.maven.project.DefaultMavenProjectBuilder.findModelFromRepository(DefaultMavenProjectBuilder.java:603)
	at org.apache.maven.project.DefaultMavenProjectBuilder.assembleLineage(DefaultMavenProjectBuilder.java:1366)
	... 17 more
Caused by: org.apache.maven.artifact.resolver.ArtifactNotFoundException: Unable to download
the artifact from any repository

  org.apache.jackrabbit:jackrabbit-parent:pom:2.1-SNAPSHOT

from the specified remote repositories:
  central (http://repo1.maven.org/maven2)

	at org.apache.maven.artifact.resolver.DefaultArtifactResolver.resolve(DefaultArtifactResolver.java:212)
	at org.apache.maven.artifact.resolver.DefaultArtifactResolver.resolve(DefaultArtifactResolver.java:74)
	at org.apache.maven.project.DefaultMavenProjectBuilder.findModelFromRepository(DefaultMavenProjectBuilder.java:556)
	... 18 more
Caused by: org.apache.maven.wagon.ResourceDoesNotExistException: Unable to download the artifact
from any repository
	at org.apache.maven.artifact.manager.DefaultWagonManager.getArtifact(DefaultWagonManager.java:331)
	at org.apache.maven.artifact.resolver.DefaultArtifactResolver.resolve(DefaultArtifactResolver.java:200)
	... 20 more
[INFO] ------------------------------------------------------------------------
[INFO] Total time: < 1 second
[INFO] Finished at: Thu Dec 17 09:25:05 UTC 2009
[INFO] Final Memory: 1M/2M
[INFO] ------------------------------------------------------------------------
[locks-and-latches] Releasing all the locks
[locks-and-latches] All the locks released


Mime
View raw message