jackrabbit-dev mailing list archives

Site index · List index
Message view « Date » · « Thread »
Top « Date » · « Thread »
From Apache Hudson Server <hud...@hudson.zones.apache.org>
Subject Build failed in Hudson: Jackrabbit-spi » SPI Test Client #158
Date Tue, 07 Jul 2009 19:23:07 GMT
See http://hudson.zones.apache.org/hudson/job/Jackrabbit-spi/org.apache.jackrabbit$jackrabbit-test-client/158/

------------------------------------------
[INFO] ------------------------------------------------------------------------
[INFO] Building SPI Test Client
[INFO]    task-segment: [clean, install]
[INFO] ------------------------------------------------------------------------
[INFO] [clean:clean]
[INFO] Deleting file set: http://hudson.zones.apache.org/hudson/job/Jackrabbit-spi/org.apache.jackrabbit$jackrabbit-test-client/ws/target
 (included: [**], excluded: [])
[TASKS] Scanning folder 'http://hudson.zones.apache.org/hudson/job/Jackrabbit-spi/org.apache.jackrabbit$jackrabbit-test-client/ws/src/main/java'
 for tasks ... 
[TASKS] Found 0.
[TASKS] Scipping non-existent folder 'http://hudson.zones.apache.org/hudson/job/Jackrabbit-spi/org.apache.jackrabbit$jackrabbit-test-client/ws/src/main/resources'...

[TASKS] Found 0 annotations (0 new, 0 high, 0 normal, 0 low)
[TASKS] Don't changing build status, no threshold has been exceeded
[INFO] [remote-resources:process {execution: default}]
[TASKS] Scipping maven reporter: there is already a result available.
[INFO] [resources:resources]
[INFO] Using 'UTF-8' encoding to copy filtered resources.
[INFO] skip non existing resourceDirectory http://hudson.zones.apache.org/hudson/job/Jackrabbit-spi/org.apache.jackrabbit$jackrabbit-test-client/ws/src/main/resources

[INFO] Copying 3 resources
[TASKS] Scipping maven reporter: there is already a result available.[INFO] [compiler:compile]
[INFO] Compiling 6 source files to http://hudson.zones.apache.org/hudson/job/Jackrabbit-spi/org.apache.jackrabbit$jackrabbit-test-client/ws/target/classes


[TASKS] Scipping maven reporter: there is already a result available.[INFO] [resources:testResources]
[INFO] Using 'UTF-8' encoding to copy filtered resources.
[INFO] Copying 7 resources
[INFO] Copying 3 resources

[TASKS] Scipping maven reporter: there is already a result available.[INFO] [compiler:testCompile]
[INFO] Compiling 21 source files to http://hudson.zones.apache.org/hudson/job/Jackrabbit-spi/org.apache.jackrabbit$jackrabbit-test-client/ws/target/test-classes


[TASKS] Scipping maven reporter: there is already a result available.[INFO] [surefire:test]
[INFO] Surefire report directory: http://hudson.zones.apache.org/hudson/job/Jackrabbit-spi/org.apache.jackrabbit$jackrabbit-test-client/ws/target/surefire-reports



-------------------------------------------------------
 T E S T S
-------------------------------------------------------
Running org.apache.jackrabbit.test.TestAll
Tests run: 1042, Failures: 0, Errors: 0, Skipped: 0, Time elapsed: 42.466 sec
Running org.apache.jackrabbit.client.TestAll
Tests run: 444, Failures: 0, Errors: 0, Skipped: 0, Time elapsed: 6.289 sec

Results :

Tests run: 1486, Failures: 0, Errors: 0, Skipped: 0

[TASKS] Scipping maven reporter: there is already a result available.
[HUDSON] Recording test results
[INFO] [jar:jar]
[INFO] Building jar: http://hudson.zones.apache.org/hudson/job/Jackrabbit-spi/org.apache.jackrabbit$jackrabbit-test-client/ws/target/jackrabbit-test-client-1.6-SNAPSHOT.jar

[TASKS] Scipping maven reporter: there is already a result available.[INFO] Preparing source:jar
[WARNING] Removing: jar from forked lifecycle, to prevent recursive invocation.
[INFO] No goals needed for project - skipping
[INFO] [source:jar {execution: attach-sources}]
[INFO] Building jar: http://hudson.zones.apache.org/hudson/job/Jackrabbit-spi/org.apache.jackrabbit$jackrabbit-test-client/ws/target/jackrabbit-test-client-1.6-SNAPSHOT-sources.jar


[TASKS] Scipping maven reporter: there is already a result available.[INFO] [apache-rat:check
{execution: default}]
[INFO] Exclude: release.properties

[TASKS] Scipping maven reporter: there is already a result available.
[HUDSON] Archiving http://hudson.zones.apache.org/hudson/job/Jackrabbit-spi/org.apache.jackrabbit$jackrabbit-test-client/ws/pom.xml
 to /export/home/hudson/hudson/jobs/Jackrabbit-spi/modules/org.apache.jackrabbit$jackrabbit-test-client/builds/2009-07-07_19-20-50/archive/org.apache.jackrabbit/jackrabbit-test-client/1.6-SNAPSHOT/pom.xml
[HUDSON] Archiving http://hudson.zones.apache.org/hudson/job/Jackrabbit-spi/org.apache.jackrabbit$jackrabbit-test-client/ws/target/jackrabbit-test-client-1.6-SNAPSHOT.jar
 to /export/home/hudson/hudson/jobs/Jackrabbit-spi/modules/org.apache.jackrabbit$jackrabbit-test-client/builds/2009-07-07_19-20-50/archive/org.apache.jackrabbit/jackrabbit-test-client/1.6-SNAPSHOT/jackrabbit-test-client-1.6-SNAPSHOT.jar
[HUDSON] Archiving http://hudson.zones.apache.org/hudson/job/Jackrabbit-spi/org.apache.jackrabbit$jackrabbit-test-client/ws/target/jackrabbit-test-client-1.6-SNAPSHOT-sources.jar
 to /export/home/hudson/hudson/jobs/Jackrabbit-spi/modules/org.apache.jackrabbit$jackrabbit-test-client/builds/2009-07-07_19-20-50/archive/org.apache.jackrabbit/jackrabbit-test-client/1.6-SNAPSHOT/jackrabbit-test-client-1.6-SNAPSHOT-sources.jar
[INFO] ------------------------------------------------------------------------
[ERROR] BUILD FAILURE
[INFO] ------------------------------------------------------------------------
[INFO] Too many unapproved licenses: 3
[INFO] ------------------------------------------------------------------------
[INFO] For more information, run Maven with the -e switch
[INFO] ------------------------------------------------------------------------
[INFO] Total time: 1 minute 54 seconds
[INFO] Finished at: Tue Jul 07 19:22:55 UTC 2009
[INFO] Final Memory: 38M/221M
[INFO] ------------------------------------------------------------------------
Waiting for Hudson to finish collecting data
Jul 7, 2009 7:22:58 PM hudson.remoting.Channel$ReaderThread run
SEVERE: Unable to read a command
java.lang.ClassNotFoundException: hudson.remoting.ProxyOutputStream$Unexport
	at java.net.URLClassLoader$1.run(URLClassLoader.java:200)
	at java.security.AccessController.doPrivileged(Native Method)
	at java.net.URLClassLoader.findClass(URLClassLoader.java:188)
	at java.lang.ClassLoader.loadClass(ClassLoader.java:306)
	at org.codehaus.classworlds.RealmClassLoader.loadClassDirect(RealmClassLoader.java:195)
	at org.codehaus.classworlds.DefaultClassRealm.loadClass(DefaultClassRealm.java:255)
	at org.codehaus.classworlds.DefaultClassRealm.loadClass(DefaultClassRealm.java:274)
	at org.codehaus.classworlds.DefaultClassRealm.loadClass(DefaultClassRealm.java:274)
	at org.codehaus.classworlds.RealmClassLoader.loadClass(RealmClassLoader.java:214)
	at java.lang.ClassLoader.loadClass(ClassLoader.java:251)
	at java.lang.ClassLoader.loadClassInternal(ClassLoader.java:319)
	at java.lang.Class.forName0(Native Method)
	at java.lang.Class.forName(Class.java:242)
	at java.io.ObjectInputStream.resolveClass(ObjectInputStream.java:585)
	at java.io.ObjectInputStream.readNonProxyDesc(ObjectInputStream.java:1544)
	at java.io.ObjectInputStream.readClassDesc(ObjectInputStream.java:1466)
	at java.io.ObjectInputStream.readOrdinaryObject(ObjectInputStream.java:1699)
	at java.io.ObjectInputStream.readObject0(ObjectInputStream.java:1305)
	at java.io.ObjectInputStream.readObject(ObjectInputStream.java:348)
	at hudson.remoting.Channel$ReaderThread.run(Channel.java:637)


Mime
View raw message