jackrabbit-dev mailing list archives

Site index · List index
Message view « Date » · « Thread »
Top « Date » · « Thread »
From Apache Hudson Server <hud...@hudson.zones.apache.org>
Subject Build failed in Hudson: Jackrabbit-trunk » Jackrabbit Core #637
Date Tue, 30 Jun 2009 15:18:52 GMT
See http://hudson.zones.apache.org/hudson/job/Jackrabbit-trunk/org.apache.jackrabbit$jackrabbit-core/637/

------------------------------------------
[INFO] ------------------------------------------------------------------------
[INFO] Building Jackrabbit Core
[INFO]    task-segment: [clean, install]
[INFO] ------------------------------------------------------------------------
[INFO] [clean:clean]
[TASKS] Scanning folder 'http://hudson.zones.apache.org/hudson/job/Jackrabbit-trunk/org.apache.jackrabbit$jackrabbit-core/ws/src/main/java'
 for tasks ... 
[TASKS] Found 193.
[TASKS] Scanning folder 'http://hudson.zones.apache.org/hudson/job/Jackrabbit-trunk/org.apache.jackrabbit$jackrabbit-core/ws/src/main/resources'
 for tasks ... 
[TASKS] Found 0.
[TASKS] Scanning folder 'http://hudson.zones.apache.org/hudson/job/Jackrabbit-trunk/org.apache.jackrabbit$jackrabbit-core/ws/src/main/resources-filtered'
 for tasks ... 
[TASKS] Found 0.
Jun 30, 2009 3:14:18 PM hudson.remoting.Channel$ReaderThread run
SEVERE: Unable to read a command
java.lang.ClassNotFoundException: hudson.remoting.ProxyOutputStream$Unexport
	at java.net.URLClassLoader$1.run(URLClassLoader.java:200)
	at java.security.AccessController.doPrivileged(Native Method)
	at java.net.URLClassLoader.findClass(URLClassLoader.java:188)
	at java.lang.ClassLoader.loadClass(ClassLoader.java:306)
	at org.codehaus.classworlds.RealmClassLoader.loadClassDirect(RealmClassLoader.java:195)
	at org.codehaus.classworlds.DefaultClassRealm.loadClass(DefaultClassRealm.java:255)
	at org.codehaus.classworlds.DefaultClassRealm.loadClass(DefaultClassRealm.java:274)
	at org.codehaus.classworlds.DefaultClassRealm.loadClass(DefaultClassRealm.java:274)
	at org.codehaus.classworlds.RealmClassLoader.loadClass(RealmClassLoader.java:214)
	at java.lang.ClassLoader.loadClass(ClassLoader.java:251)
	at java.lang.ClassLoader.loadClassInternal(ClassLoader.java:319)
	at java.lang.Class.forName0(Native Method)
	at java.lang.Class.forName(Class.java:242)
	at java.io.ObjectInputStream.resolveClass(ObjectInputStream.java:585)
	at java.io.ObjectInputStream.readNonProxyDesc(ObjectInputStream.java:1544)
	at java.io.ObjectInputStream.readClassDesc(ObjectInputStream.java:1466)
	at java.io.ObjectInputStream.readOrdinaryObject(ObjectInputStream.java:1699)
	at java.io.ObjectInputStream.readObject0(ObjectInputStream.java:1305)
	at java.io.ObjectInputStream.readObject(ObjectInputStream.java:348)
	at hudson.remoting.Channel$ReaderThread.run(Channel.java:637)
[TASKS] Found 193 annotations (0 new, 22 high, 143 normal, 28 low)
[TASKS] Don't changing build status, no threshold has been exceeded[INFO] [remote-resources:process
{execution: default}]

[TASKS] Scipping maven reporter: there is already a result available.
[INFO] [resources:resources]
[INFO] Using 'UTF-8' encoding to copy filtered resources.
[INFO] Copying 54 resources
[INFO] Copying 1 resource
[INFO] Copying 3 resources
[TASKS] Scipping maven reporter: there is already a result available.[INFO] [compiler:compile]

[INFO] Compiling 634 source files to http://hudson.zones.apache.org/hudson/job/Jackrabbit-trunk/org.apache.jackrabbit$jackrabbit-core/ws/target/classes

[TASKS] Scipping maven reporter: there is already a result available.[INFO] [resources:testResources]
[INFO] Using 'UTF-8' encoding to copy filtered resources.
[INFO] Copying 11 resources
[INFO] Copying 3 resources

[TASKS] Scipping maven reporter: there is already a result available.[INFO] [antrun:run {execution:
process-test-resources}]
[INFO] Executing tasks

     [copy] Copying 35 files to http://hudson.zones.apache.org/hudson/job/Jackrabbit-trunk/org.apache.jackrabbit$jackrabbit-core/ws/target/repository

[INFO] Executed tasks
[TASKS] Scipping maven reporter: there is already a result available.[INFO] [compiler:testCompile]

[INFO] Compiling 250 source files to http://hudson.zones.apache.org/hudson/job/Jackrabbit-trunk/org.apache.jackrabbit$jackrabbit-core/ws/target/test-classes

[TASKS] Scipping maven reporter: there is already a result available.[INFO] [surefire:test]
[INFO] Surefire report directory: http://hudson.zones.apache.org/hudson/job/Jackrabbit-trunk/org.apache.jackrabbit$jackrabbit-core/ws/target/surefire-reports



-------------------------------------------------------
 T E S T S
-------------------------------------------------------
Running org.apache.jackrabbit.core.version.TestAll
Tests run: 5, Failures: 0, Errors: 0, Skipped: 0, Time elapsed: 6.601 sec
Running org.apache.jackrabbit.core.security.authorization.principalbased.TestAll
Tests run: 78, Failures: 0, Errors: 0, Skipped: 0, Time elapsed: 0.264 sec
Running org.apache.jackrabbit.core.config.TestAll
Tests run: 12, Failures: 0, Errors: 0, Skipped: 0, Time elapsed: 0.291 sec
Running org.apache.jackrabbit.core.security.authorization.acl.TestAll
Tests run: 72, Failures: 0, Errors: 0, Skipped: 0, Time elapsed: 9.475 sec
Running org.apache.jackrabbit.core.query.lucene.directory.TestAll
Tests run: 6, Failures: 0, Errors: 0, Skipped: 0, Time elapsed: 0.017 sec
Running org.apache.jackrabbit.core.security.user.TestAll
Tests run: 94, Failures: 0, Errors: 0, Skipped: 0, Time elapsed: 13.464 sec
Running org.apache.jackrabbit.core.security.authentication.TestAll
Tests run: 2, Failures: 0, Errors: 0, Skipped: 0, Time elapsed: 0.015 sec
Running org.apache.jackrabbit.core.journal.TestAll
Tests run: 3, Failures: 0, Errors: 0, Skipped: 0, Time elapsed: 0.014 sec
Running org.apache.jackrabbit.api.security.principal.TestAll
Tests run: 16, Failures: 0, Errors: 0, Skipped: 0, Time elapsed: 0.083 sec
Running org.apache.jackrabbit.core.state.TestAll
Tests run: 15, Failures: 0, Errors: 0, Skipped: 0, Time elapsed: 3.223 sec
Running org.apache.jackrabbit.core.security.TestAll
Tests run: 14, Failures: 0, Errors: 0, Skipped: 0, Time elapsed: 0.046 sec
Running org.apache.jackrabbit.core.lock.TestAll
Tests run: 1, Failures: 0, Errors: 0, Skipped: 0, Time elapsed: 0.017 sec
Running org.apache.jackrabbit.core.security.principal.TestAll
Tests run: 2, Failures: 0, Errors: 0, Skipped: 0, Time elapsed: 0.057 sec
Running org.apache.jackrabbit.core.util.TestAll
Tests run: 3, Failures: 0, Errors: 0, Skipped: 0, Time elapsed: 0.01 sec
Running org.apache.jackrabbit.api.security.user.TestAll
Tests run: 82, Failures: 0, Errors: 0, Skipped: 0, Time elapsed: 1.269 sec
Running org.apache.jackrabbit.core.cluster.TestAll
Tests run: 9, Failures: 0, Errors: 0, Skipped: 0, Time elapsed: 0.028 sec
Running org.apache.jackrabbit.core.nodetype.xml.TestAll
Tests run: 36, Failures: 0, Errors: 0, Skipped: 0, Time elapsed: 0.362 sec
Running org.apache.jackrabbit.core.TestAll
Tests run: 96, Failures: 0, Errors: 0, Skipped: 0, Time elapsed: 4.743 sec
Running org.apache.jackrabbit.core.security.authorization.combined.TestAll
Tests run: 28, Failures: 0, Errors: 0, Skipped: 0, Time elapsed: 0.859 sec
Running org.apache.jackrabbit.core.xml.TestAll
Tests run: 2, Failures: 0, Errors: 0, Skipped: 0, Time elapsed: 0.06 sec
Running org.apache.jackrabbit.core.observation.TestAll
Tests run: 14, Failures: 0, Errors: 0, Skipped: 0, Time elapsed: 0.552 sec
Running org.apache.jackrabbit.core.retention.TestAll
Tests run: 5, Failures: 0, Errors: 0, Skipped: 0, Time elapsed: 0.017 sec
Running org.apache.jackrabbit.core.value.TestAll
Tests run: 84, Failures: 0, Errors: 0, Skipped: 0, Time elapsed: 0.037 sec
Running org.apache.jackrabbit.core.nodetype.TestAll
Tests run: 1, Failures: 0, Errors: 0, Skipped: 0, Time elapsed: 0.178 sec
Running org.apache.jackrabbit.core.query.lucene.TestAll
Tests run: 4, Failures: 0, Errors: 0, Skipped: 0, Time elapsed: 10.243 sec
Running org.apache.jackrabbit.core.query.TestAll
Tests run: 146, Failures: 0, Errors: 0, Skipped: 0, Time elapsed: 8.793 sec
Running org.apache.jackrabbit.core.security.authorization.TestAll
Tests run: 24, Failures: 0, Errors: 0, Skipped: 0, Time elapsed: 0.097 sec
Running org.apache.jackrabbit.core.data.TestAll
Tests run: 19, Failures: 0, Errors: 0, Skipped: 0, Time elapsed: 18.002 sec

Results :

Tests run: 873, Failures: 0, Errors: 0, Skipped: 0

[TASKS] Scipping maven reporter: there is already a result available.
[HUDSON] Recording test results
[INFO] [jar:jar]
[INFO] Building jar: http://hudson.zones.apache.org/hudson/job/Jackrabbit-trunk/org.apache.jackrabbit$jackrabbit-core/ws/target/jackrabbit-core-2.0-SNAPSHOT.jar

[TASKS] Scipping maven reporter: there is already a result available.[INFO] Preparing source:jar
[WARNING] Removing: jar from forked lifecycle, to prevent recursive invocation.
[INFO] No goals needed for project - skipping
[INFO] [source:jar {execution: attach-sources}]

[INFO] Building jar: http://hudson.zones.apache.org/hudson/job/Jackrabbit-trunk/org.apache.jackrabbit$jackrabbit-core/ws/target/jackrabbit-core-2.0-SNAPSHOT-sources.jar

[TASKS] Scipping maven reporter: there is already a result available.[INFO] [surefire:test
{execution: do_test}]
[INFO] Surefire report directory: http://hudson.zones.apache.org/hudson/job/Jackrabbit-trunk/org.apache.jackrabbit$jackrabbit-core/ws/target/surefire-reports



-------------------------------------------------------
 T E S T S
-------------------------------------------------------
Running org.apache.jackrabbit.core.integration.MassiveWildcardTest
Jun 30, 2009 3:16:19 PM hudson.remoting.Channel$ReaderThread run
SEVERE: Unable to read a command
java.lang.ClassNotFoundException: hudson.remoting.ProxyOutputStream$Unexport
	at java.net.URLClassLoader$1.run(URLClassLoader.java:200)
	at java.security.AccessController.doPrivileged(Native Method)
	at java.net.URLClassLoader.findClass(URLClassLoader.java:188)
	at java.lang.ClassLoader.loadClass(ClassLoader.java:306)
	at org.codehaus.classworlds.RealmClassLoader.loadClassDirect(RealmClassLoader.java:195)
	at org.codehaus.classworlds.DefaultClassRealm.loadClass(DefaultClassRealm.java:255)
	at org.codehaus.classworlds.DefaultClassRealm.loadClass(DefaultClassRealm.java:274)
	at org.codehaus.classworlds.DefaultClassRealm.loadClass(DefaultClassRealm.java:274)
	at org.codehaus.classworlds.RealmClassLoader.loadClass(RealmClassLoader.java:214)
	at java.lang.ClassLoader.loadClass(ClassLoader.java:251)
	at java.lang.ClassLoader.loadClassInternal(ClassLoader.java:319)
	at java.lang.Class.forName0(Native Method)
	at java.lang.Class.forName(Class.java:242)
	at java.io.ObjectInputStream.resolveClass(ObjectInputStream.java:585)
	at java.io.ObjectInputStream.readNonProxyDesc(ObjectInputStream.java:1544)
	at java.io.ObjectInputStream.readClassDesc(ObjectInputStream.java:1466)
	at java.io.ObjectInputStream.readOrdinaryObject(ObjectInputStream.java:1699)
	at java.io.ObjectInputStream.readObject0(ObjectInputStream.java:1305)
	at java.io.ObjectInputStream.readObject(ObjectInputStream.java:348)
	at hudson.remoting.Channel$ReaderThread.run(Channel.java:637)
Tests run: 1, Failures: 0, Errors: 0, Skipped: 0, Time elapsed: 15.345 sec
Running org.apache.jackrabbit.core.integration.SessionImplTest
Tests run: 2, Failures: 0, Errors: 0, Skipped: 0, Time elapsed: 0.035 sec
Running org.apache.jackrabbit.core.integration.RepositoryLockTest
Tests run: 1, Failures: 0, Errors: 0, Skipped: 0, Time elapsed: 0.966 sec
Running org.apache.jackrabbit.core.integration.AxisQueryTest
Tests run: 1, Failures: 0, Errors: 0, Skipped: 0, Time elapsed: 11.138 sec
Running org.apache.jackrabbit.core.integration.RestoreSameNameSiblingTest
Tests run: 1, Failures: 0, Errors: 0, Skipped: 0, Time elapsed: 0.09 sec
Running org.apache.jackrabbit.core.integration.WorkspaceInitTest
Tests run: 1, Failures: 0, Errors: 0, Skipped: 0, Time elapsed: 10.022 sec
Running org.apache.jackrabbit.core.integration.GQLTest
Tests run: 17, Failures: 0, Errors: 0, Skipped: 0, Time elapsed: 0.576 sec
Running org.apache.jackrabbit.core.integration.NodeImplTest
Tests run: 2, Failures: 0, Errors: 0, Skipped: 0, Time elapsed: 0.077 sec
Running org.apache.jackrabbit.core.integration.MassiveRangeTest
Tests run: 1, Failures: 0, Errors: 0, Skipped: 0, Time elapsed: 4.07 sec
Running org.apache.jackrabbit.core.integration.JCRAPITest
Tests run: 1841, Failures: 0, Errors: 0, Skipped: 0, Time elapsed: 72.372 sec
Running org.apache.jackrabbit.core.integration.VersioningTest
Tests run: 1, Failures: 0, Errors: 0, Skipped: 0, Time elapsed: 0.27 sec
Running org.apache.jackrabbit.core.integration.RepositoryFactoryImplTest
Tests run: 6, Failures: 0, Errors: 0, Skipped: 0, Time elapsed: 3.692 sec
Running org.apache.jackrabbit.core.integration.ConcurrentQueryTest
Tests run: 2, Failures: 0, Errors: 0, Skipped: 0, Time elapsed: 5.08 sec

Results :

Tests run: 1877, Failures: 0, Errors: 0, Skipped: 0

[TASKS] Scipping maven reporter: there is already a result available.
[HUDSON] Recording test results
[INFO] [apache-rat:check {execution: default}]
[INFO] Exclude: src/main/javadoc/**/*.uxf
[INFO] Exclude: src/test/repository/**
[INFO] Exclude: src/test/resources/**/*.txt
[INFO] Exclude: src/test/resources/**/*.cnd
[TASKS] Scipping maven reporter: there is already a result available.
[HUDSON] Archiving http://hudson.zones.apache.org/hudson/job/Jackrabbit-trunk/org.apache.jackrabbit$jackrabbit-core/ws/pom.xml
 to /export/home/hudson/hudson/jobs/Jackrabbit-trunk/modules/org.apache.jackrabbit$jackrabbit-core/builds/2009-06-30_15-11-28/archive/org.apache.jackrabbit/jackrabbit-core/2.0-SNAPSHOT/pom.xml
[HUDSON] Archiving http://hudson.zones.apache.org/hudson/job/Jackrabbit-trunk/org.apache.jackrabbit$jackrabbit-core/ws/target/jackrabbit-core-2.0-SNAPSHOT.jar
 to /export/home/hudson/hudson/jobs/Jackrabbit-trunk/modules/org.apache.jackrabbit$jackrabbit-core/builds/2009-06-30_15-11-28/archive/org.apache.jackrabbit/jackrabbit-core/2.0-SNAPSHOT/jackrabbit-core-2.0-SNAPSHOT.jar
[HUDSON] Archiving http://hudson.zones.apache.org/hudson/job/Jackrabbit-trunk/org.apache.jackrabbit$jackrabbit-core/ws/target/jackrabbit-core-2.0-SNAPSHOT-sources.jar
 to /export/home/hudson/hudson/jobs/Jackrabbit-trunk/modules/org.apache.jackrabbit$jackrabbit-core/builds/2009-06-30_15-11-28/archive/org.apache.jackrabbit/jackrabbit-core/2.0-SNAPSHOT/jackrabbit-core-2.0-SNAPSHOT-sources.jar
Jun 30, 2009 3:18:41 PM hudson.remoting.Channel$ReaderThread run
SEVERE: Unable to read a command
java.lang.ClassNotFoundException: hudson.remoting.ProxyOutputStream$Unexport
	at java.net.URLClassLoader$1.run(URLClassLoader.java:200)
	at java.security.AccessController.doPrivileged(Native Method)
	at java.net.URLClassLoader.findClass(URLClassLoader.java:188)
	at java.lang.ClassLoader.loadClass(ClassLoader.java:306)
	at org.codehaus.classworlds.RealmClassLoader.loadClassDirect(RealmClassLoader.java:195)
	at org.codehaus.classworlds.DefaultClassRealm.loadClass(DefaultClassRealm.java:255)
	at org.codehaus.classworlds.DefaultClassRealm.loadClass(DefaultClassRealm.java:274)
	at org.codehaus.classworlds.DefaultClassRealm.loadClass(DefaultClassRealm.java:274)
	at org.codehaus.classworlds.RealmClassLoader.loadClass(RealmClassLoader.java:214)
	at java.lang.ClassLoader.loadClass(ClassLoader.java:251)
	at java.lang.ClassLoader.loadClassInternal(ClassLoader.java:319)
	at java.lang.Class.forName0(Native Method)
	at java.lang.Class.forName(Class.java:242)
	at java.io.ObjectInputStream.resolveClass(ObjectInputStream.java:585)
	at java.io.ObjectInputStream.readNonProxyDesc(ObjectInputStream.java:1544)
	at java.io.ObjectInputStream.readClassDesc(ObjectInputStream.java:1466)
	at java.io.ObjectInputStream.readOrdinaryObject(ObjectInputStream.java:1699)
	at java.io.ObjectInputStream.readObject0(ObjectInputStream.java:1305)
	at java.io.ObjectInputStream.readObject(ObjectInputStream.java:348)
	at hudson.remoting.Channel$ReaderThread.run(Channel.java:637)
[INFO] ------------------------------------------------------------------------
[ERROR] BUILD FAILURE
[INFO] ------------------------------------------------------------------------
[INFO] Too many unapproved licenses: 10
[INFO] ------------------------------------------------------------------------
[INFO] For more information, run Maven with the -e switch
[INFO] ------------------------------------------------------------------------
[INFO] Total time: 7 minutes 5 seconds
[INFO] Finished at: Tue Jun 30 15:18:46 UTC 2009
[INFO] Final Memory: 57M/188M
[INFO] ------------------------------------------------------------------------


Mime
View raw message