jackrabbit-dev mailing list archives

Site index · List index
Message view « Date » · « Thread »
Top « Date » · « Thread »
From Apache Hudson Server <hud...@hudson.zones.apache.org>
Subject Build failed in Hudson: Jackrabbit-trunk » Jackrabbit JCR Client #623
Date Mon, 22 Jun 2009 13:33:24 GMT
See http://hudson.zones.apache.org/hudson/job/Jackrabbit-trunk/org.apache.jackrabbit$jackrabbit-jcr-client/623/

------------------------------------------
[INFO] ------------------------------------------------------------------------
[INFO] Building Jackrabbit JCR Client
[INFO]    task-segment: [clean, install]
[INFO] ------------------------------------------------------------------------
[INFO] [clean:clean]
[INFO] Deleting file set: http://hudson.zones.apache.org/hudson/job/Jackrabbit-trunk/org.apache.jackrabbit$jackrabbit-jcr-client/ws/target
 (included: [**], excluded: [])
[TASKS] Scanning folder 'http://hudson.zones.apache.org/hudson/job/Jackrabbit-trunk/org.apache.jackrabbit$jackrabbit-jcr-client/ws/src/main/java'
 for tasks ... 
[TASKS] Found 0.
[TASKS] Scanning folder 'http://hudson.zones.apache.org/hudson/job/Jackrabbit-trunk/org.apache.jackrabbit$jackrabbit-jcr-client/ws/src/main/resources'
 for tasks ... 
[TASKS] Found 0.
[TASKS] File encoding has not been set in pom.xml, using platform encoding UTF-8, i.e. build
is platform dependent (see <a href="http://docs.codehaus.org/display/MAVENUSER/POM+Element+for+Source+File+Encoding">Maven
FAQ</a>).
[TASKS] Found 0 annotations (0 new, 0 high, 0 normal, 0 low)[INFO] [resources:resources]
[WARNING] Using platform encoding (UTF-8 actually) to copy filtered resources, i.e. build
is platform dependent!
[INFO] Copying 1 resource

[TASKS] Don't changing build status, no threshold has been exceeded
[TASKS] Scipping maven reporter: there is already a result available.[INFO] [compiler:compile]
[INFO] Compiling 6 source files to http://hudson.zones.apache.org/hudson/job/Jackrabbit-trunk/org.apache.jackrabbit$jackrabbit-jcr-client/ws/target/classes


[TASKS] Scipping maven reporter: there is already a result available.[INFO] [resources:testResources]
[WARNING] Using platform encoding (UTF-8 actually) to copy filtered resources, i.e. build
is platform dependent!
[INFO] skip non existing resourceDirectory http://hudson.zones.apache.org/hudson/job/Jackrabbit-trunk/org.apache.jackrabbit$jackrabbit-jcr-client/ws/src/test/resources


[TASKS] Scipping maven reporter: there is already a result available.[INFO] [compiler:testCompile]
[INFO] Compiling 2 source files to http://hudson.zones.apache.org/hudson/job/Jackrabbit-trunk/org.apache.jackrabbit$jackrabbit-jcr-client/ws/target/test-classes


[TASKS] Scipping maven reporter: there is already a result available.
[HUDSON] Archiving http://hudson.zones.apache.org/hudson/job/Jackrabbit-trunk/org.apache.jackrabbit$jackrabbit-jcr-client/ws/pom.xml
 to /export/home/hudson/hudson/jobs/Jackrabbit-trunk/modules/org.apache.jackrabbit$jackrabbit-jcr-client/builds/2009-06-22_13-16-46/archive/org.apache.jackrabbit/jackrabbit-jcr-client/2.0-SNAPSHOT/pom.xml
Jun 22, 2009 1:33:20 PM hudson.remoting.Channel$ReaderThread run
SEVERE: Unable to read a command
java.lang.ClassNotFoundException: hudson.remoting.ProxyOutputStream$Unexport
	at java.net.URLClassLoader$1.run(URLClassLoader.java:200)
	at java.security.AccessController.doPrivileged(Native Method)
	at java.net.URLClassLoader.findClass(URLClassLoader.java:188)
	at java.lang.ClassLoader.loadClass(ClassLoader.java:306)
	at org.codehaus.classworlds.RealmClassLoader.loadClassDirect(RealmClassLoader.java:195)
	at org.codehaus.classworlds.DefaultClassRealm.loadClass(DefaultClassRealm.java:255)
	at org.codehaus.classworlds.DefaultClassRealm.loadClass(DefaultClassRealm.java:274)
	at org.codehaus.classworlds.DefaultClassRealm.loadClass(DefaultClassRealm.java:274)
	at org.codehaus.classworlds.RealmClassLoader.loadClass(RealmClassLoader.java:214)
	at java.lang.ClassLoader.loadClass(ClassLoader.java:251)
	at java.lang.ClassLoader.loadClassInternal(ClassLoader.java:319)
	at java.lang.Class.forName0(Native Method)
	at java.lang.Class.forName(Class.java:242)
	at java.io.ObjectInputStream.resolveClass(ObjectInputStream.java:585)
	at java.io.ObjectInputStream.readNonProxyDesc(ObjectInputStream.java:1544)
	at java.io.ObjectInputStream.readClassDesc(ObjectInputStream.java:1466)
	at java.io.ObjectInputStream.readOrdinaryObject(ObjectInputStream.java:1699)
	at java.io.ObjectInputStream.readObject0(ObjectInputStream.java:1305)
	at java.io.ObjectInputStream.readObject(ObjectInputStream.java:348)
	at hudson.remoting.Channel$ReaderThread.run(Channel.java:637)
[INFO] ------------------------------------------------------------------------
[ERROR] BUILD FAILURE
[INFO] ------------------------------------------------------------------------
[INFO] Compilation failure
http://hudson.zones.apache.org/hudson/job/Jackrabbit-trunk/org.apache.jackrabbit$jackrabbit-jcr-client/ws/src/test/java/org/apache/jackrabbit/client/RepositoryFactoryImplTest.java
:[147,25] org.apache.jackrabbit.client.RepositoryFactoryImplTest.RepositoryServiceImpl is
not abstract and does not override abstract method executeQuery(org.apache.jackrabbit.spi.SessionInfo,java.lang.String,java.lang.String,java.util.Map<java.lang.String,java.lang.String>,long,long,java.util.Map<java.lang.String,org.apache.jackrabbit.spi.QValue>)
in org.apache.jackrabbit.spi.RepositoryService



http://hudson.zones.apache.org/hudson/job/Jackrabbit-trunk/org.apache.jackrabbit$jackrabbit-jcr-client/ws/src/test/java/org/apache/jackrabbit/client/RepositoryFactoryImplTest.java
:[147,25] org.apache.jackrabbit.client.RepositoryFactoryImplTest.RepositoryServiceImpl is
not abstract and does not override abstract method executeQuery(org.apache.jackrabbit.spi.SessionInfo,java.lang.String,java.lang.String,java.util.Map<java.lang.String,java.lang.String>,long,long,java.util.Map<java.lang.String,org.apache.jackrabbit.spi.QValue>)
in org.apache.jackrabbit.spi.RepositoryService


[INFO] ------------------------------------------------------------------------
[INFO] For more information, run Maven with the -e switch
[INFO] ------------------------------------------------------------------------
[INFO] Total time: 16 minutes 27 seconds
[INFO] Finished at: Mon Jun 22 13:33:21 UTC 2009
[INFO] Final Memory: 62M/177M
[INFO] ------------------------------------------------------------------------


Mime
View raw message