jackrabbit-dev mailing list archives

Site index · List index
Message view « Date » · « Thread »
Top « Date » · « Thread »
From Apache Hudson Server <hud...@hudson.zones.apache.org>
Subject Build failed in Hudson: Jackrabbit-trunk-java14 #161
Date Wed, 08 Apr 2009 09:47:18 GMT
See http://hudson.zones.apache.org/hudson/job/Jackrabbit-trunk-java14/161/changes

Changes:

[tripod] fixing typo

------------------------------------------
[...truncated 321 lines...]
[INFO] Installing http://hudson.zones.apache.org/hudson/job/Jackrabbit-trunk-java14/ws/trunk/jackrabbit-jcr-benchmark/target/jackrabbit-jcr-benchmark-1.6-SNAPSHOT-sources.jar
 to /home/hudson/.m2/repository/org/apache/jackrabbit/jackrabbit-jcr-benchmark/1.6-SNAPSHOT/jackrabbit-jcr-benchmark-1.6-SNAPSHOT-sources.jar
[INFO] [maven-one-plugin:install-maven-one-repository {execution: default}]
[INFO] Installing http://hudson.zones.apache.org/hudson/job/Jackrabbit-trunk-java14/ws/trunk/jackrabbit-jcr-benchmark/target/jackrabbit-jcr-benchmark-1.6-SNAPSHOT.jar
 to /home/hudson/.maven/repository/org.apache.jackrabbit/jars/jackrabbit-jcr-benchmark-1.6-SNAPSHOT.jar
[INFO] Installing http://hudson.zones.apache.org/hudson/job/Jackrabbit-trunk-java14/ws/trunk/jackrabbit-jcr-benchmark/target/jackrabbit-jcr-benchmark-1.6-SNAPSHOT-sources.jar
 to /home/hudson/.maven/repository/org.apache.jackrabbit/java-sources/jackrabbit-jcr-benchmark-1.6-SNAPSHOT-sources.jar
[INFO] ------------------------------------------------------------------------
[INFO] Building Jackrabbit SPI
[INFO]    task-segment: [clean, install]
[INFO] ------------------------------------------------------------------------
[INFO] [clean:clean]
[INFO] Deleting file set: http://hudson.zones.apache.org/hudson/job/Jackrabbit-trunk-java14/ws/trunk/jackrabbit-spi/target
 (included: [**], excluded: [])
[INFO] [resources:resources]
[WARNING] Using platform encoding (UTF-8 actually) to copy filtered resources, i.e. build
is platform dependent!
[INFO] Copying 2 resources
[INFO] [compiler:compile]
[INFO] Compiling 29 source files to http://hudson.zones.apache.org/hudson/job/Jackrabbit-trunk-java14/ws/trunk/jackrabbit-spi/target/classes

[INFO] [resources:testResources]
[WARNING] Using platform encoding (UTF-8 actually) to copy filtered resources, i.e. build
is platform dependent!
[INFO] skip non existing resourceDirectory http://hudson.zones.apache.org/hudson/job/Jackrabbit-trunk-java14/ws/trunk/jackrabbit-spi/src/test/resources

[INFO] [compiler:testCompile]
[INFO] Compiling 7 source files to http://hudson.zones.apache.org/hudson/job/Jackrabbit-trunk-java14/ws/trunk/jackrabbit-spi/target/test-classes

[INFO] [surefire:test]
[INFO] Tests are skipped.
[INFO] [jar:jar]
[INFO] Building jar: http://hudson.zones.apache.org/hudson/job/Jackrabbit-trunk-java14/ws/trunk/jackrabbit-spi/target/jackrabbit-spi-1.6-SNAPSHOT.jar

[INFO] Preparing source:jar
[WARNING] Removing: jar from forked lifecycle, to prevent recursive invocation.
[INFO] No goals needed for project - skipping
[INFO] [source:jar {execution: attach-sources}]
[INFO] Building jar: http://hudson.zones.apache.org/hudson/job/Jackrabbit-trunk-java14/ws/trunk/jackrabbit-spi/target/jackrabbit-spi-1.6-SNAPSHOT-sources.jar

[INFO] [jar:jar {execution: default}]
[INFO] [jar:test-jar {execution: default}]
[INFO] Building jar: http://hudson.zones.apache.org/hudson/job/Jackrabbit-trunk-java14/ws/trunk/jackrabbit-spi/target/jackrabbit-spi-1.6-SNAPSHOT-tests.jar

[INFO] [install:install]
[INFO] Installing http://hudson.zones.apache.org/hudson/job/Jackrabbit-trunk-java14/ws/trunk/jackrabbit-spi/target/jackrabbit-spi-1.6-SNAPSHOT.jar
 to /home/hudson/.m2/repository/org/apache/jackrabbit/jackrabbit-spi/1.6-SNAPSHOT/jackrabbit-spi-1.6-SNAPSHOT.jar
[INFO] Installing http://hudson.zones.apache.org/hudson/job/Jackrabbit-trunk-java14/ws/trunk/jackrabbit-spi/target/jackrabbit-spi-1.6-SNAPSHOT-sources.jar
 to /home/hudson/.m2/repository/org/apache/jackrabbit/jackrabbit-spi/1.6-SNAPSHOT/jackrabbit-spi-1.6-SNAPSHOT-sources.jar
[INFO] Installing http://hudson.zones.apache.org/hudson/job/Jackrabbit-trunk-java14/ws/trunk/jackrabbit-spi/target/jackrabbit-spi-1.6-SNAPSHOT-tests.jar
 to /home/hudson/.m2/repository/org/apache/jackrabbit/jackrabbit-spi/1.6-SNAPSHOT/jackrabbit-spi-1.6-SNAPSHOT-tests.jar
[INFO] [maven-one-plugin:install-maven-one-repository {execution: default}]
[INFO] Installing http://hudson.zones.apache.org/hudson/job/Jackrabbit-trunk-java14/ws/trunk/jackrabbit-spi/target/jackrabbit-spi-1.6-SNAPSHOT.jar
 to /home/hudson/.maven/repository/org.apache.jackrabbit/jars/jackrabbit-spi-1.6-SNAPSHOT.jar
[INFO] Installing http://hudson.zones.apache.org/hudson/job/Jackrabbit-trunk-java14/ws/trunk/jackrabbit-spi/target/jackrabbit-spi-1.6-SNAPSHOT-sources.jar
 to /home/hudson/.maven/repository/org.apache.jackrabbit/java-sources/jackrabbit-spi-1.6-SNAPSHOT-sources.jar
[INFO] Installing http://hudson.zones.apache.org/hudson/job/Jackrabbit-trunk-java14/ws/trunk/jackrabbit-spi/target/jackrabbit-spi-1.6-SNAPSHOT-tests.jar
 to /home/hudson/.maven/repository/org.apache.jackrabbit/jars/jackrabbit-spi-1.6-SNAPSHOT-tests.jar
[INFO] ------------------------------------------------------------------------
[INFO] Building Jackrabbit SPI Commons
[INFO]    task-segment: [clean, install]
[INFO] ------------------------------------------------------------------------
[INFO] [clean:clean]
[INFO] Deleting file set: http://hudson.zones.apache.org/hudson/job/Jackrabbit-trunk-java14/ws/trunk/jackrabbit-spi-commons/target
 (included: [**], excluded: [])
[INFO] [javacc:jjtree-javacc {execution: sql}]
Java Compiler Compiler Version 4.0 (Tree Builder)
(type "jjtree" with no arguments for help)
Reading from file http://hudson.zones.apache.org/hudson/job/Jackrabbit-trunk-java14/ws/trunk/jackrabbit-spi-commons/src/main/javacc/sql/JCRSQL.jjt
 . . .
File "http://hudson.zones.apache.org/hudson/job/Jackrabbit-trunk-java14/ws/trunk/jackrabbit-spi-commons/target/generated-sources/jjtree/org/apache/jackrabbit/spi/commons/query/sql/Node.java"
 does not exist.  Will create one.
File "http://hudson.zones.apache.org/hudson/job/Jackrabbit-trunk-java14/ws/trunk/jackrabbit-spi-commons/target/generated-sources/jjtree/org/apache/jackrabbit/spi/commons/query/sql/SimpleNode.java"
 does not exist.  Will create one.
File "http://hudson.zones.apache.org/hudson/job/Jackrabbit-trunk-java14/ws/trunk/jackrabbit-spi-commons/target/generated-sources/jjtree/org/apache/jackrabbit/spi/commons/query/sql/ASTQuery.java"
 does not exist.  Will create one.
File "http://hudson.zones.apache.org/hudson/job/Jackrabbit-trunk-java14/ws/trunk/jackrabbit-spi-commons/target/generated-sources/jjtree/org/apache/jackrabbit/spi/commons/query/sql/ASTSelectList.java"
 does not exist.  Will create one.
File "http://hudson.zones.apache.org/hudson/job/Jackrabbit-trunk-java14/ws/trunk/jackrabbit-spi-commons/target/generated-sources/jjtree/org/apache/jackrabbit/spi/commons/query/sql/ASTFromClause.java"
 does not exist.  Will create one.
File "http://hudson.zones.apache.org/hudson/job/Jackrabbit-trunk-java14/ws/trunk/jackrabbit-spi-commons/target/generated-sources/jjtree/org/apache/jackrabbit/spi/commons/query/sql/ASTWhereClause.java"
 does not exist.  Will create one.
File "http://hudson.zones.apache.org/hudson/job/Jackrabbit-trunk-java14/ws/trunk/jackrabbit-spi-commons/target/generated-sources/jjtree/org/apache/jackrabbit/spi/commons/query/sql/ASTPredicate.java"
 does not exist.  Will create one.
File "http://hudson.zones.apache.org/hudson/job/Jackrabbit-trunk-java14/ws/trunk/jackrabbit-spi-commons/target/generated-sources/jjtree/org/apache/jackrabbit/spi/commons/query/sql/ASTLowerFunction.java"
 does not exist.  Will create one.
File "http://hudson.zones.apache.org/hudson/job/Jackrabbit-trunk-java14/ws/trunk/jackrabbit-spi-commons/target/generated-sources/jjtree/org/apache/jackrabbit/spi/commons/query/sql/ASTUpperFunction.java"
 does not exist.  Will create one.
File "http://hudson.zones.apache.org/hudson/job/Jackrabbit-trunk-java14/ws/trunk/jackrabbit-spi-commons/target/generated-sources/jjtree/org/apache/jackrabbit/spi/commons/query/sql/ASTOrExpression.java"
 does not exist.  Will create one.
File "http://hudson.zones.apache.org/hudson/job/Jackrabbit-trunk-java14/ws/trunk/jackrabbit-spi-commons/target/generated-sources/jjtree/org/apache/jackrabbit/spi/commons/query/sql/ASTAndExpression.java"
 does not exist.  Will create one.
File "http://hudson.zones.apache.org/hudson/job/Jackrabbit-trunk-java14/ws/trunk/jackrabbit-spi-commons/target/generated-sources/jjtree/org/apache/jackrabbit/spi/commons/query/sql/ASTNotExpression.java"
 does not exist.  Will create one.
File "http://hudson.zones.apache.org/hudson/job/Jackrabbit-trunk-java14/ws/trunk/jackrabbit-spi-commons/target/generated-sources/jjtree/org/apache/jackrabbit/spi/commons/query/sql/ASTBracketExpression.java"
 does not exist.  Will create one.
File "http://hudson.zones.apache.org/hudson/job/Jackrabbit-trunk-java14/ws/trunk/jackrabbit-spi-commons/target/generated-sources/jjtree/org/apache/jackrabbit/spi/commons/query/sql/ASTContainsExpression.java"
 does not exist.  Will create one.
File "http://hudson.zones.apache.org/hudson/job/Jackrabbit-trunk-java14/ws/trunk/jackrabbit-spi-commons/target/generated-sources/jjtree/org/apache/jackrabbit/spi/commons/query/sql/ASTLiteral.java"
 does not exist.  Will create one.
File "http://hudson.zones.apache.org/hudson/job/Jackrabbit-trunk-java14/ws/trunk/jackrabbit-spi-commons/target/generated-sources/jjtree/org/apache/jackrabbit/spi/commons/query/sql/ASTIdentifier.java"
 does not exist.  Will create one.
File "http://hudson.zones.apache.org/hudson/job/Jackrabbit-trunk-java14/ws/trunk/jackrabbit-spi-commons/target/generated-sources/jjtree/org/apache/jackrabbit/spi/commons/query/sql/ASTExcerptFunction.java"
 does not exist.  Will create one.
File "http://hudson.zones.apache.org/hudson/job/Jackrabbit-trunk-java14/ws/trunk/jackrabbit-spi-commons/target/generated-sources/jjtree/org/apache/jackrabbit/spi/commons/query/sql/ASTOrderByClause.java"
 does not exist.  Will create one.
File "http://hudson.zones.apache.org/hudson/job/Jackrabbit-trunk-java14/ws/trunk/jackrabbit-spi-commons/target/generated-sources/jjtree/org/apache/jackrabbit/spi/commons/query/sql/ASTOrderSpec.java"
 does not exist.  Will create one.
File "http://hudson.zones.apache.org/hudson/job/Jackrabbit-trunk-java14/ws/trunk/jackrabbit-spi-commons/target/generated-sources/jjtree/org/apache/jackrabbit/spi/commons/query/sql/ASTAscendingOrderSpec.java"
 does not exist.  Will create one.
File "http://hudson.zones.apache.org/hudson/job/Jackrabbit-trunk-java14/ws/trunk/jackrabbit-spi-commons/target/generated-sources/jjtree/org/apache/jackrabbit/spi/commons/query/sql/ASTDescendingOrderSpec.java"
 does not exist.  Will create one.
Annotated grammar generated successfully in http://hudson.zones.apache.org/hudson/job/Jackrabbit-trunk-java14/ws/trunk/jackrabbit-spi-commons/target/generated-sources/jjtree/org/apache/jackrabbit/spi/commons/query/sql/JCRSQL.jj

Java Compiler Compiler Version 4.0 (Parser Generator)
(type "javacc" with no arguments for help)
Reading from file http://hudson.zones.apache.org/hudson/job/Jackrabbit-trunk-java14/ws/trunk/jackrabbit-spi-commons/target/generated-sources/jjtree/org/apache/jackrabbit/spi/commons/query/sql/JCRSQL.jj
 . . .
Note: UNICODE_INPUT option is specified. Please make sure you create the parser/lexer using
a Reader with the correct character encoding.
File "TokenMgrError.java" does not exist.  Will create one.
File "ParseException.java" does not exist.  Will create one.
File "Token.java" does not exist.  Will create one.
File "SimpleCharStream.java" does not exist.  Will create one.
Parser generated successfully.
[INFO] Processed 1 grammar
[INFO] [javacc:jjtree-javacc {execution: xpath}]
Java Compiler Compiler Version 4.0 (Tree Builder)
(type "jjtree" with no arguments for help)
Reading from file http://hudson.zones.apache.org/hudson/job/Jackrabbit-trunk-java14/ws/trunk/jackrabbit-spi-commons/src/main/javacc/xpath/XPath.jjt
 . . .
File "http://hudson.zones.apache.org/hudson/job/Jackrabbit-trunk-java14/ws/trunk/jackrabbit-spi-commons/target/generated-sources/jjtree/org/apache/jackrabbit/spi/commons/query/xpath/Node.java"
 does not exist.  Will create one.
File "http://hudson.zones.apache.org/hudson/job/Jackrabbit-trunk-java14/ws/trunk/jackrabbit-spi-commons/target/generated-sources/jjtree/org/apache/jackrabbit/spi/commons/query/xpath/SimpleNode.java"
 does not exist.  Will create one.
Annotated grammar generated successfully in http://hudson.zones.apache.org/hudson/job/Jackrabbit-trunk-java14/ws/trunk/jackrabbit-spi-commons/target/generated-sources/jjtree/org/apache/jackrabbit/spi/commons/query/xpath/XPath.jj

Java Compiler Compiler Version 4.0 (Parser Generator)
(type "javacc" with no arguments for help)
Reading from file http://hudson.zones.apache.org/hudson/job/Jackrabbit-trunk-java14/ws/trunk/jackrabbit-spi-commons/target/generated-sources/jjtree/org/apache/jackrabbit/spi/commons/query/xpath/XPath.jj
 . . .
Warning: Line 535, Column 2: Non-ASCII characters used in regular expression.
Please make sure you use the correct Reader when you create the parser that can handle your
character set.
Warning:  "\'" cannot be matched as a string literal token at line 1566, column 2. It will
be matched as  <AposAttrContentChar>.
File "TokenMgrError.java" does not exist.  Will create one.
File "ParseException.java" does not exist.  Will create one.
File "Token.java" does not exist.  Will create one.
File "SimpleCharStream.java" does not exist.  Will create one.
Parser generated with 0 errors and 2 warnings.
[INFO] Processed 1 grammar
[INFO] [antrun:run {execution: delete-sources}]
[INFO] Executing tasks
     [echo] Remove files that have been customized in Jackrabbit
[INFO] Executed tasks
[INFO] [resources:resources]
[WARNING] Using platform encoding (UTF-8 actually) to copy filtered resources, i.e. build
is platform dependent!
[INFO] Copying 3 resources
[INFO] [compiler:compile]
[INFO] Compiling 230 source files to http://hudson.zones.apache.org/hudson/job/Jackrabbit-trunk-java14/ws/trunk/jackrabbit-spi-commons/target/classes

[INFO] [resources:testResources]
[WARNING] Using platform encoding (UTF-8 actually) to copy filtered resources, i.e. build
is platform dependent!
[INFO] Copying 2 resources
[INFO] [compiler:testCompile]
[INFO] Compiling 27 source files to http://hudson.zones.apache.org/hudson/job/Jackrabbit-trunk-java14/ws/trunk/jackrabbit-spi-commons/target/test-classes

[INFO] [surefire:test]
[INFO] Surefire report directory: http://hudson.zones.apache.org/hudson/job/Jackrabbit-trunk-java14/ws/trunk/jackrabbit-spi-commons/target/surefire-reports


-------------------------------------------------------
 T E S T S
-------------------------------------------------------
Running org.apache.jackrabbit.spi.commons.nodetype.BooleanConstraintTest
Tests run: 11, Failures: 0, Errors: 0, Skipped: 0, Time elapsed: 0.128 sec
Running org.apache.jackrabbit.spi.commons.batch.ConsolidatedBatchTest
Tests run: 1, Failures: 0, Errors: 0, Skipped: 0, Time elapsed: 0.034 sec
Running org.apache.jackrabbit.spi.commons.name.MatcherTest
Tests run: 3, Failures: 0, Errors: 0, Skipped: 0, Time elapsed: 0.014 sec
Running org.apache.jackrabbit.spi.commons.nodetype.StringConstraintTest
Tests run: 10, Failures: 0, Errors: 0, Skipped: 0, Time elapsed: 0.008 sec
Running org.apache.jackrabbit.spi.commons.nodetype.NumericConstraintTest
Tests run: 10, Failures: 0, Errors: 0, Skipped: 0, Time elapsed: 0.021 sec
Running org.apache.jackrabbit.spi.commons.conversion.ParsingPathResolverTest
Tests run: 2, Failures: 0, Errors: 0, Skipped: 0, Time elapsed: 0.005 sec
Running org.apache.jackrabbit.spi.commons.nodetype.compact.CompactNodeTypeDefTest
Tests run: 1, Failures: 0, Errors: 0, Skipped: 0, Time elapsed: 0.07 sec
Running org.apache.jackrabbit.spi.commons.value.QValueTest
Tests run: 44, Failures: 0, Errors: 0, Skipped: 0, Time elapsed: 59.657 sec
Running org.apache.jackrabbit.spi.commons.identifier.SerializationTest
Tests run: 2, Failures: 0, Errors: 0, Skipped: 0, Time elapsed: 0.014 sec
Running org.apache.jackrabbit.spi.commons.nodetype.ReferenceConstraintTest
Tests run: 10, Failures: 0, Errors: 0, Skipped: 0, Time elapsed: 0.021 sec
Running org.apache.jackrabbit.spi.commons.name.NameFactoryTest
Tests run: 3, Failures: 0, Errors: 0, Skipped: 0, Time elapsed: 0.007 sec
Running org.apache.jackrabbit.spi.commons.query.xpath.XPathOrderByTest
Tests run: 5, Failures: 0, Errors: 0, Skipped: 0, Time elapsed: 0.114 sec
Running org.apache.jackrabbit.spi.commons.query.xpath.QueryFormatTest
Tests run: 1, Failures: 0, Errors: 0, Skipped: 0, Time elapsed: 0.002 sec
Running org.apache.jackrabbit.spi.commons.name.PathTest
Tests run: 39, Failures: 0, Errors: 0, Skipped: 0, Time elapsed: 0.036 sec
Running org.apache.jackrabbit.spi.commons.conversion.ParsingNameResolverTest
Tests run: 2, Failures: 0, Errors: 0, Skipped: 0, Time elapsed: 0.002 sec
Running org.apache.jackrabbit.spi.commons.name.PathFactoryTest
Tests run: 13, Failures: 0, Errors: 0, Skipped: 0, Time elapsed: 0.007 sec
Running org.apache.jackrabbit.spi.commons.nodetype.PathConstraintTest
Tests run: 10, Failures: 0, Errors: 0, Skipped: 0, Time elapsed: 0.005 sec
Running org.apache.jackrabbit.spi.commons.conversion.PathParserTest
Tests run: 5, Failures: 0, Errors: 0, Skipped: 0, Time elapsed: 0.005 sec
Running org.apache.jackrabbit.spi.commons.nodetype.DateConstraintTest
Tests run: 10, Failures: 0, Errors: 0, Skipped: 0, Time elapsed: 0.013 sec
Running org.apache.jackrabbit.spi.commons.name.PathBuilderTest
Tests run: 2, Failures: 0, Errors: 0, Skipped: 0, Time elapsed: 0.004 sec
Running org.apache.jackrabbit.spi.commons.conversion.NameParserTest
Tests run: 4, Failures: 0, Errors: 0, Skipped: 0, Time elapsed: 0.005 sec
Running org.apache.jackrabbit.spi.commons.nodetype.NameConstraintTest
Tests run: 10, Failures: 0, Errors: 0, Skipped: 0, Time elapsed: 0.004 sec
Running org.apache.jackrabbit.spi.commons.name.PatternTest
Tests run: 13, Failures: 0, Errors: 0, Skipped: 0, Time elapsed: 0.011 sec

Results :

Tests run: 211, Failures: 0, Errors: 0, Skipped: 0

[INFO] [jar:jar]
[INFO] Building jar: http://hudson.zones.apache.org/hudson/job/Jackrabbit-trunk-java14/ws/trunk/jackrabbit-spi-commons/target/jackrabbit-spi-commons-1.6-SNAPSHOT.jar

[INFO] Preparing source:jar
[WARNING] Removing: jar from forked lifecycle, to prevent recursive invocation.
[INFO] [javacc:jjtree-javacc {execution: sql}]
[INFO] Skipping - all parsers are up to date
[INFO] [javacc:jjtree-javacc {execution: xpath}]
[INFO] Skipping - all parsers are up to date
[INFO] [source:jar {execution: attach-sources}]
[INFO] Building jar: http://hudson.zones.apache.org/hudson/job/Jackrabbit-trunk-java14/ws/trunk/jackrabbit-spi-commons/target/jackrabbit-spi-commons-1.6-SNAPSHOT-sources.jar

[INFO] [install:install]
[INFO] Installing http://hudson.zones.apache.org/hudson/job/Jackrabbit-trunk-java14/ws/trunk/jackrabbit-spi-commons/target/jackrabbit-spi-commons-1.6-SNAPSHOT.jar
 to /home/hudson/.m2/repository/org/apache/jackrabbit/jackrabbit-spi-commons/1.6-SNAPSHOT/jackrabbit-spi-commons-1.6-SNAPSHOT.jar
[INFO] Installing http://hudson.zones.apache.org/hudson/job/Jackrabbit-trunk-java14/ws/trunk/jackrabbit-spi-commons/target/jackrabbit-spi-commons-1.6-SNAPSHOT-sources.jar
 to /home/hudson/.m2/repository/org/apache/jackrabbit/jackrabbit-spi-commons/1.6-SNAPSHOT/jackrabbit-spi-commons-1.6-SNAPSHOT-sources.jar
[INFO] [maven-one-plugin:install-maven-one-repository {execution: default}]
[INFO] Installing http://hudson.zones.apache.org/hudson/job/Jackrabbit-trunk-java14/ws/trunk/jackrabbit-spi-commons/target/jackrabbit-spi-commons-1.6-SNAPSHOT.jar
 to /home/hudson/.maven/repository/org.apache.jackrabbit/jars/jackrabbit-spi-commons-1.6-SNAPSHOT.jar
[INFO] Installing http://hudson.zones.apache.org/hudson/job/Jackrabbit-trunk-java14/ws/trunk/jackrabbit-spi-commons/target/jackrabbit-spi-commons-1.6-SNAPSHOT-sources.jar
 to /home/hudson/.maven/repository/org.apache.jackrabbit/java-sources/jackrabbit-spi-commons-1.6-SNAPSHOT-sources.jar
[INFO] ------------------------------------------------------------------------
[INFO] Building Jackrabbit Text Extractors
[INFO]    task-segment: [clean, install]
[INFO] ------------------------------------------------------------------------
[INFO] [clean:clean]
[INFO] Deleting file set: http://hudson.zones.apache.org/hudson/job/Jackrabbit-trunk-java14/ws/trunk/jackrabbit-text-extractors/target
 (included: [**], excluded: [])
[INFO] [resources:resources]
[WARNING] Using platform encoding (UTF-8 actually) to copy filtered resources, i.e. build
is platform dependent!
[INFO] Copying 2 resources
[INFO] [compiler:compile]
[INFO] Compiling 20 source files to http://hudson.zones.apache.org/hudson/job/Jackrabbit-trunk-java14/ws/trunk/jackrabbit-text-extractors/target/classes

[INFO] [resources:testResources]
[WARNING] Using platform encoding (UTF-8 actually) to copy filtered resources, i.e. build
is platform dependent!
[INFO] Copying 2 resources
[INFO] [compiler:testCompile]
[INFO] Compiling 7 source files to http://hudson.zones.apache.org/hudson/job/Jackrabbit-trunk-java14/ws/trunk/jackrabbit-text-extractors/target/test-classes

[INFO] [surefire:test]
[INFO] Surefire report directory: http://hudson.zones.apache.org/hudson/job/Jackrabbit-trunk-java14/ws/trunk/jackrabbit-text-extractors/target/surefire-reports


-------------------------------------------------------
 T E S T S
-------------------------------------------------------
Running org.apache.jackrabbit.extractor.RTFTextExtractorTest
Tests run: 1, Failures: 0, Errors: 0, Skipped: 0, Time elapsed: 0.2 sec
Running org.apache.jackrabbit.extractor.EmptyTextExtractorTest
Tests run: 2, Failures: 0, Errors: 0, Skipped: 0, Time elapsed: 0.007 sec
Running org.apache.jackrabbit.extractor.CompositeTextExtractorTest
Tests run: 4, Failures: 0, Errors: 0, Skipped: 0, Time elapsed: 0.089 sec
Running org.apache.jackrabbit.extractor.PngTextExtractorTest
Tests run: 3, Failures: 0, Errors: 0, Skipped: 0, Time elapsed: 0.007 sec
Running org.apache.jackrabbit.extractor.XMLTextExtractorTest
Tests run: 5, Failures: 0, Errors: 4, Skipped: 0, Time elapsed: 0.139 sec <<< FAILURE!
Running org.apache.jackrabbit.extractor.PlainTextExtractorTest
Tests run: 4, Failures: 0, Errors: 0, Skipped: 0, Time elapsed: 0.012 sec

Results :

Tests in error: 
  testEmptyStream(org.apache.jackrabbit.extractor.XMLTextExtractorTest)
  testNormalStream(org.apache.jackrabbit.extractor.XMLTextExtractorTest)
  testInvalidStream(org.apache.jackrabbit.extractor.XMLTextExtractorTest)
  testUnsupportedEncoding(org.apache.jackrabbit.extractor.XMLTextExtractorTest)

Tests run: 19, Failures: 0, Errors: 4, Skipped: 0

[INFO] ------------------------------------------------------------------------
[ERROR] BUILD FAILURE
[INFO] ------------------------------------------------------------------------
[INFO] There are test failures.

Please refer to http://hudson.zones.apache.org/hudson/job/Jackrabbit-trunk-java14/ws/trunk/jackrabbit-text-extractors/target/surefire-reports
 for the individual test results.
[INFO] ------------------------------------------------------------------------
[INFO] For more information, run Maven with the -e switch
[INFO] ------------------------------------------------------------------------
[INFO] Total time: 1 minute 40 seconds
[INFO] Finished at: Wed Apr 08 02:02:53 GMT-08:00 2009
[INFO] Final Memory: 37M/88M
[INFO] ------------------------------------------------------------------------
[locks-and-latches] Releasing all the locks
[locks-and-latches] All the locks released
Recording test results


Mime
View raw message