jackrabbit-dev mailing list archives

Site index · List index
Message view « Date » · « Thread »
Top « Date » · « Thread »
From Apache Hudson Server <hud...@hudson.zones.apache.org>
Subject Build failed in Hudson: Jackrabbit-trunk-java14 #162
Date Wed, 08 Apr 2009 10:46:29 GMT
See http://hudson.zones.apache.org/hudson/job/Jackrabbit-trunk-java14/162/changes

Changes:

[jukka] JCR-1878: Use Apache Tika for text extraction

Xerces needs extra XML APIs on Java 1.4. These will be ignored on Java 5 and higher.

------------------------------------------
[...truncated 397 lines...]
File "TokenMgrError.java" does not exist.  Will create one.
File "ParseException.java" does not exist.  Will create one.
File "Token.java" does not exist.  Will create one.
File "SimpleCharStream.java" does not exist.  Will create one.
Parser generated successfully.
[INFO] Processed 1 grammar
[INFO] [javacc:jjtree-javacc {execution: xpath}]
Java Compiler Compiler Version 4.0 (Tree Builder)
(type "jjtree" with no arguments for help)
Reading from file http://hudson.zones.apache.org/hudson/job/Jackrabbit-trunk-java14/ws/trunk/jackrabbit-spi-commons/src/main/javacc/xpath/XPath.jjt
 . . .
File "http://hudson.zones.apache.org/hudson/job/Jackrabbit-trunk-java14/ws/trunk/jackrabbit-spi-commons/target/generated-sources/jjtree/org/apache/jackrabbit/spi/commons/query/xpath/Node.java"
 does not exist.  Will create one.
File "http://hudson.zones.apache.org/hudson/job/Jackrabbit-trunk-java14/ws/trunk/jackrabbit-spi-commons/target/generated-sources/jjtree/org/apache/jackrabbit/spi/commons/query/xpath/SimpleNode.java"
 does not exist.  Will create one.
Annotated grammar generated successfully in http://hudson.zones.apache.org/hudson/job/Jackrabbit-trunk-java14/ws/trunk/jackrabbit-spi-commons/target/generated-sources/jjtree/org/apache/jackrabbit/spi/commons/query/xpath/XPath.jj

Java Compiler Compiler Version 4.0 (Parser Generator)
(type "javacc" with no arguments for help)
Reading from file http://hudson.zones.apache.org/hudson/job/Jackrabbit-trunk-java14/ws/trunk/jackrabbit-spi-commons/target/generated-sources/jjtree/org/apache/jackrabbit/spi/commons/query/xpath/XPath.jj
 . . .
Warning: Line 535, Column 2: Non-ASCII characters used in regular expression.
Please make sure you use the correct Reader when you create the parser that can handle your
character set.
Warning:  "\'" cannot be matched as a string literal token at line 1566, column 2. It will
be matched as  <AposAttrContentChar>.
File "TokenMgrError.java" does not exist.  Will create one.
File "ParseException.java" does not exist.  Will create one.
File "Token.java" does not exist.  Will create one.
File "SimpleCharStream.java" does not exist.  Will create one.
Parser generated with 0 errors and 2 warnings.
[INFO] Processed 1 grammar
[INFO] [antrun:run {execution: delete-sources}]
[INFO] Executing tasks
     [echo] Remove files that have been customized in Jackrabbit
[INFO] Executed tasks
[INFO] [resources:resources]
[WARNING] Using platform encoding (UTF-8 actually) to copy filtered resources, i.e. build
is platform dependent!
[INFO] Copying 3 resources
[INFO] [compiler:compile]
[INFO] Compiling 230 source files to http://hudson.zones.apache.org/hudson/job/Jackrabbit-trunk-java14/ws/trunk/jackrabbit-spi-commons/target/classes

[INFO] [resources:testResources]
[WARNING] Using platform encoding (UTF-8 actually) to copy filtered resources, i.e. build
is platform dependent!
[INFO] Copying 2 resources
[INFO] [compiler:testCompile]
[INFO] Compiling 27 source files to http://hudson.zones.apache.org/hudson/job/Jackrabbit-trunk-java14/ws/trunk/jackrabbit-spi-commons/target/test-classes

[INFO] [surefire:test]
[INFO] Surefire report directory: http://hudson.zones.apache.org/hudson/job/Jackrabbit-trunk-java14/ws/trunk/jackrabbit-spi-commons/target/surefire-reports


-------------------------------------------------------
 T E S T S
-------------------------------------------------------
Running org.apache.jackrabbit.spi.commons.nodetype.BooleanConstraintTest
Tests run: 11, Failures: 0, Errors: 0, Skipped: 0, Time elapsed: 0.128 sec
Running org.apache.jackrabbit.spi.commons.batch.ConsolidatedBatchTest
Tests run: 1, Failures: 0, Errors: 0, Skipped: 0, Time elapsed: 0.034 sec
Running org.apache.jackrabbit.spi.commons.name.MatcherTest
Tests run: 3, Failures: 0, Errors: 0, Skipped: 0, Time elapsed: 0.013 sec
Running org.apache.jackrabbit.spi.commons.nodetype.StringConstraintTest
Tests run: 10, Failures: 0, Errors: 0, Skipped: 0, Time elapsed: 0.008 sec
Running org.apache.jackrabbit.spi.commons.nodetype.NumericConstraintTest
Tests run: 10, Failures: 0, Errors: 0, Skipped: 0, Time elapsed: 0.022 sec
Running org.apache.jackrabbit.spi.commons.conversion.ParsingPathResolverTest
Tests run: 2, Failures: 0, Errors: 0, Skipped: 0, Time elapsed: 0.005 sec
Running org.apache.jackrabbit.spi.commons.nodetype.compact.CompactNodeTypeDefTest
Tests run: 1, Failures: 0, Errors: 0, Skipped: 0, Time elapsed: 0.071 sec
Running org.apache.jackrabbit.spi.commons.value.QValueTest
Tests run: 44, Failures: 0, Errors: 0, Skipped: 0, Time elapsed: 104.237 sec
Running org.apache.jackrabbit.spi.commons.identifier.SerializationTest
Tests run: 2, Failures: 0, Errors: 0, Skipped: 0, Time elapsed: 0.014 sec
Running org.apache.jackrabbit.spi.commons.nodetype.ReferenceConstraintTest
Tests run: 10, Failures: 0, Errors: 0, Skipped: 0, Time elapsed: 0.023 sec
Running org.apache.jackrabbit.spi.commons.name.NameFactoryTest
Tests run: 3, Failures: 0, Errors: 0, Skipped: 0, Time elapsed: 0.006 sec
Running org.apache.jackrabbit.spi.commons.query.xpath.XPathOrderByTest
Tests run: 5, Failures: 0, Errors: 0, Skipped: 0, Time elapsed: 0.115 sec
Running org.apache.jackrabbit.spi.commons.query.xpath.QueryFormatTest
Tests run: 1, Failures: 0, Errors: 0, Skipped: 0, Time elapsed: 0.003 sec
Running org.apache.jackrabbit.spi.commons.name.PathTest
Tests run: 39, Failures: 0, Errors: 0, Skipped: 0, Time elapsed: 0.036 sec
Running org.apache.jackrabbit.spi.commons.conversion.ParsingNameResolverTest
Tests run: 2, Failures: 0, Errors: 0, Skipped: 0, Time elapsed: 0.002 sec
Running org.apache.jackrabbit.spi.commons.name.PathFactoryTest
Tests run: 13, Failures: 0, Errors: 0, Skipped: 0, Time elapsed: 0.007 sec
Running org.apache.jackrabbit.spi.commons.nodetype.PathConstraintTest
Tests run: 10, Failures: 0, Errors: 0, Skipped: 0, Time elapsed: 0.005 sec
Running org.apache.jackrabbit.spi.commons.conversion.PathParserTest
Tests run: 5, Failures: 0, Errors: 0, Skipped: 0, Time elapsed: 0.005 sec
Running org.apache.jackrabbit.spi.commons.nodetype.DateConstraintTest
Tests run: 10, Failures: 0, Errors: 0, Skipped: 0, Time elapsed: 0.014 sec
Running org.apache.jackrabbit.spi.commons.name.PathBuilderTest
Tests run: 2, Failures: 0, Errors: 0, Skipped: 0, Time elapsed: 0.005 sec
Running org.apache.jackrabbit.spi.commons.conversion.NameParserTest
Tests run: 4, Failures: 0, Errors: 0, Skipped: 0, Time elapsed: 0.004 sec
Running org.apache.jackrabbit.spi.commons.nodetype.NameConstraintTest
Tests run: 10, Failures: 0, Errors: 0, Skipped: 0, Time elapsed: 0.004 sec
Running org.apache.jackrabbit.spi.commons.name.PatternTest
Tests run: 13, Failures: 0, Errors: 0, Skipped: 0, Time elapsed: 0.012 sec

Results :

Tests run: 211, Failures: 0, Errors: 0, Skipped: 0

[INFO] [jar:jar]
[INFO] Building jar: http://hudson.zones.apache.org/hudson/job/Jackrabbit-trunk-java14/ws/trunk/jackrabbit-spi-commons/target/jackrabbit-spi-commons-1.6-SNAPSHOT.jar

[INFO] Preparing source:jar
[WARNING] Removing: jar from forked lifecycle, to prevent recursive invocation.
[INFO] [javacc:jjtree-javacc {execution: sql}]
[INFO] Skipping - all parsers are up to date
[INFO] [javacc:jjtree-javacc {execution: xpath}]
[INFO] Skipping - all parsers are up to date
[INFO] [source:jar {execution: attach-sources}]
[INFO] Building jar: http://hudson.zones.apache.org/hudson/job/Jackrabbit-trunk-java14/ws/trunk/jackrabbit-spi-commons/target/jackrabbit-spi-commons-1.6-SNAPSHOT-sources.jar

[INFO] [install:install]
[INFO] Installing http://hudson.zones.apache.org/hudson/job/Jackrabbit-trunk-java14/ws/trunk/jackrabbit-spi-commons/target/jackrabbit-spi-commons-1.6-SNAPSHOT.jar
 to /home/hudson/.m2/repository/org/apache/jackrabbit/jackrabbit-spi-commons/1.6-SNAPSHOT/jackrabbit-spi-commons-1.6-SNAPSHOT.jar
[INFO] Installing http://hudson.zones.apache.org/hudson/job/Jackrabbit-trunk-java14/ws/trunk/jackrabbit-spi-commons/target/jackrabbit-spi-commons-1.6-SNAPSHOT-sources.jar
 to /home/hudson/.m2/repository/org/apache/jackrabbit/jackrabbit-spi-commons/1.6-SNAPSHOT/jackrabbit-spi-commons-1.6-SNAPSHOT-sources.jar
[INFO] [maven-one-plugin:install-maven-one-repository {execution: default}]
[INFO] Installing http://hudson.zones.apache.org/hudson/job/Jackrabbit-trunk-java14/ws/trunk/jackrabbit-spi-commons/target/jackrabbit-spi-commons-1.6-SNAPSHOT.jar
 to /home/hudson/.maven/repository/org.apache.jackrabbit/jars/jackrabbit-spi-commons-1.6-SNAPSHOT.jar
[INFO] Installing http://hudson.zones.apache.org/hudson/job/Jackrabbit-trunk-java14/ws/trunk/jackrabbit-spi-commons/target/jackrabbit-spi-commons-1.6-SNAPSHOT-sources.jar
 to /home/hudson/.maven/repository/org.apache.jackrabbit/java-sources/jackrabbit-spi-commons-1.6-SNAPSHOT-sources.jar
[INFO] ------------------------------------------------------------------------
[INFO] Building Jackrabbit Text Extractors
[INFO]    task-segment: [clean, install]
[INFO] ------------------------------------------------------------------------
[INFO] [clean:clean]
[INFO] Deleting file set: http://hudson.zones.apache.org/hudson/job/Jackrabbit-trunk-java14/ws/trunk/jackrabbit-text-extractors/target
 (included: [**], excluded: [])
[INFO] [resources:resources]
[WARNING] Using platform encoding (UTF-8 actually) to copy filtered resources, i.e. build
is platform dependent!
[INFO] Copying 2 resources
[INFO] [compiler:compile]
[INFO] Compiling 20 source files to http://hudson.zones.apache.org/hudson/job/Jackrabbit-trunk-java14/ws/trunk/jackrabbit-text-extractors/target/classes

[INFO] [resources:testResources]
[WARNING] Using platform encoding (UTF-8 actually) to copy filtered resources, i.e. build
is platform dependent!
[INFO] Copying 2 resources
[INFO] [compiler:testCompile]
[INFO] Compiling 7 source files to http://hudson.zones.apache.org/hudson/job/Jackrabbit-trunk-java14/ws/trunk/jackrabbit-text-extractors/target/test-classes

[INFO] [surefire:test]
[INFO] Surefire report directory: http://hudson.zones.apache.org/hudson/job/Jackrabbit-trunk-java14/ws/trunk/jackrabbit-text-extractors/target/surefire-reports


-------------------------------------------------------
 T E S T S
-------------------------------------------------------
Running org.apache.jackrabbit.extractor.RTFTextExtractorTest
Tests run: 1, Failures: 0, Errors: 0, Skipped: 0, Time elapsed: 0.101 sec
Running org.apache.jackrabbit.extractor.EmptyTextExtractorTest
Tests run: 2, Failures: 0, Errors: 0, Skipped: 0, Time elapsed: 0.007 sec
Running org.apache.jackrabbit.extractor.CompositeTextExtractorTest
Tests run: 4, Failures: 0, Errors: 0, Skipped: 0, Time elapsed: 0.087 sec
Running org.apache.jackrabbit.extractor.PngTextExtractorTest
Tests run: 3, Failures: 0, Errors: 0, Skipped: 0, Time elapsed: 0.006 sec
Running org.apache.jackrabbit.extractor.XMLTextExtractorTest
Tests run: 5, Failures: 0, Errors: 0, Skipped: 0, Time elapsed: 0.158 sec
Running org.apache.jackrabbit.extractor.PlainTextExtractorTest
Tests run: 4, Failures: 0, Errors: 0, Skipped: 0, Time elapsed: 0.007 sec

Results :

Tests run: 19, Failures: 0, Errors: 0, Skipped: 0

[INFO] [jar:jar]
[INFO] Building jar: http://hudson.zones.apache.org/hudson/job/Jackrabbit-trunk-java14/ws/trunk/jackrabbit-text-extractors/target/jackrabbit-text-extractors-1.6-SNAPSHOT.jar

[INFO] Preparing source:jar
[WARNING] Removing: jar from forked lifecycle, to prevent recursive invocation.
[INFO] No goals needed for project - skipping
[INFO] [source:jar {execution: attach-sources}]
[INFO] Building jar: http://hudson.zones.apache.org/hudson/job/Jackrabbit-trunk-java14/ws/trunk/jackrabbit-text-extractors/target/jackrabbit-text-extractors-1.6-SNAPSHOT-sources.jar

[INFO] [install:install]
[INFO] Installing http://hudson.zones.apache.org/hudson/job/Jackrabbit-trunk-java14/ws/trunk/jackrabbit-text-extractors/target/jackrabbit-text-extractors-1.6-SNAPSHOT.jar
 to /home/hudson/.m2/repository/org/apache/jackrabbit/jackrabbit-text-extractors/1.6-SNAPSHOT/jackrabbit-text-extractors-1.6-SNAPSHOT.jar
[INFO] Installing http://hudson.zones.apache.org/hudson/job/Jackrabbit-trunk-java14/ws/trunk/jackrabbit-text-extractors/target/jackrabbit-text-extractors-1.6-SNAPSHOT-sources.jar
 to /home/hudson/.m2/repository/org/apache/jackrabbit/jackrabbit-text-extractors/1.6-SNAPSHOT/jackrabbit-text-extractors-1.6-SNAPSHOT-sources.jar
[INFO] [maven-one-plugin:install-maven-one-repository {execution: default}]
[INFO] Installing http://hudson.zones.apache.org/hudson/job/Jackrabbit-trunk-java14/ws/trunk/jackrabbit-text-extractors/target/jackrabbit-text-extractors-1.6-SNAPSHOT.jar
 to /home/hudson/.maven/repository/org.apache.jackrabbit/jars/jackrabbit-text-extractors-1.6-SNAPSHOT.jar
[INFO] Installing http://hudson.zones.apache.org/hudson/job/Jackrabbit-trunk-java14/ws/trunk/jackrabbit-text-extractors/target/jackrabbit-text-extractors-1.6-SNAPSHOT-sources.jar
 to /home/hudson/.maven/repository/org.apache.jackrabbit/java-sources/jackrabbit-text-extractors-1.6-SNAPSHOT-sources.jar
[INFO] ------------------------------------------------------------------------
[INFO] Building Jackrabbit Core
[INFO]    task-segment: [clean, install]
[INFO] ------------------------------------------------------------------------
[INFO] [clean:clean]
[INFO] Deleting file set: http://hudson.zones.apache.org/hudson/job/Jackrabbit-trunk-java14/ws/trunk/jackrabbit-core/target
 (included: [**], excluded: [])
[INFO] [resources:resources]
[WARNING] File encoding has not been set, using platform encoding UTF-8, i.e. build is platform
dependent!
[WARNING] Using platform encoding (UTF-8 actually) to copy filtered resources, i.e. build
is platform dependent!
[INFO] Copying 55 resources
[INFO] Copying 1 resource
[INFO] [compiler:compile]
[INFO] Compiling 614 source files to http://hudson.zones.apache.org/hudson/job/Jackrabbit-trunk-java14/ws/trunk/jackrabbit-core/target/classes

[INFO] [resources:testResources]
[WARNING] Using platform encoding (UTF-8 actually) to copy filtered resources, i.e. build
is platform dependent!
[INFO] Copying 11 resources
[INFO] [antrun:run {execution: process-test-resources}]
[INFO] Executing tasks
     [copy] Copying 35 files to http://hudson.zones.apache.org/hudson/job/Jackrabbit-trunk-java14/ws/trunk/jackrabbit-core/target/repository

[INFO] Executed tasks
[INFO] [compiler:testCompile]
[INFO] Compiling 273 source files to http://hudson.zones.apache.org/hudson/job/Jackrabbit-trunk-java14/ws/trunk/jackrabbit-core/target/test-classes

[INFO] [surefire:test]
[INFO] Surefire report directory: http://hudson.zones.apache.org/hudson/job/Jackrabbit-trunk-java14/ws/trunk/jackrabbit-core/target/surefire-reports


-------------------------------------------------------
 T E S T S
-------------------------------------------------------
Running org.apache.jackrabbit.core.query.qom.TestAll
Tests run: 157, Failures: 0, Errors: 157, Skipped: 0, Time elapsed: 30.441 sec <<<
FAILURE!
Running org.apache.jackrabbit.core.version.TestAll
Tests run: 5, Failures: 0, Errors: 3, Skipped: 0, Time elapsed: 1.846 sec <<< FAILURE!
Running org.apache.jackrabbit.core.security.authorization.principalbased.TestAll
Tests run: 77, Failures: 0, Errors: 75, Skipped: 0, Time elapsed: 11.741 sec <<<
FAILURE!
Running org.apache.jackrabbit.api.jsr283.TestAll
Tests run: 8, Failures: 0, Errors: 8, Skipped: 0, Time elapsed: 1.181 sec <<< FAILURE!
Running org.apache.jackrabbit.core.security.authorization.acl.TestAll
Tests run: 72, Failures: 0, Errors: 72, Skipped: 0, Time elapsed: 10.693 sec <<<
FAILURE!
Running org.apache.jackrabbit.core.config.TestAll
Tests run: 10, Failures: 0, Errors: 0, Skipped: 0, Time elapsed: 0.07 sec
Running org.apache.jackrabbit.core.query.lucene.directory.TestAll
org.apache.maven.surefire.booter.SurefireExecutionException: org.apache.jackrabbit.core.query.lucene.directory.TestAll;
nested exception is java.lang.NoClassDefFoundError: null; nested exception is org.apache.maven.surefire.testset.TestSetFailedException:
org.apache.jackrabbit.core.query.lucene.directory.TestAll; nested exception is java.lang.NoClassDefFoundError:
null
org.apache.maven.surefire.testset.TestSetFailedException: org.apache.jackrabbit.core.query.lucene.directory.TestAll;
nested exception is java.lang.NoClassDefFoundError: null
java.lang.NoClassDefFoundError
	at java.lang.Class.forName0(Native Method)
	at java.lang.Class.forName(Class.java:141)
	at org.apache.jackrabbit.core.query.lucene.SearchIndex.class$(SearchIndex.java:118)
	at org.apache.jackrabbit.core.query.lucene.SearchIndex.<init>(SearchIndex.java:209)
	at org.apache.jackrabbit.core.query.lucene.directory.DirectoryManagerTest.<clinit>(DirectoryManagerTest.java:38)
	at java.lang.Class.forName0(Native Method)
	at java.lang.Class.forName(Class.java:141)
	at org.apache.jackrabbit.core.query.lucene.directory.TestAll.class$(TestAll.java:38)
	at org.apache.jackrabbit.core.query.lucene.directory.TestAll.suite(TestAll.java:40)
	at sun.reflect.NativeMethodAccessorImpl.invoke0(Native Method)
	at sun.reflect.NativeMethodAccessorImpl.invoke(NativeMethodAccessorImpl.java:39)
	at sun.reflect.DelegatingMethodAccessorImpl.invoke(DelegatingMethodAccessorImpl.java:25)
	at java.lang.reflect.Method.invoke(Method.java:324)
	at org.apache.maven.surefire.junit.JUnitTestSet.createInstanceFromSuiteMethod(JUnitTestSet.java:180)
	at org.apache.maven.surefire.junit.JUnitTestSet.constructTestObject(JUnitTestSet.java:140)
	at org.apache.maven.surefire.junit.JUnitTestSet.execute(JUnitTestSet.java:197)
	at org.apache.maven.surefire.suite.AbstractDirectoryTestSuite.executeTestSet(AbstractDirectoryTestSuite.java:140)
	at org.apache.maven.surefire.suite.AbstractDirectoryTestSuite.execute(AbstractDirectoryTestSuite.java:127)
	at org.apache.maven.surefire.Surefire.run(Surefire.java:177)
	at sun.reflect.NativeMethodAccessorImpl.invoke0(Native Method)
	at sun.reflect.NativeMethodAccessorImpl.invoke(NativeMethodAccessorImpl.java:39)
	at sun.reflect.DelegatingMethodAccessorImpl.invoke(DelegatingMethodAccessorImpl.java:25)
	at java.lang.reflect.Method.invoke(Method.java:324)
	at org.apache.maven.surefire.booter.SurefireBooter.runSuitesInProcess(SurefireBooter.java:345)
	at org.apache.maven.surefire.booter.SurefireBooter.main(SurefireBooter.java:1009)
[INFO] ------------------------------------------------------------------------
[ERROR] BUILD FAILURE
[INFO] ------------------------------------------------------------------------
[INFO] There are test failures.

Please refer to http://hudson.zones.apache.org/hudson/job/Jackrabbit-trunk-java14/ws/trunk/jackrabbit-core/target/surefire-reports
 for the individual test results.
[INFO] ------------------------------------------------------------------------
[INFO] For more information, run Maven with the -e switch
[INFO] ------------------------------------------------------------------------
[INFO] Total time: 3 minutes 27 seconds
[INFO] Finished at: Wed Apr 08 03:02:10 GMT-08:00 2009
[INFO] Final Memory: 41M/109M
[INFO] ------------------------------------------------------------------------
[locks-and-latches] Releasing all the locks
[locks-and-latches] All the locks released
Recording test results


Mime
View raw message