jackrabbit-dev mailing list archives

Site index · List index
Message view « Date » · « Thread »
Top « Date » · « Thread »
From Apache Hudson Server <hud...@hudson.zones.apache.org>
Subject Build failed in Hudson: Jackrabbit-trunk-java14 #178
Date Wed, 29 Apr 2009 17:44:05 GMT
See http://hudson.zones.apache.org/hudson/job/Jackrabbit-trunk-java14/178/changes

Changes:

[reschke] JCR-2086: implement getDate() as stub

[reschke] JCR-1609: add missing methods to new property types to o.a.j.api.jsr283.Node, add
method stubs in -core.

[reschke] JCR-2061: add missing methods to o.a.j.api.jsr283.Node, add method stubs in -core.

------------------------------------------
[...truncated 402 lines...]
[INFO] [compiler:testCompile]
[INFO] Compiling 27 source files to http://hudson.zones.apache.org/hudson/job/Jackrabbit-trunk-java14/ws/trunk/jackrabbit-spi-commons/target/test-classes

[INFO] [surefire:test]
[INFO] Surefire report directory: http://hudson.zones.apache.org/hudson/job/Jackrabbit-trunk-java14/ws/trunk/jackrabbit-spi-commons/target/surefire-reports


-------------------------------------------------------
 T E S T S
-------------------------------------------------------
Running org.apache.jackrabbit.spi.commons.nodetype.BooleanConstraintTest
Tests run: 11, Failures: 0, Errors: 0, Skipped: 0, Time elapsed: 0.126 sec
Running org.apache.jackrabbit.spi.commons.batch.ConsolidatedBatchTest
Tests run: 1, Failures: 0, Errors: 0, Skipped: 0, Time elapsed: 0.033 sec
Running org.apache.jackrabbit.spi.commons.name.MatcherTest
Tests run: 3, Failures: 0, Errors: 0, Skipped: 0, Time elapsed: 0.012 sec
Running org.apache.jackrabbit.spi.commons.nodetype.StringConstraintTest
Tests run: 10, Failures: 0, Errors: 0, Skipped: 0, Time elapsed: 0.008 sec
Running org.apache.jackrabbit.spi.commons.nodetype.NumericConstraintTest
Tests run: 10, Failures: 0, Errors: 0, Skipped: 0, Time elapsed: 0.02 sec
Running org.apache.jackrabbit.spi.commons.conversion.ParsingPathResolverTest
Tests run: 2, Failures: 0, Errors: 0, Skipped: 0, Time elapsed: 0.004 sec
Running org.apache.jackrabbit.spi.commons.nodetype.compact.CompactNodeTypeDefTest
Tests run: 1, Failures: 0, Errors: 0, Skipped: 0, Time elapsed: 0.068 sec
Running org.apache.jackrabbit.spi.commons.value.QValueTest
Tests run: 44, Failures: 0, Errors: 0, Skipped: 0, Time elapsed: 8.519 sec
Running org.apache.jackrabbit.spi.commons.identifier.SerializationTest
Tests run: 2, Failures: 0, Errors: 0, Skipped: 0, Time elapsed: 0.014 sec
Running org.apache.jackrabbit.spi.commons.nodetype.ReferenceConstraintTest
Tests run: 10, Failures: 0, Errors: 0, Skipped: 0, Time elapsed: 0.005 sec
Running org.apache.jackrabbit.spi.commons.name.NameFactoryTest
Tests run: 3, Failures: 0, Errors: 0, Skipped: 0, Time elapsed: 0.005 sec
Running org.apache.jackrabbit.spi.commons.query.xpath.XPathOrderByTest
Tests run: 5, Failures: 0, Errors: 0, Skipped: 0, Time elapsed: 0.115 sec
Running org.apache.jackrabbit.spi.commons.query.xpath.QueryFormatTest
Tests run: 1, Failures: 0, Errors: 0, Skipped: 0, Time elapsed: 0.022 sec
Running org.apache.jackrabbit.spi.commons.name.PathTest
Tests run: 39, Failures: 0, Errors: 0, Skipped: 0, Time elapsed: 0.038 sec
Running org.apache.jackrabbit.spi.commons.conversion.ParsingNameResolverTest
Tests run: 2, Failures: 0, Errors: 0, Skipped: 0, Time elapsed: 0.002 sec
Running org.apache.jackrabbit.spi.commons.name.PathFactoryTest
Tests run: 13, Failures: 0, Errors: 0, Skipped: 0, Time elapsed: 0.008 sec
Running org.apache.jackrabbit.spi.commons.nodetype.PathConstraintTest
Tests run: 10, Failures: 0, Errors: 0, Skipped: 0, Time elapsed: 0.005 sec
Running org.apache.jackrabbit.spi.commons.conversion.PathParserTest
Tests run: 5, Failures: 0, Errors: 0, Skipped: 0, Time elapsed: 0.006 sec
Running org.apache.jackrabbit.spi.commons.nodetype.DateConstraintTest
Tests run: 10, Failures: 0, Errors: 0, Skipped: 0, Time elapsed: 0.014 sec
Running org.apache.jackrabbit.spi.commons.name.PathBuilderTest
Tests run: 2, Failures: 0, Errors: 0, Skipped: 0, Time elapsed: 0.005 sec
Running org.apache.jackrabbit.spi.commons.conversion.NameParserTest
Tests run: 4, Failures: 0, Errors: 0, Skipped: 0, Time elapsed: 0.005 sec
Running org.apache.jackrabbit.spi.commons.nodetype.NameConstraintTest
Tests run: 10, Failures: 0, Errors: 0, Skipped: 0, Time elapsed: 0.003 sec
Running org.apache.jackrabbit.spi.commons.name.PatternTest
Tests run: 13, Failures: 0, Errors: 0, Skipped: 0, Time elapsed: 0.012 sec

Results :

Tests run: 211, Failures: 0, Errors: 0, Skipped: 0

[INFO] [jar:jar]
[INFO] Building jar: http://hudson.zones.apache.org/hudson/job/Jackrabbit-trunk-java14/ws/trunk/jackrabbit-spi-commons/target/jackrabbit-spi-commons-1.6-SNAPSHOT.jar

[INFO] Preparing source:jar
[WARNING] Removing: jar from forked lifecycle, to prevent recursive invocation.
[INFO] [javacc:jjtree-javacc {execution: sql}]
[INFO] Skipping - all parsers are up to date
[INFO] [javacc:jjtree-javacc {execution: xpath}]
[INFO] Skipping - all parsers are up to date
[INFO] [source:jar {execution: attach-sources}]
[INFO] Building jar: http://hudson.zones.apache.org/hudson/job/Jackrabbit-trunk-java14/ws/trunk/jackrabbit-spi-commons/target/jackrabbit-spi-commons-1.6-SNAPSHOT-sources.jar

[INFO] [install:install]
[INFO] Installing http://hudson.zones.apache.org/hudson/job/Jackrabbit-trunk-java14/ws/trunk/jackrabbit-spi-commons/target/jackrabbit-spi-commons-1.6-SNAPSHOT.jar
 to /home/hudson/.m2/repository/org/apache/jackrabbit/jackrabbit-spi-commons/1.6-SNAPSHOT/jackrabbit-spi-commons-1.6-SNAPSHOT.jar
[INFO] Installing http://hudson.zones.apache.org/hudson/job/Jackrabbit-trunk-java14/ws/trunk/jackrabbit-spi-commons/target/jackrabbit-spi-commons-1.6-SNAPSHOT-sources.jar
 to /home/hudson/.m2/repository/org/apache/jackrabbit/jackrabbit-spi-commons/1.6-SNAPSHOT/jackrabbit-spi-commons-1.6-SNAPSHOT-sources.jar
[INFO] [maven-one-plugin:install-maven-one-repository {execution: default}]
[INFO] Installing http://hudson.zones.apache.org/hudson/job/Jackrabbit-trunk-java14/ws/trunk/jackrabbit-spi-commons/target/jackrabbit-spi-commons-1.6-SNAPSHOT.jar
 to /home/hudson/.maven/repository/org.apache.jackrabbit/jars/jackrabbit-spi-commons-1.6-SNAPSHOT.jar
[INFO] Installing http://hudson.zones.apache.org/hudson/job/Jackrabbit-trunk-java14/ws/trunk/jackrabbit-spi-commons/target/jackrabbit-spi-commons-1.6-SNAPSHOT-sources.jar
 to /home/hudson/.maven/repository/org.apache.jackrabbit/java-sources/jackrabbit-spi-commons-1.6-SNAPSHOT-sources.jar
[INFO] ------------------------------------------------------------------------
[INFO] Building Jackrabbit Text Extractors
[INFO]    task-segment: [clean, install]
[INFO] ------------------------------------------------------------------------
[INFO] [clean:clean]
[INFO] Deleting file set: http://hudson.zones.apache.org/hudson/job/Jackrabbit-trunk-java14/ws/trunk/jackrabbit-text-extractors/target
 (included: [**], excluded: [])
[INFO] [resources:resources]
[WARNING] Using platform encoding (UTF-8 actually) to copy filtered resources, i.e. build
is platform dependent!
[INFO] Copying 3 resources
[INFO] [compiler:compile]
[INFO] Compiling 20 source files to http://hudson.zones.apache.org/hudson/job/Jackrabbit-trunk-java14/ws/trunk/jackrabbit-text-extractors/target/classes

[INFO] [resources:testResources]
[WARNING] Using platform encoding (UTF-8 actually) to copy filtered resources, i.e. build
is platform dependent!
[INFO] Copying 2 resources
[INFO] [compiler:testCompile]
[INFO] Compiling 7 source files to http://hudson.zones.apache.org/hudson/job/Jackrabbit-trunk-java14/ws/trunk/jackrabbit-text-extractors/target/test-classes

[INFO] [surefire:test]
[INFO] Surefire report directory: http://hudson.zones.apache.org/hudson/job/Jackrabbit-trunk-java14/ws/trunk/jackrabbit-text-extractors/target/surefire-reports


-------------------------------------------------------
 T E S T S
-------------------------------------------------------
Running org.apache.jackrabbit.extractor.RTFTextExtractorTest
Tests run: 1, Failures: 0, Errors: 0, Skipped: 0, Time elapsed: 0.115 sec
Running org.apache.jackrabbit.extractor.EmptyTextExtractorTest
Tests run: 2, Failures: 0, Errors: 0, Skipped: 0, Time elapsed: 0.008 sec
Running org.apache.jackrabbit.extractor.CompositeTextExtractorTest
Tests run: 4, Failures: 0, Errors: 0, Skipped: 0, Time elapsed: 0.089 sec
Running org.apache.jackrabbit.extractor.PngTextExtractorTest
Tests run: 3, Failures: 0, Errors: 0, Skipped: 0, Time elapsed: 0.006 sec
Running org.apache.jackrabbit.extractor.XMLTextExtractorTest
Tests run: 5, Failures: 0, Errors: 0, Skipped: 0, Time elapsed: 0.16 sec
Running org.apache.jackrabbit.extractor.PlainTextExtractorTest
Tests run: 4, Failures: 0, Errors: 0, Skipped: 0, Time elapsed: 0.008 sec

Results :

Tests run: 19, Failures: 0, Errors: 0, Skipped: 0

[INFO] [jar:jar]
[INFO] Building jar: http://hudson.zones.apache.org/hudson/job/Jackrabbit-trunk-java14/ws/trunk/jackrabbit-text-extractors/target/jackrabbit-text-extractors-1.6-SNAPSHOT.jar

[INFO] Preparing source:jar
[WARNING] Removing: jar from forked lifecycle, to prevent recursive invocation.
[INFO] No goals needed for project - skipping
[INFO] [source:jar {execution: attach-sources}]
[INFO] Building jar: http://hudson.zones.apache.org/hudson/job/Jackrabbit-trunk-java14/ws/trunk/jackrabbit-text-extractors/target/jackrabbit-text-extractors-1.6-SNAPSHOT-sources.jar

[INFO] [install:install]
[INFO] Installing http://hudson.zones.apache.org/hudson/job/Jackrabbit-trunk-java14/ws/trunk/jackrabbit-text-extractors/target/jackrabbit-text-extractors-1.6-SNAPSHOT.jar
 to /home/hudson/.m2/repository/org/apache/jackrabbit/jackrabbit-text-extractors/1.6-SNAPSHOT/jackrabbit-text-extractors-1.6-SNAPSHOT.jar
[INFO] Installing http://hudson.zones.apache.org/hudson/job/Jackrabbit-trunk-java14/ws/trunk/jackrabbit-text-extractors/target/jackrabbit-text-extractors-1.6-SNAPSHOT-sources.jar
 to /home/hudson/.m2/repository/org/apache/jackrabbit/jackrabbit-text-extractors/1.6-SNAPSHOT/jackrabbit-text-extractors-1.6-SNAPSHOT-sources.jar
[INFO] [maven-one-plugin:install-maven-one-repository {execution: default}]
[INFO] Installing http://hudson.zones.apache.org/hudson/job/Jackrabbit-trunk-java14/ws/trunk/jackrabbit-text-extractors/target/jackrabbit-text-extractors-1.6-SNAPSHOT.jar
 to /home/hudson/.maven/repository/org.apache.jackrabbit/jars/jackrabbit-text-extractors-1.6-SNAPSHOT.jar
[INFO] Installing http://hudson.zones.apache.org/hudson/job/Jackrabbit-trunk-java14/ws/trunk/jackrabbit-text-extractors/target/jackrabbit-text-extractors-1.6-SNAPSHOT-sources.jar
 to /home/hudson/.maven/repository/org.apache.jackrabbit/java-sources/jackrabbit-text-extractors-1.6-SNAPSHOT-sources.jar
[INFO] ------------------------------------------------------------------------
[INFO] Building Jackrabbit Core
[INFO]    task-segment: [clean, install]
[INFO] ------------------------------------------------------------------------
[INFO] [clean:clean]
[INFO] Deleting file set: http://hudson.zones.apache.org/hudson/job/Jackrabbit-trunk-java14/ws/trunk/jackrabbit-core/target
 (included: [**], excluded: [])
[INFO] [resources:resources]
[WARNING] File encoding has not been set, using platform encoding UTF-8, i.e. build is platform
dependent!
[WARNING] Using platform encoding (UTF-8 actually) to copy filtered resources, i.e. build
is platform dependent!
[INFO] Copying 54 resources
[INFO] Copying 1 resource
[INFO] [compiler:compile]
[INFO] Compiling 659 source files to http://hudson.zones.apache.org/hudson/job/Jackrabbit-trunk-java14/ws/trunk/jackrabbit-core/target/classes

[INFO] [resources:testResources]
[WARNING] Using platform encoding (UTF-8 actually) to copy filtered resources, i.e. build
is platform dependent!
[INFO] Copying 11 resources
[INFO] [antrun:run {execution: process-test-resources}]
[INFO] Executing tasks
     [copy] Copying 35 files to http://hudson.zones.apache.org/hudson/job/Jackrabbit-trunk-java14/ws/trunk/jackrabbit-core/target/repository

[INFO] Executed tasks
[INFO] [compiler:testCompile]
[INFO] Compiling 299 source files to http://hudson.zones.apache.org/hudson/job/Jackrabbit-trunk-java14/ws/trunk/jackrabbit-core/target/test-classes

[INFO] [surefire:test]
[INFO] Surefire report directory: http://hudson.zones.apache.org/hudson/job/Jackrabbit-trunk-java14/ws/trunk/jackrabbit-core/target/surefire-reports


-------------------------------------------------------
 T E S T S
-------------------------------------------------------
Running org.apache.jackrabbit.core.version.TestAll
Tests run: 5, Failures: 0, Errors: 0, Skipped: 0, Time elapsed: 6.116 sec
Running org.apache.jackrabbit.core.security.authorization.principalbased.TestAll
Tests run: 77, Failures: 0, Errors: 0, Skipped: 0, Time elapsed: 0.305 sec
Running org.apache.jackrabbit.api.jsr283.TestAll
Tests run: 10, Failures: 0, Errors: 0, Skipped: 0, Time elapsed: 0.264 sec
Running org.apache.jackrabbit.core.security.authorization.acl.TestAll
Tests run: 72, Failures: 0, Errors: 0, Skipped: 0, Time elapsed: 0.135 sec
Running org.apache.jackrabbit.core.config.TestAll
Tests run: 10, Failures: 0, Errors: 0, Skipped: 0, Time elapsed: 0.118 sec
Running org.apache.jackrabbit.core.query.lucene.directory.TestAll
Tests run: 6, Failures: 0, Errors: 0, Skipped: 0, Time elapsed: 0.018 sec
Running org.apache.jackrabbit.core.security.authentication.TestAll
Tests run: 2, Failures: 0, Errors: 0, Skipped: 0, Time elapsed: 0.008 sec
Running org.apache.jackrabbit.core.security.user.TestAll
Tests run: 94, Failures: 0, Errors: 0, Skipped: 0, Time elapsed: 0.457 sec
Running org.apache.jackrabbit.api.jsr283.retention.TestAll
Tests run: 50, Failures: 0, Errors: 0, Skipped: 0, Time elapsed: 1.049 sec
Running org.apache.jackrabbit.core.journal.TestAll
Tests run: 3, Failures: 0, Errors: 0, Skipped: 0, Time elapsed: 0.023 sec
Running org.apache.jackrabbit.api.jsr283.query.qom.TestAll
Tests run: 174, Failures: 0, Errors: 0, Skipped: 0, Time elapsed: 1.977 sec
Running org.apache.jackrabbit.api.security.principal.TestAll
Tests run: 16, Failures: 0, Errors: 0, Skipped: 0, Time elapsed: 0.022 sec
Running org.apache.jackrabbit.core.state.TestAll
Tests run: 15, Failures: 0, Errors: 0, Skipped: 0, Time elapsed: 3.229 sec
Running org.apache.jackrabbit.core.lock.TestAll
Tests run: 1, Failures: 0, Errors: 0, Skipped: 0, Time elapsed: 0.262 sec
Running org.apache.jackrabbit.core.security.TestAll
Tests run: 12, Failures: 0, Errors: 0, Skipped: 0, Time elapsed: 0.02 sec
Running org.apache.jackrabbit.api.jsr283.lock.TestAll
Tests run: 76, Failures: 0, Errors: 0, Skipped: 0, Time elapsed: 1.779 sec
Running org.apache.jackrabbit.core.security.principal.TestAll
Tests run: 2, Failures: 0, Errors: 0, Skipped: 0, Time elapsed: 0.006 sec
Running org.apache.jackrabbit.core.util.TestAll
Tests run: 3, Failures: 0, Errors: 0, Skipped: 0, Time elapsed: 0.375 sec
Running org.apache.jackrabbit.api.jsr283.observation.TestAll
Tests run: 30, Failures: 0, Errors: 0, Skipped: 0, Time elapsed: 10.915 sec
Running org.apache.jackrabbit.api.security.user.TestAll
Tests run: 81, Failures: 0, Errors: 0, Skipped: 0, Time elapsed: 0.237 sec
Running org.apache.jackrabbit.core.cluster.TestAll
Tests run: 9, Failures: 0, Errors: 0, Skipped: 0, Time elapsed: 0.021 sec
Running org.apache.jackrabbit.core.nodetype.xml.TestAll
Tests run: 34, Failures: 0, Errors: 0, Skipped: 0, Time elapsed: 0.241 sec
Running org.apache.jackrabbit.core.TestAll
Tests run: 102, Failures: 0, Errors: 0, Skipped: 0, Time elapsed: 5.297 sec
Running org.apache.jackrabbit.core.security.authorization.combined.TestAll
Tests run: 28, Failures: 0, Errors: 0, Skipped: 0, Time elapsed: 0.04 sec
Running org.apache.jackrabbit.core.xml.TestAll
Tests run: 2, Failures: 0, Errors: 0, Skipped: 0, Time elapsed: 0.014 sec
Running org.apache.jackrabbit.core.observation.TestAll
Tests run: 14, Failures: 0, Errors: 0, Skipped: 0, Time elapsed: 0.362 sec
Running org.apache.jackrabbit.core.retention.TestAll
Tests run: 5, Failures: 0, Errors: 0, Skipped: 0, Time elapsed: 0.166 sec
Running org.apache.jackrabbit.api.jsr283.security.TestAll
Tests run: 78, Failures: 0, Errors: 0, Skipped: 0, Time elapsed: 0.408 sec
Running org.apache.jackrabbit.core.nodetype.TestAll
Tests run: 1, Failures: 0, Errors: 0, Skipped: 0, Time elapsed: 0.181 sec
Running org.apache.jackrabbit.core.nodetype.compact.TestAll
Tests run: 2, Failures: 0, Errors: 0, Skipped: 0, Time elapsed: 0.007 sec
Running org.apache.jackrabbit.core.query.lucene.TestAll
Tests run: 2, Failures: 0, Errors: 0, Skipped: 0, Time elapsed: 8.913 sec
Running org.apache.jackrabbit.core.query.TestAll
Tests run: 146, Failures: 1, Errors: 0, Skipped: 0, Time elapsed: 13.796 sec <<<
FAILURE!
Running org.apache.jackrabbit.core.security.authorization.TestAll
Tests run: 24, Failures: 0, Errors: 0, Skipped: 0, Time elapsed: 0.087 sec
Running org.apache.jackrabbit.core.data.TestAll
Tests run: 18, Failures: 0, Errors: 0, Skipped: 0, Time elapsed: 14.307 sec
Running org.apache.jackrabbit.api.jsr283.version.simple.TestAll
Tests run: 19, Failures: 0, Errors: 0, Skipped: 0, Time elapsed: 0.72 sec

Results :

Failed tests: 
  testNtFileAggregate(org.apache.jackrabbit.core.query.IndexingAggregateTest)

Tests run: 1223, Failures: 1, Errors: 0, Skipped: 0

[INFO] ------------------------------------------------------------------------
[ERROR] BUILD FAILURE
[INFO] ------------------------------------------------------------------------
[INFO] There are test failures.

Please refer to http://hudson.zones.apache.org/hudson/job/Jackrabbit-trunk-java14/ws/trunk/jackrabbit-core/target/surefire-reports
 for the individual test results.
[INFO] ------------------------------------------------------------------------
[INFO] For more information, run Maven with the -e switch
[INFO] ------------------------------------------------------------------------
[INFO] Total time: 2 minutes 3 seconds
[INFO] Finished at: Wed Apr 29 10:02:36 GMT-08:00 2009
[INFO] Final Memory: 41M/117M
[INFO] ------------------------------------------------------------------------
[locks-and-latches] Releasing all the locks
[locks-and-latches] All the locks released
Recording test results


Mime
View raw message